{"text_format":"2","workbook":"xlsx","n_sheets":20,"sheets":["PFP","PFP1.1Serv Graficos","PFP1.2_Equi_div","PFP1.3_Ger","PFP1.4_Ensaios_Solo_Concreto","PFP2.1_FatorKa","PFP2.2_FatorKb","PFP2.3_FatorKc","PFP3_FatorKd","Cronograma Físico-Financeiro","CPU-VEICULO_PickUp","CPU-VEICULO_Leve","CPU HOSPEDAGEM","CPU ESCRIT. CONTAINER","MDO -  DNIT","C.G - DNIT","Cotação Voos","AUX - MOBILIÁRIO","AUX - NOTEBOOK","AUX - IMPRESSORA"],"not_rendered":{"charts":0,"images":63,"macros":0,"external_links":336,"defined_names":35395,"comments":3,"pivot_tables":0},"unopened":[],"bounds":{"document_bytes":16777216,"sheet_cells":100000,"run_cost":"one","rows_first":2000,"rows_last":500,"rows_between":2000,"halvings":0,"cell_chars":16384,"cell_head_chars":4096},"cells_cut":0,"cells_raw":0,"read":"whole","date_system":"1900"}

{"sheet":"PFP","index":0,"n_rows":39,"n_cols":19,"rows_kept":39,"cut":false,"hidden":false,"merged":[[18,7,18,10],[18,0,18,5],[25,0,25,10],[19,0,19,5],[19,7,19,10],[22,0,22,10],[21,0,21,10],[33,0,33,10],[26,0,26,10],[28,0,28,10],[20,0,20,10],[27,0,27,10],[23,0,23,10],[29,0,29,10],[30,0,30,10],[31,0,31,10],[32,0,32,10],[24,0,24,10],[0,0,1,8],[4,5,4,8],[0,9,0,10],[1,9,1,10],[4,9,4,10],[2,0,2,10],[3,0,3,10],[4,0,4,4],[5,9,5,10],[5,5,5,8],[17,0,17,5],[17,7,17,10],[5,0,5,4],[16,0,16,5],[16,7,16,10]]}
["PROPOSTA FINANCEIRA DO PROJETO",{"$nulls":8},"CODIGO:"]
[{"$nulls":9},"PFP"]
["NOME DA CONSULTORA:"]
[]
["PROJETO:",{"$nulls":4},"CONTRATANTE:",null,null,null,"BASE:"]
["CONTRATAÇÃO DOS SERVIÇOS DE APOIO À FISCALIZAÇÃO PARA EXECUÇÃO DAS OBRAS DE ENGENHARIA, VISANDO A IMPLANTAÇÃO DE PONTE EM CONCRETO ARMADO SOBRE O RIO MELCHIOR, NA REGIÃO ADMINISTRATIVA DA CEILÂNDIA, DISTRITO FEDERAL.",{"$nulls":4},"CODEVASF (SEDE)",null,null,null,"SICRO JAN/2025; SINAPI MAIO/2025; EMBASA JAN/2025; ORSE ABR/2025; SUDECAP JAN/2025.                            DATA-BASE ORÇAMENTO: JUN/2025"]
["Base","Cod2","Código","Categoria / Insumo","Uni","Qde","CUD","PU","FatorK","CT","PT","Encargos COMP E ADICIONAIS","SOCIAIS","TOTAIS",null,"Encargos Comp e Adicionais"]
["SICRO","MO1","P8065","Engenheiro Júnior","mês",8,{"$f":"VLOOKUP(C8,'MDO -  DNIT'!$A:$Z,4,0)","v":12903},{"$f":"G8*I8","v":27666.6126},{"$f":"'PFP2.1_FatorKa'!$E$36","v":2.1442000000000001},{"$f":"G8*F8","v":103224},{"$f":"ROUND(J8*I8,2)","v":221332.9},{"$nulls":4},{"$f":"VLOOKUP(C8,'MDO -  DNIT'!$A:$Z,26,0)","v":1087.2199999999993},null,null,40]
{"$rows_left_out":32}
{"sheet":"PFP1.1Serv Graficos","index":1,"n_rows":42,"n_cols":9,"rows_kept":42,"cut":false,"hidden":true,"merged":[[27,0,27,3],[2,0,2,4],[14,0,14,4],[19,0,19,3],[21,1,21,2],[22,0,22,4],[37,0,37,4],[38,0,38,4],[39,0,39,4],[40,0,40,4],[41,0,41,4]]}
[]
[]
["Serviços Gráficos"]
[]
["Serviço",null,"Referencia","Código","Valor",null,null,"1 Vol Impressão Rel Final"]
["Impressão colorida",null,"SETOP/COMPOSIÇÃO","CO-2019",2,null,"Preto",{"$f":"C17*E7","v":0}]
["Impressão preta",null,"SETOP/COMPOSIÇÃO","CO-2017",0.33,null,"Colorida",{"$f":"D17*E6","v":0}]
["Encadernação até 350 fls.",null,"EMBASA/COMPOSIÇÃO","30.02.30 / 30.02.27",{"$f":"20+7.2","v":27.2},"Foi considerado a soma de 2 composições, com encadernação de 250 e 100 folhas","Encader",{"$f":"E8","v":27.2}]
{"$rows_left_out":35}
{"sheet":"PFP1.2_Equi_div","index":2,"n_rows":11,"n_cols":7,"rows_kept":11,"cut":false,"hidden":false,"merged":[[10,0,10,5],[0,0,1,5],[2,0,2,6],[3,0,3,6],[4,0,4,3],[4,4,4,5],[5,0,5,3],[5,4,5,5]]}
["RECURSOS GERAIS",{"$nulls":5},"CODIGO:"]
[{"$nulls":6},"PFP1.2"]
["NOME DA EMPRESA:"]
[]
["PROJETO: ",null,null,null,"CONTRATANTE:",null,{"$f":"PFP!J5","v":"BASE:"}]
[{"$f":"PFP!A6","v":"CONTRATAÇÃO DOS SERVIÇOS DE APOIO À FISCALIZAÇÃO PARA EXECUÇÃO DAS OBRAS DE ENGENHARIA, VISANDO A IMPLANTAÇÃO DE PONTE EM CONCRETO ARMADO SOBRE O RIO MELCHIOR, NA REGIÃO ADMINISTRATIVA DA CEILÂNDIA, DISTRITO FEDERAL."},null,null,null,"CODEVASF (SEDE)",null,{"$f":"PFP!J6","v":"SICRO JAN/2025; SINAPI MAIO/2025; EMBASA JAN/2025; ORSE ABR/2025; SUDECAP JAN/2025.                            DATA-BASE ORÇAMENTO: JUN/2025"}]
["Cod.","Base","Insumos","Uni","Qde","Preço Unitário (PU)","Preço Total (PT)"]
["PROP","CODE","Aluguel de notebook","mês",{"$f":"8+8","v":16},{"$f":"'AUX - NOTEBOOK'!H10","v":92.05},{"$f":"E8*F8","v":1472.8}]
{"$rows_left_out":4}
{"sheet":"PFP1.3_Ger","index":3,"n_rows":28,"n_cols":9,"rows_kept":28,"cut":false,"hidden":false,"merged":[[5,0,5,5],[5,6,5,7],[0,0,1,7],[2,0,2,8],[3,0,3,8],[4,0,4,3],[4,6,4,7]]}
["RECURSOS GERAIS",{"$nulls":7},"CODIGO:"]
[{"$nulls":8},"PFP1.3"]
["NOME DA EMPRESA:"]
[]
["PROJETO: ",{"$nulls":5},"CONTRATANTE:",null,{"$f":"[334]PFP!J5","v":"BASE:"}]
[{"$f":"PFP!A6","v":"CONTRATAÇÃO DOS SERVIÇOS DE APOIO À FISCALIZAÇÃO PARA EXECUÇÃO DAS OBRAS DE ENGENHARIA, VISANDO A IMPLANTAÇÃO DE PONTE EM CONCRETO ARMADO SOBRE O RIO MELCHIOR, NA REGIÃO ADMINISTRATIVA DA CEILÂNDIA, DISTRITO FEDERAL."},{"$nulls":5},"CODEVASF (SEDE)",null,{"$f":"PFP!J6","v":"SICRO JAN/2025; SINAPI MAIO/2025; EMBASA JAN/2025; ORSE ABR/2025; SUDECAP JAN/2025.                            DATA-BASE ORÇAMENTO: JUN/2025"}]
[]
["CODE 1",null,null,"DESCRIÇÃO","UNIDADE","QUANTIDADE","CUSTO UNITÁRIO","CUSTO TOTAL"]
{"$rows_left_out":21}
{"sheet":"PFP1.4_Ensaios_Solo_Concreto","index":4,"n_rows":25,"n_cols":13,"rows_kept":25,"cut":false,"hidden":true,"merged":[[24,10,24,11],[21,0,21,8],[5,0,5,4],[5,5,5,6],[18,0,18,6],[20,0,20,8],[19,0,19,8],[22,10,23,12],[22,0,22,8],[23,0,23,8],[0,0,1,6],[2,0,2,8],[3,0,3,8],[3,10,3,12],[4,0,4,4],[4,5,4,6]]}
["ENSAIOS DE SOLO E CONCRETO",{"$nulls":7},"CODIGO:"]
[{"$nulls":8},"PFP-1.4"]
["NOME DA EMPRESA:"]
[{"$nulls":10},"MEMÓRIA DE CALCULO DO BDI DE FORNECIMENTO"]
["PROJETO:",{"$nulls":4},"CONTRATANTE:",null,null,{"$f":"[335]PFP!K5","v":"BASE:"},null,"ITEM","DISCRIMINAÇÃO","PERC.    (%)"]
[{"$f":"PFP!A6","v":"CONTRATAÇÃO DOS SERVIÇOS DE APOIO À FISCALIZAÇÃO PARA EXECUÇÃO DAS OBRAS DE ENGENHARIA, VISANDO A IMPLANTAÇÃO DE PONTE EM CONCRETO ARMADO SOBRE O RIO MELCHIOR, NA REGIÃO ADMINISTRATIVA DA CEILÂNDIA, DISTRITO FEDERAL."},{"$nulls":4},{"$f":"PFP!F6","v":"CODEVASF (SEDE)"},null,null,{"$f":"PFP!J6","v":"SICRO JAN/2025; SINAPI MAIO/2025; EMBASA JAN/2025; ORSE ABR/2025; SUDECAP JAN/2025.                            DATA-BASE ORÇAMENTO: JUN/2025"}]
["Base","Cod.","Código","Insumos","Uni","Qde","Custo Unitário (CU)","Custo Total","Preço Total (PT)"]
["EMBASA","CODE","32.01.01","Sondagem A Trado Manual ","m",0,65,{"$f":"ROUND(F8*G8,2)","v":0},{"$f":"H8*(1+$M$25)","v":0},null,"1.00","Despesas Indiretas"]
{"$rows_left_out":18}
{"sheet":"PFP2.1_FatorKa","index":5,"n_rows":41,"n_cols":6,"rows_kept":41,"cut":false,"hidden":false,"merged":[[35,1,35,3],[6,1,6,3],[40,0,40,5],[39,0,39,5],[38,0,38,5],[37,0,37,5],[22,1,22,3],[29,1,29,3],[30,1,30,3],[28,1,28,3],[25,1,25,3],[26,1,26,3],[27,1,27,3],[33,1,33,3],[31,1,31,3],[32,1,32,3],[34,1,34,3],[0,0,1,4],[2,0,2,5],[5,0,5,1],[5,2,5,4],[4,2,4,4],[3,0,3,5],[24,1,24,3],[7,1,7,3],[17,1,17,3],[8,1,8,3],[13,1,13,3],[14,1,14,3],[15,1,15,3],[18,1,18,3],[19,1,19,3],[20,1,20,3],[21,1,21,3],[23,1,23,3],[9,1,9,3],[10,1,10,3],[11,1,11,3],[12,1,12,3]]}
["DETALHAMENTO DOS ENCARGOS SOCIAIS: Ka",{"$nulls":4},"CODIGO:"]
[{"$nulls":5},"PFP-2.1"]
["NOME DA CONSULTORA:"]
[]
["PROJETO:",null,"CONTRATANTE:",null,null,{"$f":"PFP!J5","v":"BASE:"}]
[{"$f":"PFP!A6","v":"CONTRATAÇÃO DOS SERVIÇOS DE APOIO À FISCALIZAÇÃO PARA EXECUÇÃO DAS OBRAS DE ENGENHARIA, VISANDO A IMPLANTAÇÃO DE PONTE EM CONCRETO ARMADO SOBRE O RIO MELCHIOR, NA REGIÃO ADMINISTRATIVA DA CEILÂNDIA, DISTRITO FEDERAL."},null,"CODEVASF (SEDE)",null,null,"SINAPI/DF"]
["Cod","DESCRIÇÃO",null,null,"%","R$"]
["A","ENCARGOS SOCIAIS BÁSICOS",null,null,{"$f":"ROUND(SUM(E9:E17),4)","v":0.378},{"$f":"ROUND(E8*SUMIF(PFP!$B$8:$B$13,\"MO1\",PFP!$J$8:$J$13),2)","v":56124.84}]
{"$rows_left_out":34}
{"sheet":"PFP2.2_FatorKb","index":6,"n_rows":40,"n_cols":6,"rows_kept":40,"cut":false,"hidden":false,"merged":[[27,1,27,3],[28,1,28,3],[29,1,29,3],[22,1,22,3],[23,1,23,3],[24,1,24,3],[25,1,25,3],[26,1,26,3],[6,1,6,3],[12,1,12,3],[13,1,13,3],[39,0,39,5],[36,0,36,5],[37,0,37,5],[38,0,38,5],[31,1,31,3],[32,1,32,3],[33,1,33,3],[34,1,34,3],[18,1,18,3],[30,1,30,3],[19,1,19,3],[20,1,20,3],[21,1,21,3],[0,0,1,4],[2,0,2,5],[3,0,3,5],[4,2,4,4],[5,0,5,1],[5,2,5,4],[7,1,7,3],[16,1,16,3],[17,1,17,3],[8,1,8,3],[9,1,9,3],[10,1,10,3],[14,1,14,3],[15,1,15,3],[11,1,11,3]]}
["DETALHAMENTO DOS ENCARGOS SOCIAIS: Kb",{"$nulls":4},"CODIGO:"]
[{"$nulls":5},"PFP-2.2"]
["NOME DA CONSULTORA:"]
[]
["PROJETO:",null,"CONTRATANTE:",null,null,{"$f":"'PFP2.1_FatorKa'!F5","v":"BASE:"}]
[{"$f":"PFP!A6","v":"CONTRATAÇÃO DOS SERVIÇOS DE APOIO À FISCALIZAÇÃO PARA EXECUÇÃO DAS OBRAS DE ENGENHARIA, VISANDO A IMPLANTAÇÃO DE PONTE EM CONCRETO ARMADO SOBRE O RIO MELCHIOR, NA REGIÃO ADMINISTRATIVA DA CEILÂNDIA, DISTRITO FEDERAL."},null,"CODEVASF (SEDE)",null,null,{"$f":"'PFP2.1_FatorKa'!F6","v":"SINAPI/DF"}]
["Cod","DESCRIÇÃO",null,null,"%","R$"]
["A","ENCARGOS SOCIAIS BÁSICOS",null,null,{"$f":"ROUND(SUM(E9:E16),4)","v":0.2},{"$f":"ROUND(E8*SUMIF(PFP!$B$8:$B$13,\"MO2\",PFP!$J$8:$J$13),2)","v":0}]
{"$rows_left_out":33}
{"sheet":"PFP2.3_FatorKc","index":7,"n_rows":40,"n_cols":6,"rows_kept":40,"cut":false,"hidden":false,"merged":[[0,0,1,4],[2,0,2,5],[3,0,3,5],[4,2,4,4],[5,0,5,1],[5,2,5,4],[16,1,16,3],[6,1,6,3],[7,1,7,3],[8,1,8,3],[9,1,9,3],[10,1,10,3],[11,1,11,3],[12,1,12,3],[13,1,13,3],[14,1,14,3],[15,1,15,3],[28,1,28,3],[17,1,17,3],[18,1,18,3],[19,1,19,3],[20,1,20,3],[21,1,21,3],[22,1,22,3],[23,1,23,3],[24,1,24,3],[25,1,25,3],[26,1,26,3],[27,1,27,3],[36,0,36,5],[37,0,37,5],[38,0,38,5],[39,0,39,5],[29,1,29,3],[30,1,30,3],[31,1,31,3],[32,1,32,3],[33,1,33,3],[34,1,34,3]]}
["DETALHAMENTO DOS ENCARGOS SOCIAIS: Kc",{"$nulls":4},"CODIGO:"]
[{"$nulls":5},"PFP-2.3"]
["NOME DA CONSULTORA:"]
[]
["PROJETO:",null,"CONTRATANTE:",null,null,{"$f":"'PFP2.2_FatorKb'!F5","v":"BASE:"}]
[{"$f":"PFP!A6","v":"CONTRATAÇÃO DOS SERVIÇOS DE APOIO À FISCALIZAÇÃO PARA EXECUÇÃO DAS OBRAS DE ENGENHARIA, VISANDO A IMPLANTAÇÃO DE PONTE EM CONCRETO ARMADO SOBRE O RIO MELCHIOR, NA REGIÃO ADMINISTRATIVA DA CEILÂNDIA, DISTRITO FEDERAL."},null,"CODEVASF (SEDE)",null,null,{"$f":"'PFP2.2_FatorKb'!F6","v":"SINAPI/DF"}]
["Cod","DESCRIÇÃO",null,null,"%","R$"]
["A","ENCARGOS SOCIAIS BÁSICOS",null,null,{"$f":"SUM(E9:E16)","v":0},{"$f":"ROUND(E8*SUMIF(PFP!$B$8:$B$13,\"MO3\",PFP!$J$8:$J$13),2)","v":0}]
{"$rows_left_out":33}
{"sheet":"PFP3_FatorKd","index":8,"n_rows":35,"n_cols":6,"rows_kept":35,"cut":false,"hidden":false,"merged":[[32,0,32,5],[12,1,12,3],[11,1,11,3],[8,1,8,2],[9,1,9,2],[10,1,10,2],[7,1,7,2],[25,0,25,5],[6,1,6,2],[0,0,1,4],[2,0,2,5],[5,0,5,1],[5,2,5,4],[4,2,4,4],[3,0,3,5],[33,0,33,5],[34,0,34,5],[16,1,16,3],[13,1,13,3],[14,1,14,3],[15,1,15,3],[21,0,21,5],[26,0,26,5],[27,0,27,5],[22,0,22,5],[23,0,23,5],[24,0,24,5],[28,0,28,5],[29,0,29,5],[30,0,30,5],[31,0,31,5]]}
["DESPESAS FISCAIS E CUSTOS DIVERSOS: Kd",{"$nulls":4},"CODIGO:"]
[{"$nulls":5},"PFP-3"]
["NOME DA CONSULTORA:"]
[]
["PROJETO:",null,"CONTRATANTE:",null,null,{"$f":"'PFP2.3_FatorKc'!F5","v":"BASE:"}]
[{"$f":"PFP!A6","v":"CONTRATAÇÃO DOS SERVIÇOS DE APOIO À FISCALIZAÇÃO PARA EXECUÇÃO DAS OBRAS DE ENGENHARIA, VISANDO A IMPLANTAÇÃO DE PONTE EM CONCRETO ARMADO SOBRE O RIO MELCHIOR, NA REGIÃO ADMINISTRATIVA DA CEILÂNDIA, DISTRITO FEDERAL."},null,"CODEVASF (SEDE)",null,null,{"$f":"'PFP2.3_FatorKc'!F6","v":"SINAPI/DF"}]
["Cod","DESCRIÇÃO1",null,"% preço2","% custo4","R$"]
["K4","TRIBUTOS",null,{"$f":"ROUND(D9+D10+D11,4)","v":0.124},{"$f":"ROUND(E9+E10+E11,4)","v":0.1416},{"$f":"E8*SUM(SUMIF(PFP!$B$8:$B$13,\"MO1\",PFP!$J$8:$J$13)*(1+'PFP2.1_FatorKa'!$E$35)+SUMIF(PFP!$B$8:$B$13,\"MO2\",PFP!$J$8:$J$13)*(1+'PFP2.2_FatorKb'!$E$34)+SUMIF(PFP!$B$8:$B$13,\"<>MO*\",PFP!$J$8:$J$13)+$F$13+$F$12)","v":46486.440364438342}]
{"$rows_left_out":28}
{"sheet":"Cronograma Físico-Financeiro","index":9,"n_rows":29,"n_cols":12,"rows_kept":29,"cut":false,"hidden":false,"merged":[[20,2,21,2],[18,1,19,1],[18,2,19,2],[27,1,28,2],[12,1,13,1],[14,2,15,2],[16,2,17,2],[14,1,15,1],[12,2,13,2],[25,2,26,2],[23,1,24,2],[16,1,17,1],[20,1,21,1],[4,1,5,1],[4,2,5,2],[6,1,7,1],[6,2,7,2],[10,2,11,2],[10,1,11,1],[8,1,9,1],[8,2,9,2]]}
[null,"CRONOGRAMA FÍSICO-FINANCEIRO"]
[]
[]
[null,null,null,"Mês 1","Mês 2","Mês 3","Mês 4","Mês 5","Mês 6","Mês 7","Mês 8"]
[null,{"$f":"PFP!D8","v":"Engenheiro Júnior"},{"$f":"PFP!K8","v":221332.9},{"$f":"D6*$C$5","v":27666.612499999999},{"$f":"E6*$C$5","v":27666.612499999999},{"$f":"F6*$C$5","v":27666.612499999999},27666.612499999999,{"$f":"H6*$C$5","v":27666.612499999999},{"$f":"I6*$C$5","v":27666.612499999999},27666.612499999999,27666.612499999999,{"$f":"SUM(D5:K5)","v":221332.89999999997}]
[null,null,null,{"$f":"1/8","v":0.125},{"$f":"1/8","v":0.125},0.125,0.125,0.125,0.125,0.125,0.125,1]
[null,{"$f":"PFP!D9","v":"Técnico - Profissional Especial"},{"$f":"PFP!K9","v":55627.24},{"$f":"D8*$C$7","v":6953.4049999999997},{"$f":"E8*$C$7","v":6953.4049999999997},6953.4049999999997,6953.4049999999997,6953.4049999999997,6953.4049999999997,6953.4049999999997,6953.4049999999997,55627.24]
[null,null,null,{"$f":"1/8","v":0.125},{"$f":"1/8","v":0.125},0.125,0.125,0.125,0.125,0.125,0.125,1]
{"$rows_left_out":22}
{"sheet":"CPU-VEICULO_PickUp","index":10,"n_rows":61,"n_cols":33,"rows_kept":61,"cut":false,"hidden":true,"merged":[[52,19,52,26],[4,0,4,2],[6,0,6,2],[7,0,7,1],[7,4,7,7],[8,0,8,2],[52,8,52,18]]}
[]
[]
[]
[]
["Composição de Preços de Locação de Veículo tipo pick-up"]
[null,"Data de atualização:","2025-01-22",null,"CV","Média","Mediana",null,null,null,"CV","Média","Mediana",{"$nulls":8},"CV","Média","Mediana"]
["CODEVASF ",null,null,null,{"$f":"_xlfn.STDEV.S(E10:H10)/AVERAGE(E10:H10)","v":9.4618047486117282E-2},{"$f":"AVERAGE(E10:H10)","v":200477},{"$f":"MEDIAN(E10:H10)","v":205565.5},null,null,null,{"$f":"_xlfn.STDEV.S(L9:S9)/AVERAGE(L9:S9)","v":0.20491936834598948},{"$f":"AVERAGE(L9:S9)","v":34.548571428571428},{"$f":"MEDIAN(L9:S9)","v":30.91},{"$nulls":8},{"$f":"_xlfn.STDEV.S(W9:AD9)/AVERAGE(W9:AD9)","v":0.12410235614319021},{"$f":"AVERAGE(W9:AD9)","v":499.01906250000008},{"$f":"MEDIAN(W9:AD9)","v":499.45}]
["OBS:               Preço sem BDI e sem motorista                                                                   BDI=",null,null,null,"Preço FIPE ",{"$nulls":4},"PRODUTO ","MENOR (MÉDIA, MEDIANA)","COT. 1","COT. 2","COT. 3","COT. 4","COT. 5","COT. 6","COT. 7","COT. 8",null,"PRODUTO","MENOR (MÉDIA, MEDIANA)","COT. 1","COT. 2","COT. 3","COT. 4","COT. 5","COT. 6","COT. 7","COT. 8"]
{"$rows_left_out":54}
{"sheet":"CPU-VEICULO_Leve","index":11,"n_rows":84,"n_cols":33,"rows_kept":84,"cut":false,"hidden":false,"merged":[[49,21,49,28],[1,0,1,3],[3,0,3,3],[4,0,4,2],[4,5,4,8],[5,0,5,3],[49,9,49,20]]}
[]
["Composição de Preços de Locação de Veículos"]
[null,"2023-08-23","Data de atualização:","2025-01-22",null,"CV","Média","Mediana",null,null,null,"CV","Média","Mediana",{"$nulls":9},"CV","Média","Mediana"]
["CODEVASF ",{"$nulls":4},{"$f":"_xlfn.STDEV.S(F7:I7)/AVERAGE(F7:I7)","v":0.1466333998024873},{"$f":"AVERAGE(F7:I7)","v":75224.5},{"$f":"MEDIAN(F7:I7)","v":74407.5},null,null,null,{"$f":"_xlfn.STDEV.S(M6:U6)/AVERAGE(M6:U6)","v":0.15722347279585167},{"$f":"AVERAGE(M6:U6)","v":26.768888888888892},{"$f":"MEDIAN(M6:U6)","v":27.12},{"$nulls":9},{"$f":"_xlfn.STDEV.S(Y6:AG6)/AVERAGE(Y6:AG6)","v":0.16218949848342898},{"$f":"AVERAGE(Y6:AG6)","v":329.14444444444445},{"$f":"MEDIAN(Y6:AG6)","v":334.75}]
["OBS:               Preço sem BDI e sem motorista                                                           BDI=",{"$nulls":4},"Preço FIPE",{"$nulls":4},"PRODUTO","MENOR","COT. 1","COT. 2","COT. 3","COT. 4","COT. 5","COT. 6","COT. 7","COT. 8","COT. 9",null,"PRODUTO ","MENOR","COT. 1","COT. 2","COT. 3","COT. 4","COT. 5","COT. 6","COT. 7","COT. 8","COT. 9"]
["Veículo Leve 1.0 T. Flex 12V 5p",{"$nulls":4},"Renault Kwid Zen 1.0","Hyndai HB20 Sense 1.0 ","ONIX HATCH LT 1.0 12V Flex 5p Mec.","MOBI TREKKING 1.0 Flex 5p.",null,"LUBRIFICANTE 15W40",{"$f":"SMALL(M4:N4,1)","v":26.768888888888892},27.12,19.010000000000002,28.9,23.9,28.76,33.9,29.44,24.9,24.99,null,"Pneu 185/65 R14",{"$f":"SMALL(Y4:Z4,1)","v":329.14444444444445},289.89999999999998,{"$f":"1255.8/4","v":313.95},289,{"$f":"1339/4","v":334.75},{"$f":"1519.6/4","v":379.9},231,364.9,{"$f":"718/2","v":359},{"$f":"799.8/2","v":399.9}]
[null,null,"Custo Mensal (R$):",{"$f":"D48","v":1763.0317835074602},null,63868,80150,88215,68665,null,null,""]
[null,null,"Custo Diário (R$):",{"$f":"D7/30","v":58.767726116915341}]
{"$rows_left_out":55}
{"sheet":"CPU HOSPEDAGEM","index":12,"n_rows":19,"n_cols":4,"rows_kept":19,"cut":false,"hidden":true,"merged":[[2,1,2,2]]}
[]
[null,"Engenharia Consultiva da Codevasf"]
[null,"CPU - HOSPEDAGEM EQUIPE DE CAMPO (4 PESSOAS/MÊS)",null,"Código/Referencia"]
[null,"ALUGUEL ",3074.56,"F020003334/EMBASA insumo"]
[null,"Aquisição de Mobiliário",{"$f":"42.41*C16","v":169.64},"B8954/DNIT"]
[null,"Material de limpeza e diarista",{"$f":"130.82+(123*8)","v":1114.82},"10563/ORSE - E200300131/EMBASA"]
[null,"manutenção da casa alugada - Serviços Gerais/Vigia ",2716.19,"41096/SINAPI"]
[null,"Energia ",180,"10555/ORSE"]
{"$rows_left_out":12}
{"sheet":"CPU ESCRIT. CONTAINER","index":13,"n_rows":17,"n_cols":5,"rows_kept":17,"cut":false,"hidden":false,"merged":[[2,1,2,2]]}
[]
[null,"Engenharia Consultiva da Codevasf"]
[null,"CPU - HOSPEDAGEM EQUIPE DE CAMPO (4 PESSOAS/MÊS)",null,"Código/Referencia"]
[null,"ALUGUEL CONTAINER ESCRITÓRIO C/ BANHEIRO",{"$f":"1600","v":1600},"4298/ORSE"]
[null,"Aquisição de Mobiliário",{"$f":"'AUX - MOBILIÁRIO'!F10","v":149.11000000000001},"CODE","cotação"]
[null,"Material de limpeza e diarista",{"$f":"129.46+(123*4)","v":621.46},"10563/ORSE - E200300131/EMBASA"]
[null,"Energia ",180,"10555/ORSE"]
[null,"Mobilização e Desmobilização",{"$f":"1200*2/8","v":300},"89.50.20/89.50.21/SUDECAP-MG"]
{"$rows_left_out":10}
{"sheet":"MDO -  DNIT","index":14,"n_rows":105,"n_cols":26,"rows_kept":105,"cut":false,"hidden":false,"merged":[[1,20,1,21],[0,16,0,21],[0,22,1,23],[0,24,1,24],[1,6,1,7],[1,8,1,9],[1,10,1,11],[1,12,1,13],[1,14,1,15],[1,16,1,17],[1,18,1,19],[0,6,0,15],[0,0,2,0],[0,1,2,1],[0,2,2,2],[0,3,1,3],[0,4,1,5]]}
["Código","Categoria","Unid.","Salário","Encargos Sociais",null,"Encargos Complementares",{"$nulls":9},"Encargos Adicionais",{"$nulls":5},"Encargos Totais",null,"Valor Total"]
[{"$nulls":6},"Alimentação",null,"EPI",null,"Ferramenta",null,"Transporte",null,"Exame Ocupacional",null,"Cesta Básica",null,"Assistência Médica",null,"Seguro de Vida"]
[null,null,null,"R$","%","R$","%","R$","%","R$","%","R$","%","R$","%","R$","%","R$","%","R$","%","R$","%","R$","R$"]
["Profissionais mensalistas"]
["P8001","Advogado júnior","mês",4915.72,0.79300000000000004,3898.16,0.14990000000000001,736.74,5.4999999999999997E-3,26.96,0,0,0,0,5.9999999999999995E-4,2.86,0,0,6.3E-2,309.62,2E-3,9.98,1.014,4984.34,9900.0499999999993,{"$f":"Y5-F5-D5","v":1086.1699999999992}]
["P8002","Advogado pleno","mês",6554.29,0.79300000000000004,5197.55,0.1124,736.74,4.1000000000000003E-3,26.96,0,0,0,0,4.0000000000000002E-4,2.86,0,0,4.7199999999999999E-2,309.62,1.5E-3,9.98,0.9587,6283.72,12838.01,{"$f":"Y6-F6-D6","v":1086.17}]
["P8003","Advogado sênior","mês",12196.82,0.79300000000000004,9672.08,6.0400000000000002E-2,736.74,2.2000000000000001E-3,26.96,0,0,0,0,2.0000000000000001E-4,2.86,0,0,2.5399999999999999E-2,309.62,8.0000000000000004E-4,9.98,0.8821,10758.25,22955.07,1086.17]
["P8007","Analista de desenvolvimento de sistemas júnior","mês",4417.8100000000004,0.79590000000000005,3516.13,0.1668,736.74,0,0,0,0,0,0,8.0000000000000004E-4,3.5,0,0,7.0099999999999996E-2,309.62,2.3E-3,9.98,1.0358000000000001,4575.97,8993.7800000000007,1059.8400000000001]
{"$rows_left_out":98}
{"sheet":"C.G - DNIT","index":15,"n_rows":27,"n_cols":8,"rows_kept":27,"cut":false,"hidden":false,"merged":[[3,5,3,6],[24,1,25,1],[24,3,24,4],[25,3,25,4],[14,3,14,4],[15,1,16,1],[15,3,15,4],[16,3,16,4],[17,1,18,1],[17,3,17,4],[18,3,18,4],[19,1,23,1],[19,3,19,4],[20,3,20,4],[21,3,21,4],[22,3,22,4],[5,1,9,1],[3,1,4,1],[3,2,4,2],[3,3,4,3],[3,4,4,4]]}
[null,"2025-01-01"]
[null,"Tabela 1 - Custos de veículos "]
[null,{"$f":"\"Tabela de Preços de Consultoria - mês de referência: \"&TEXT(B1,\"MMMM\")&\" de \"&TEXT(B1,\"AAAA\")","v":"Tabela de Preços de Consultoria - mês de referência: janeiro de 2025"}]
[null,"Item","Código","Tipo","Unidade","Custo unitário (R$ / un)",null,"S"]
[{"$nulls":5},"Produtivo","Improdutivo"]
[null,"Veículos","E8889","Veículo leve - 53 kW (sem motorista)","hora",35.28,6.33]
[null,null,"E8890","Veículo leve - 53 kW (com motorista)","hora",62.59,33.64]
[null,null,"E8891","Veículo leve picape 4 x 4 com capacidade de 1,10 t - 147 kW (sem motorista)","hora",78.47,22.75]
{"$rows_left_out":20}
{"sheet":"Cotação Voos","index":16,"n_rows":106,"n_cols":6,"rows_kept":106,"cut":false,"hidden":true,"merged":[]}
["COTAÇÕES - IDA DIA 07/04/2024 E VOLTA DIA 11/04/2024"]
["Localidade:","Juazeiro/BA"]
[]
["Origem","Destino"]
["BSB ",{"$f":"B2","v":"Juazeiro/BA"},"Cia 1","Cia 2","Cia 3","Média"]
[null,null,1397,1695,1841,{"$f":"AVERAGE(C6:E6)","v":1644.3333333333333}]
{"$rows_empty":24}
["SP",{"$f":"B2","v":"Juazeiro/BA"},"Cia 1","Cia 2","Cia 3","Média"]
{"$rows_left_out":10}
{"sheet":"AUX - MOBILIÁRIO","index":17,"n_rows":46,"n_cols":7,"rows_kept":46,"cut":false,"hidden":false,"merged":[[71,0,71,6],[0,0,3,5],[4,0,5,5],[7,0,8,0],[7,1,7,4],[7,5,8,5],[45,0,45,6]]}
[]
[]
[]
[]
["COMPOSIÇÃO DO PREÇO UNITÁRIO MENSAL PARA ALUGUEL DE MOBILIÁRIO E EQUIPAMENTOS DE ESCRITÓRIO"]
[]
[]
[" AQUISIÇÃO DE MOBILIÁRIO","VALOR DA DEPRECIAÇÃO",null,null,null,"VALOR MENSAL TOTAL (R$)"]
{"$rows_left_out":18}
{"sheet":"AUX - NOTEBOOK","index":18,"n_rows":47,"n_cols":10,"rows_kept":47,"cut":false,"hidden":false,"merged":[[46,0,46,8],[72,0,72,8],[0,0,3,7],[4,0,5,7],[7,0,8,0],[7,1,7,4],[7,5,7,6],[7,7,8,7]]}
[]
[]
[]
[]
["COMPOSIÇÃO DO PREÇO UNITÁRIO MENSAL PARA ALUGUEL DE NOTEBOOK"]
[]
[]
[" AQUISIÇÃO DE EQUIPAMENTO","VALOR DA DEPRECIAÇÃO",null,null,null,"MANUTENÇÃO",null,"VALOR MENSAL TOTAL (R$)"]
{"$rows_left_out":16}
{"sheet":"AUX - IMPRESSORA","index":19,"n_rows":47,"n_cols":8,"rows_kept":47,"cut":false,"hidden":false,"merged":[[46,0,46,8],[72,0,72,8],[0,0,3,7],[4,0,5,7],[7,0,8,0],[7,1,7,4],[7,5,7,6],[7,7,8,7]]}
[]
[]
[]
[]
["COMPOSIÇÃO DO PREÇO UNITÁRIO MENSAL PARA ALUGUEL DE IMPRESSORA"]
[]
[]
[" AQUISIÇÃO DE EQUIPAMENTO","VALOR DA DEPRECIAÇÃO",null,null,null,"MANUTENÇÃO",null,"VALOR MENSAL TOTAL (R$)"]
{"$rows_left_out":16}