{"text_format":"2","workbook":"xlsx","n_sheets":16,"sheets":["PFP","PFP1.2_Equi_div","PFP1.3_Ger","COMPOSIÇÕES PFP1.3_Ger","PFP2.1_FatorKa","PFP2.2_FatorKb","PFP2.3_FatorKc","PFP3_FatorKd","Cronograma Físico-Financeiro","CPU-VEICULO_Leve","CPU ESCRIT. CONTAINER","MDO -  DNIT","C.G - DNIT","AUX - MOBILIÁRIO","AUX - NOTEBOOK","AUX - IMPRESSORA"],"not_rendered":{"charts":0,"images":49,"macros":0,"external_links":251,"defined_names":33700,"comments":2,"pivot_tables":0},"unopened":[],"bounds":{"document_bytes":16777216,"sheet_cells":100000,"run_cost":"one","rows_first":2000,"rows_last":500,"rows_between":2000,"halvings":0,"cell_chars":16384,"cell_head_chars":4096},"cells_cut":0,"cells_raw":0,"read":"whole","date_system":"1900"}

{"sheet":"PFP","index":0,"n_rows":39,"n_cols":16,"rows_kept":39,"cut":false,"hidden":false,"merged":[[30,0,30,10],[31,0,31,10],[32,0,32,10],[33,0,33,10],[0,0,1,8],[25,0,25,10],[26,0,26,10],[27,0,27,10],[28,0,28,10],[29,0,29,10],[20,0,20,10],[21,0,21,10],[22,0,22,10],[23,0,23,10],[24,0,24,10],[17,0,17,5],[17,7,17,10],[18,0,18,5],[18,7,18,10],[19,0,19,5],[19,7,19,10],[5,0,5,4],[5,5,5,8],[5,9,5,10],[16,0,16,5],[16,7,16,10],[0,9,0,10],[1,9,1,10],[2,0,2,10],[3,0,3,10],[4,0,4,4],[4,5,4,8],[4,9,4,10]]}
["PROPOSTA FINANCEIRA DO PROJETO",{"$nulls":8},"CODIGO:"]
[{"$nulls":9},"PFP"]
["NOME DA CONSULTORA:"]
[]
["PROJETO:",{"$nulls":4},"CONTRATANTE:",null,null,null,"BASE: "]
["CONTRATAÇÃO DE EMPRESA DE ENGENHARIA PARA SUPERVISÃO E APOIO À FISCALIZAÇÃO DURANTE OS SERVIÇOS DE EXECUÇÃO DAS OBRAS DA PONTE SOBRE O RIBEIRÃO ÁGUA LIMPA, VIAS DE ACESSO E INFRAESTRUTURA COMPLETA VISANDO A INTERLIGAÇÃO DAS RODOVIAS GO-173 E GO-324, NO MUNICÍPIO DE BRITÂNIA, NO ESTADO DE GOIÁS",{"$nulls":4},"CODEVASF (SEDE)",null,null,null,"SICRO JAN/2025; SINAPI MAI/2025; EMBASA JAN/2025; ORSE ABR/2025; SUDECAP JAN/2025.                            DATA-BASE ORÇAMENTO: JUN/2025"]
["Base","Cod2","Código","Categoria / Insumo","Uni","Qde","CUD","PU","FatorK","CT","PT","Encargos COMP E ADICIONAIS","SOCIAIS","TOTAIS",null,"Encargos Comp e Adicionais"]
["SICRO","MO1","P8066","Engenheiro Pleno","mês",18,{"$f":"VLOOKUP(C8,'MDO -  DNIT'!$A:$Z,4,0)","v":13163.74},{"$f":"G8*I8","v":27750.480294000001},{"$f":"'PFP2.1_FatorKa'!$E$36","v":2.1080999999999999},{"$f":"G8*F8","v":236947.32},{"$f":"ROUND(J8*I8,2)","v":499508.65},{"$nulls":4},{"$f":"VLOOKUP(C8,'MDO -  DNIT'!$A:$Z,26,0)","v":1087.22}]
["SICRO","MO1","P8147","Técnico - Profissional Especial","mês",18,{"$f":"VLOOKUP(C9,'MDO -  DNIT'!$A:$Z,4,0)","v":3242.89},6836.3364089999995,{"$f":"'PFP2.1_FatorKa'!$E$36","v":2.1080999999999999},58372.02,{"$f":"ROUND(J9*I9,2)","v":123054.06},{"$f":"N9-M9","v":1070.18},2450.48,3520.66,null,{"$f":"VLOOKUP(C9,'MDO -  DNIT'!$A:$Z,26,0)","v":1144.72}]
["SICRO","MO1","P8098","Técnico Auxiliar (Laboratorista)","mês",18,{"$f":"VLOOKUP(C10,'MDO -  DNIT'!$A:$Z,4,0)","v":2413.91},5088.7636709999997,{"$f":"'PFP2.1_FatorKa'!$E$36","v":2.1080999999999999},43450.38,91597.75,{"$nulls":4},{"$f":"VLOOKUP(C10,'MDO -  DNIT'!$A:$Z,26,0)","v":1194.73}]
{"$rows_left_out":30}
{"sheet":"PFP1.2_Equi_div","index":1,"n_rows":11,"n_cols":7,"rows_kept":11,"cut":false,"hidden":false,"merged":[[10,0,10,5],[0,0,1,5],[2,0,2,6],[3,0,3,6],[4,0,4,3],[4,4,4,5],[5,0,5,3],[5,4,5,5]]}
["RECURSOS GERAIS",{"$nulls":5},"CODIGO:"]
[{"$nulls":6},"PFP1.2"]
["NOME DA EMPRESA:"]
[]
["PROJETO: ",null,null,null,"CONTRATANTE:",null,{"$f":"PFP!J5","v":"BASE: "}]
[{"$f":"PFP!A6","v":"CONTRATAÇÃO DE EMPRESA DE ENGENHARIA PARA SUPERVISÃO E APOIO À FISCALIZAÇÃO DURANTE OS SERVIÇOS DE EXECUÇÃO DAS OBRAS DA PONTE SOBRE O RIBEIRÃO ÁGUA LIMPA, VIAS DE ACESSO E INFRAESTRUTURA COMPLETA VISANDO A INTERLIGAÇÃO DAS RODOVIAS GO-173 E GO-324, NO MUNICÍPIO DE BRITÂNIA, NO ESTADO DE GOIÁS"},null,null,null,"CODEVASF (SEDE)",null,{"$f":"PFP!J6","v":"SICRO JAN/2025; SINAPI MAI/2025; EMBASA JAN/2025; ORSE ABR/2025; SUDECAP JAN/2025.                            DATA-BASE ORÇAMENTO: JUN/2025"}]
["Cod.","Base","Insumos","Uni","Qde","Preço Unitário (PU)","Preço Total (PT)"]
["PROP","CODE","Aluguel de notebook","mês",36,{"$f":"'AUX - NOTEBOOK'!H10","v":119.12},{"$f":"E8*F8","v":4288.32}]
["PROP","CODE","Aluguel de impressora","mês",18,{"$f":"'AUX - IMPRESSORA'!H10","v":70.05},{"$f":"E9*F9","v":1260.9000000000001}]
["PROP","CODE","Escritório","mês",18,{"$f":"'CPU ESCRIT. CONTAINER'!C14","v":3169.2533333333299},57046.559999999998]
{"$rows_left_out":2}
{"sheet":"PFP1.3_Ger","index":2,"n_rows":11,"n_cols":7,"rows_kept":11,"cut":false,"hidden":false,"merged":[[10,0,10,5],[0,0,1,5],[2,0,2,6],[3,0,3,6],[4,0,4,3],[4,4,4,5],[5,0,5,3],[5,4,5,5]]}
["RECURSOS GERAIS",{"$nulls":5},"CODIGO:"]
[{"$nulls":6},"PFP1.3"]
["NOME DA EMPRESA:"]
[]
["PROJETO: ",null,null,null,"CONTRATANTE:",null,{"$f":"[249]PFP!J5","v":"BASE:"}]
[{"$f":"PFP!A6","v":"CONTRATAÇÃO DE EMPRESA DE ENGENHARIA PARA SUPERVISÃO E APOIO À FISCALIZAÇÃO DURANTE OS SERVIÇOS DE EXECUÇÃO DAS OBRAS DA PONTE SOBRE O RIBEIRÃO ÁGUA LIMPA, VIAS DE ACESSO E INFRAESTRUTURA COMPLETA VISANDO A INTERLIGAÇÃO DAS RODOVIAS GO-173 E GO-324, NO MUNICÍPIO DE BRITÂNIA, NO ESTADO DE GOIÁS"},null,null,null,"CODEVASF (SEDE)",null,{"$f":"PFP!J6","v":"SICRO JAN/2025; SINAPI MAI/2025; EMBASA JAN/2025; ORSE ABR/2025; SUDECAP JAN/2025.                            DATA-BASE ORÇAMENTO: JUN/2025"}]
["Cod.","Base","Insumos","Uni","Qde","Preço Unitário (PU)","Preço Total (PT)"]
["PROP","CODE","Relatório Semanal de Obras","und",72,{"$f":"'[249]COMPOSIÇÕES PFP1.3_Ger'!J20","v":570.28950048819502},{"$f":"E8*F8","v":41060.844035150003}]
["PROP","CODE","Relatório de Avaliação de Projeto","und",1,{"$f":"'[249]COMPOSIÇÕES PFP1.3_Ger'!J29","v":50028.9219887816},{"$f":"E9*F9","v":50028.9219887816}]
["PROP","CODE","Levantamento Topográfico","und",2,{"$f":"'[249]COMPOSIÇÕES PFP1.3_Ger'!J37","v":11764.535140182201},{"$f":"E10*F10","v":23529.0702803645}]
{"$rows_left_out":2}
{"sheet":"COMPOSIÇÕES PFP1.3_Ger","index":3,"n_rows":66,"n_cols":9,"rows_kept":66,"cut":false,"hidden":false,"merged":[[1,0,1,7]]}
[]
[]
[]
["COMPOSIÇÃO 1",null,null,"DESCRIÇÃO","UNIDADE","QUANTIDADE","CUSTO UNITÁRIO","CUSTO TOTAL"]
["ORIGEM","CÓDIGO 1","CÓDIGO 2","RELATÓRIO DIÁRIO DE OBRAS","[un]",1]
["SINAPI","MO1",2706,"Engenheiro Civil - Acompanhamento de Obras","[h]",8,114.63,{"$f":"G6*F6","v":917.04},"dia"]
["SINAPI","MO1",2706,"Engenheiro Civil - Elaboração de Relatório Diário de Obras","[h]",2,114.63,{"$f":"G7*F7","v":229.26},"dia"]
["PRÓPRIO","SU","PRÓPRIO","Veículo Leve","dia",1,{"$f":"'[250]CPU-VEICULO_Leve'!D8","v":118.697006855335},{"$f":"G8*F8","v":118.697006855335},"dia"]
["DNIT","SU","B8953","Escritório - Mobiliário","dia",1,{"$f":"'[250]DNIT Rel. Consolidação de C.G.'!$G$18/22","v":20.755454545454501},{"$f":"G9*F9","v":20.755454545454501},"dia"]
["DNIT","SU","B8959","Escritório - Custos Diversos","dia",1,{"$f":"'[250]DNIT Rel. Consolidação de C.G.'!$G$25/22","v":6.1904545454545499},{"$f":"G10*F10","v":6.1904545454545499},"dia"]
{"$rows_left_out":57}
{"sheet":"PFP2.1_FatorKa","index":4,"n_rows":41,"n_cols":6,"rows_kept":41,"cut":false,"hidden":false,"merged":[[38,0,38,5],[39,0,39,5],[40,0,40,5],[0,0,1,4],[32,1,32,3],[33,1,33,3],[34,1,34,3],[35,1,35,3],[37,0,37,5],[27,1,27,3],[28,1,28,3],[29,1,29,3],[30,1,30,3],[31,1,31,3],[22,1,22,3],[23,1,23,3],[24,1,24,3],[25,1,25,3],[26,1,26,3],[17,1,17,3],[18,1,18,3],[19,1,19,3],[20,1,20,3],[21,1,21,3],[11,1,11,3],[12,1,12,3],[13,1,13,3],[14,1,14,3],[15,1,15,3],[6,1,6,3],[7,1,7,3],[8,1,8,3],[9,1,9,3],[10,1,10,3],[2,0,2,5],[3,0,3,5],[4,2,4,4],[5,0,5,1],[5,2,5,4]]}
["DETALHAMENTO DOS ENCARGOS SOCIAIS: Ka",{"$nulls":4},"CODIGO:"]
[{"$nulls":5},"PFP-2.1"]
["NOME DA CONSULTORA:"]
[]
["PROJETO:",null,"CONTRATANTE:",null,null,{"$f":"PFP!J5","v":"BASE: "}]
[{"$f":"PFP!A6","v":"CONTRATAÇÃO DE EMPRESA DE ENGENHARIA PARA SUPERVISÃO E APOIO À FISCALIZAÇÃO DURANTE OS SERVIÇOS DE EXECUÇÃO DAS OBRAS DA PONTE SOBRE O RIBEIRÃO ÁGUA LIMPA, VIAS DE ACESSO E INFRAESTRUTURA COMPLETA VISANDO A INTERLIGAÇÃO DAS RODOVIAS GO-173 E GO-324, NO MUNICÍPIO DE BRITÂNIA, NO ESTADO DE GOIÁS"},null,"CODEVASF (SEDE)",null,null,"SINAPI/GO"]
["Cod","DESCRIÇÃO",null,null,"%","R$"]
["A","ENCARGOS SOCIAIS BÁSICOS",null,null,{"$f":"ROUND(SUM(E9:E17),4)","v":0.378},{"$f":"ROUND(E8*SUMIF(PFP!$B$8:$B$13,\"MO1\",PFP!$J$8:$J$13),2)","v":128054.95}]
["A1","INSS",null,null,0.2,{"$f":"ROUND(E9*SUMIF(PFP!$B$8:$B$13,\"MO1\",PFP!$J$8:$J$13),2)","v":67753.94}]
["A2","SESI",null,null,1.4999999999999999E-2,{"$f":"ROUND(E10*SUMIF(PFP!$B$8:$B$13,\"MO1\",PFP!$J$8:$J$13),2)","v":5081.55}]
{"$rows_left_out":32}
{"sheet":"PFP2.2_FatorKb","index":5,"n_rows":40,"n_cols":6,"rows_kept":40,"cut":false,"hidden":false,"merged":[[37,0,37,5],[38,0,38,5],[39,0,39,5],[0,0,1,4],[31,1,31,3],[32,1,32,3],[33,1,33,3],[34,1,34,3],[36,0,36,5],[26,1,26,3],[27,1,27,3],[28,1,28,3],[29,1,29,3],[30,1,30,3],[21,1,21,3],[22,1,22,3],[23,1,23,3],[24,1,24,3],[25,1,25,3],[16,1,16,3],[17,1,17,3],[18,1,18,3],[19,1,19,3],[20,1,20,3],[11,1,11,3],[12,1,12,3],[13,1,13,3],[14,1,14,3],[15,1,15,3],[6,1,6,3],[7,1,7,3],[8,1,8,3],[9,1,9,3],[10,1,10,3],[2,0,2,5],[3,0,3,5],[4,2,4,4],[5,0,5,1],[5,2,5,4]]}
["DETALHAMENTO DOS ENCARGOS SOCIAIS: Kb",{"$nulls":4},"CODIGO:"]
[{"$nulls":5},"PFP-2.2"]
["NOME DA CONSULTORA:"]
[]
["PROJETO:",null,"CONTRATANTE:",null,null,{"$f":"'PFP2.1_FatorKa'!F5","v":"BASE: "}]
[{"$f":"PFP!A6","v":"CONTRATAÇÃO DE EMPRESA DE ENGENHARIA PARA SUPERVISÃO E APOIO À FISCALIZAÇÃO DURANTE OS SERVIÇOS DE EXECUÇÃO DAS OBRAS DA PONTE SOBRE O RIBEIRÃO ÁGUA LIMPA, VIAS DE ACESSO E INFRAESTRUTURA COMPLETA VISANDO A INTERLIGAÇÃO DAS RODOVIAS GO-173 E GO-324, NO MUNICÍPIO DE BRITÂNIA, NO ESTADO DE GOIÁS"},null,"CODEVASF (SEDE)",null,null,{"$f":"'PFP2.1_FatorKa'!F6","v":"SINAPI/GO"}]
["Cod","DESCRIÇÃO",null,null,"%","R$"]
["A","ENCARGOS SOCIAIS BÁSICOS",null,null,{"$f":"ROUND(SUM(E9:E16),4)","v":0.2},{"$f":"ROUND(E8*SUMIF(PFP!$B$8:$B$13,\"MO2\",PFP!$J$8:$J$13),2)","v":0}]
["A1","INSS",null,null,0.2,{"$f":"ROUND(E9*SUMIF(PFP!$B$8:$B$13,\"MO2\",PFP!$J$8:$J$13),2)","v":0}]
["A2","SESI",null,null,0,{"$f":"ROUND(E10*SUMIF(PFP!$B$8:$B$13,\"MO2\",PFP!$J$8:$J$13),2)","v":0}]
{"$rows_left_out":31}
{"sheet":"PFP2.3_FatorKc","index":6,"n_rows":40,"n_cols":6,"rows_kept":40,"cut":false,"hidden":false,"merged":[[37,0,37,5],[38,0,38,5],[39,0,39,5],[0,0,1,4],[31,1,31,3],[32,1,32,3],[33,1,33,3],[34,1,34,3],[36,0,36,5],[26,1,26,3],[27,1,27,3],[28,1,28,3],[29,1,29,3],[30,1,30,3],[21,1,21,3],[22,1,22,3],[23,1,23,3],[24,1,24,3],[25,1,25,3],[16,1,16,3],[17,1,17,3],[18,1,18,3],[19,1,19,3],[20,1,20,3],[11,1,11,3],[12,1,12,3],[13,1,13,3],[14,1,14,3],[15,1,15,3],[6,1,6,3],[7,1,7,3],[8,1,8,3],[9,1,9,3],[10,1,10,3],[2,0,2,5],[3,0,3,5],[4,2,4,4],[5,0,5,1],[5,2,5,4]]}
["DETALHAMENTO DOS ENCARGOS SOCIAIS: Kc",{"$nulls":4},"CODIGO:"]
[{"$nulls":5},"PFP-2.3"]
["NOME DA CONSULTORA:"]
[]
["PROJETO:",null,"CONTRATANTE:",null,null,{"$f":"'PFP2.2_FatorKb'!F5","v":"BASE: "}]
[{"$f":"PFP!A6","v":"CONTRATAÇÃO DE EMPRESA DE ENGENHARIA PARA SUPERVISÃO E APOIO À FISCALIZAÇÃO DURANTE OS SERVIÇOS DE EXECUÇÃO DAS OBRAS DA PONTE SOBRE O RIBEIRÃO ÁGUA LIMPA, VIAS DE ACESSO E INFRAESTRUTURA COMPLETA VISANDO A INTERLIGAÇÃO DAS RODOVIAS GO-173 E GO-324, NO MUNICÍPIO DE BRITÂNIA, NO ESTADO DE GOIÁS"},null,"CODEVASF (SEDE)",null,null,{"$f":"'PFP2.2_FatorKb'!F6","v":"SINAPI/GO"}]
["Cod","DESCRIÇÃO",null,null,"%","R$"]
["A","ENCARGOS SOCIAIS BÁSICOS",null,null,{"$f":"SUM(E9:E16)","v":0},{"$f":"ROUND(E8*SUMIF(PFP!$B$8:$B$13,\"MO3\",PFP!$J$8:$J$13),2)","v":0}]
["A1","INSS",null,null,0,{"$f":"ROUND(E9*SUMIF(PFP!$B$8:$B$13,\"MO3\",PFP!$J$8:$J$13),2)","v":0}]
["A2","SESI",null,null,0,{"$f":"ROUND(E10*SUMIF(PFP!$B$8:$B$13,\"MO3\",PFP!$J$8:$J$13),2)","v":0}]
{"$rows_left_out":31}
{"sheet":"PFP3_FatorKd","index":7,"n_rows":35,"n_cols":6,"rows_kept":35,"cut":false,"hidden":false,"merged":[[0,0,1,4],[30,0,30,5],[31,0,31,5],[32,0,32,5],[33,0,33,5],[34,0,34,5],[25,0,25,5],[26,0,26,5],[27,0,27,5],[28,0,28,5],[29,0,29,5],[16,1,16,3],[21,0,21,5],[22,0,22,5],[23,0,23,5],[24,0,24,5],[11,1,11,3],[12,1,12,3],[13,1,13,3],[14,1,14,3],[15,1,15,3],[6,1,6,2],[7,1,7,2],[8,1,8,2],[9,1,9,2],[10,1,10,2],[2,0,2,5],[3,0,3,5],[4,2,4,4],[5,0,5,1],[5,2,5,4]]}
["DESPESAS FISCAIS E CUSTOS DIVERSOS: Kd",{"$nulls":4},"CODIGO:"]
[{"$nulls":5},"PFP-3"]
["NOME DA CONSULTORA:"]
[]
["PROJETO:",null,"CONTRATANTE:",null,null,{"$f":"'PFP2.3_FatorKc'!F5","v":"BASE: "}]
[{"$f":"PFP!A6","v":"CONTRATAÇÃO DE EMPRESA DE ENGENHARIA PARA SUPERVISÃO E APOIO À FISCALIZAÇÃO DURANTE OS SERVIÇOS DE EXECUÇÃO DAS OBRAS DA PONTE SOBRE O RIBEIRÃO ÁGUA LIMPA, VIAS DE ACESSO E INFRAESTRUTURA COMPLETA VISANDO A INTERLIGAÇÃO DAS RODOVIAS GO-173 E GO-324, NO MUNICÍPIO DE BRITÂNIA, NO ESTADO DE GOIÁS"},null,"CODEVASF (SEDE)",null,null,{"$f":"'PFP2.3_FatorKc'!F6","v":"SINAPI/GO"}]
["Cod","DESCRIÇÃO1",null,"% preço2","% custo4","R$"]
["K4","TRIBUTOS",null,{"$f":"ROUND(D9+D10+D11,4)","v":0.124},{"$f":"ROUND(E9+E10+E11,4)","v":0.1416},{"$f":"E8*SUM(SUMIF(PFP!$B$8:$B$13,\"MO1\",PFP!$J$8:$J$13)*(1+'PFP2.1_FatorKa'!$E$35)+SUMIF(PFP!$B$8:$B$13,\"MO2\",PFP!$J$8:$J$13)*(1+'PFP2.2_FatorKb'!$E$34)+SUMIF(PFP!$B$8:$B$13,\"<>MO*\",PFP!$J$8:$J$13)+$F$13+$F$12)","v":103003.540560857}]
["K4.1","ISS",null,0.05,{"$f":"ROUND((1/(1-$D$8))*D9,4)","v":5.7099999999999998E-2},{"$f":"E9*SUM(SUMIF(PFP!$B$8:$B$13,\"MO1\",PFP!$J$8:$J$13)*(1+'PFP2.1_FatorKa'!$E$35)+SUMIF(PFP!$B$8:$B$13,\"MO2\",PFP!$J$8:$J$13)*(1+'PFP2.2_FatorKb'!$E$34)+SUMIF(PFP!$B$8:$B$13,\"<>MO*\",PFP!$J$8:$J$13)+$F$13+$F$12)","v":41536.032245938703}]
["K4.2","PIS3 - aliquota efetiva aplicavel percentual-desconto",null,{"$f":"ROUND(1.65%*0.8,4)","v":1.32E-2},{"$f":"ROUND((1/(1-$D$8))*D10,4)","v":1.5100000000000001E-2},{"$f":"E10*SUM(SUMIF(PFP!$B$8:$B$13,\"MO1\",PFP!$J$8:$J$13)*(1+'PFP2.1_FatorKa'!$E$35)+SUMIF(PFP!$B$8:$B$13,\"MO2\",PFP!$J$8:$J$13)*(1+'PFP2.2_FatorKb'!$E$34)+SUMIF(PFP!$B$8:$B$13,\"<>MO*\",PFP!$J$8:$J$13)+$F$13+$F$12)","v":10984.1346219558}]
{"$rows_left_out":26}
{"sheet":"Cronograma Físico-Financeiro","index":8,"n_rows":29,"n_cols":22,"rows_kept":29,"cut":false,"hidden":false,"merged":[[25,2,26,2],[27,1,28,2],[23,1,24,2],[14,1,15,1],[16,1,17,1],[18,1,19,1],[20,1,21,1],[4,2,5,2],[6,2,7,2],[8,2,9,2],[10,2,11,2],[12,2,13,2],[14,2,15,2],[16,2,17,2],[18,2,19,2],[20,2,21,2],[4,1,5,1],[6,1,7,1],[8,1,9,1],[10,1,11,1],[12,1,13,1]]}
[null,"CRONOGRAMA FÍSICO-FINANCEIRO"]
[]
[]
[null,null,null,"Mês 1","Mês 2","Mês 3","Mês 4","Mês 5","Mês 6","Mês 7","Mês 8","Mês 9","Mês 10","Mês 11","Mês 12","Mês 13","Mês 14","Mês 15","Mês 16","Mês 17","Mês 18"]
[null,{"$f":"PFP!D8","v":"Engenheiro Pleno"},{"$f":"PFP!K8","v":499508.65},{"$f":"D6*$C$5","v":27750.480555555601},{"$f":"E6*$C$5","v":27750.480555555601},27750.480555555601,27750.480555555601,27750.480555555601,27750.480555555601,27750.480555555601,27750.480555555601,27750.480555555601,{"$f":"M6*$C$5","v":27750.480555555601},27750.480555555601,27750.480555555601,27750.480555555601,27750.480555555601,27750.480555555601,27750.480555555601,27750.480555555601,{"$f":"U6*$C$5","v":27750.480555555601},{"$f":"SUM(D5:U5)","v":499508.65}]
[null,null,null,{"$f":"1/18","v":5.5555555555555601E-2},{"$f":"1/18","v":5.5555555555555601E-2},5.5555555555555601E-2,5.5555555555555601E-2,5.5555555555555601E-2,5.5555555555555601E-2,5.5555555555555601E-2,5.5555555555555601E-2,5.5555555555555601E-2,{"$f":"1/18","v":5.5555555555555601E-2},5.5555555555555601E-2,5.5555555555555601E-2,5.5555555555555601E-2,5.5555555555555601E-2,5.5555555555555601E-2,5.5555555555555601E-2,5.5555555555555601E-2,{"$f":"1/18","v":5.5555555555555601E-2},1]
[null,{"$f":"PFP!D9","v":"Técnico - Profissional Especial"},{"$f":"PFP!K9","v":123054.06},{"$f":"D8*$C$7","v":6836.3366666666698},{"$f":"E8*$C$7","v":6836.3366666666698},6836.3366666666698,6836.3366666666698,6836.3366666666698,6836.3366666666698,6836.3366666666698,6836.3366666666698,{"$f":"L8*$C$7","v":6836.3366666666698},6836.3366666666698,6836.3366666666698,6836.3366666666698,6836.3366666666698,6836.3366666666698,6836.3366666666698,6836.3366666666698,6836.3366666666698,6836.3366666666698,123054.06]
[null,null,null,5.5555555555555601E-2,{"$f":"1/18","v":5.5555555555555601E-2},5.5555555555555601E-2,5.5555555555555601E-2,5.5555555555555601E-2,5.5555555555555601E-2,5.5555555555555601E-2,5.5555555555555601E-2,5.5555555555555601E-2,{"$f":"1/18","v":5.5555555555555601E-2},5.5555555555555601E-2,5.5555555555555601E-2,5.5555555555555601E-2,5.5555555555555601E-2,5.5555555555555601E-2,5.5555555555555601E-2,5.5555555555555601E-2,5.5555555555555601E-2,1]
[null,{"$f":"PFP!D10","v":"Técnico Auxiliar (Laboratorista)"},{"$f":"PFP!K10","v":91597.75},{"$f":"D10*$C$9","v":5088.7638888888896},{"$f":"E10*$C$9","v":5088.7638888888896},5088.7638888888896,5088.7638888888896,5088.7638888888896,5088.7638888888896,5088.7638888888896,5088.7638888888896,{"$f":"L10*$C$9","v":5088.7638888888896},5088.7638888888896,5088.7638888888896,5088.7638888888896,5088.7638888888896,5088.7638888888896,5088.7638888888896,5088.7638888888896,{"$f":"T10*$C$9","v":5088.7638888888896},{"$f":"U10*$C$9","v":5088.7638888888896},91597.75]
[null,null,null,5.5555555555555601E-2,{"$f":"1/18","v":5.5555555555555601E-2},5.5555555555555601E-2,5.5555555555555601E-2,5.5555555555555601E-2,5.5555555555555601E-2,5.5555555555555601E-2,5.5555555555555601E-2,5.5555555555555601E-2,5.5555555555555601E-2,5.5555555555555601E-2,5.5555555555555601E-2,5.5555555555555601E-2,5.5555555555555601E-2,5.5555555555555601E-2,5.5555555555555601E-2,5.5555555555555601E-2,5.5555555555555601E-2,1]
{"$rows_left_out":20}
{"sheet":"CPU-VEICULO_Leve","index":9,"n_rows":84,"n_cols":33,"rows_kept":84,"cut":false,"hidden":false,"merged":[[49,9,49,20],[49,21,49,28],[1,0,1,3],[3,0,3,3],[4,0,4,2],[4,5,4,8],[5,0,5,3]]}
[]
["Composição de Preços de Locação de Veículos"]
[null,"2023-08-23","Data de atualização:","2025-01-22",null,"CV","Média","Mediana",null,null,null,"CV","Média","Mediana",{"$nulls":9},"CV","Média","Mediana"]
["CODEVASF ",{"$nulls":4},{"$f":"_xlfn.STDEV.S(F7:I7)/AVERAGE(F7:I7)","v":0.14663339980248699},{"$f":"AVERAGE(F7:I7)","v":75224.5},{"$f":"MEDIAN(F7:I7)","v":74407.5},null,null,null,{"$f":"_xlfn.STDEV.S(M6:U6)/AVERAGE(M6:U6)","v":0.157223472795852},{"$f":"AVERAGE(M6:U6)","v":26.768888888888899},{"$f":"MEDIAN(M6:U6)","v":27.12},{"$nulls":9},{"$f":"_xlfn.STDEV.S(Y6:AG6)/AVERAGE(Y6:AG6)","v":0.16218949848342901},{"$f":"AVERAGE(Y6:AG6)","v":329.14444444444399},{"$f":"MEDIAN(Y6:AG6)","v":334.75}]
["OBS:               Preço sem BDI e sem motorista                                                           BDI=",{"$nulls":4},"Preço FIPE",{"$nulls":4},"PRODUTO","MENOR","COT. 1","COT. 2","COT. 3","COT. 4","COT. 5","COT. 6","COT. 7","COT. 8","COT. 9",null,"PRODUTO ","MENOR","COT. 1","COT. 2","COT. 3","COT. 4","COT. 5","COT. 6","COT. 7","COT. 8","COT. 9"]
["Veículo Leve 1.0 T. Flex 12V 5p",{"$nulls":4},"Renault Kwid Zen 1.0","Hyndai HB20 Sense 1.0 ","ONIX HATCH LT 1.0 12V Flex 5p Mec.","MOBI TREKKING 1.0 Flex 5p.",null,"LUBRIFICANTE 15W40",{"$f":"SMALL(M4:N4,1)","v":26.768888888888899},27.12,19.010000000000002,28.9,23.9,28.76,33.9,29.44,24.9,24.99,null,"Pneu 185/65 R14",{"$f":"SMALL(Y4:Z4,1)","v":329.14444444444399},289.89999999999998,{"$f":"1255.8/4","v":313.95},289,{"$f":"1339/4","v":334.75},{"$f":"1519.6/4","v":379.9},231,364.9,{"$f":"718/2","v":359},{"$f":"799.8/2","v":399.9}]
[null,null,"Custo Mensal (R$):",{"$f":"D48","v":1727.88820096473},null,63868,80150,88215,68665,null,null,""]
[null,null,"Custo Diário (R$):",{"$f":"D7/30","v":57.596273365491101}]
[null,null,"Custo Horário (R$):",{"$f":"D7/176","v":9.8175465963905406}]
["A",null,"Depreciação mensal do equipamento"]
{"$rows_left_out":53}
{"sheet":"CPU ESCRIT. CONTAINER","index":10,"n_rows":17,"n_cols":4,"rows_kept":17,"cut":false,"hidden":false,"merged":[[2,1,2,2]]}
[]
[null,"Engenharia Consultiva da Codevasf"]
[null,"CPU - HOSPEDAGEM EQUIPE DE CAMPO (4 PESSOAS/MÊS)",null,"Código/Referencia"]
[null,"ALUGUEL CONTAINER ESCRITÓRIO C/ BANHEIRO",{"$f":"1600","v":1600},"4298/ORSE"]
[null,"Aquisição de Mobiliário",{"$f":"'AUX - MOBILIÁRIO'!F10","v":149.11000000000001},"CODE"]
[null,"Material de limpeza e diarista",{"$f":"130.82+(123*4)","v":622.82000000000005},"10563/ORSE - E200300131/EMBASA"]
[null,"Energia ",180,"10555/ORSE"]
[null,"Mobilização e Desmobilização",{"$f":"1200*2/18","v":133.333333333333},"89.50.20/89.50.21/SUDECAP-MG"]
[null,"Água",394.99,"10554/ORSE"]
[null,"telefone/Internet",{"$f":"89","v":89},"10558/ORSE"]
{"$rows_left_out":8}
{"sheet":"MDO -  DNIT","index":11,"n_rows":105,"n_cols":26,"rows_kept":105,"cut":false,"hidden":false,"merged":[[0,0,2,0],[0,1,2,1],[0,2,2,2],[0,3,1,3],[0,24,1,24],[0,4,1,5],[0,22,1,23],[0,6,0,15],[0,16,0,21],[1,6,1,7],[1,8,1,9],[1,10,1,11],[1,12,1,13],[1,14,1,15],[1,16,1,17],[1,18,1,19],[1,20,1,21]]}
["Código","Categoria","Unid.","Salário","Encargos Sociais",null,"Encargos Complementares",{"$nulls":9},"Encargos Adicionais",{"$nulls":5},"Encargos Totais",null,"Valor Total"]
[{"$nulls":6},"Alimentação",null,"EPI",null,"Ferramenta",null,"Transporte",null,"Exame Ocupacional",null,"Cesta Básica",null,"Assistência Médica",null,"Seguro de Vida"]
[null,null,null,"R$","%","R$","%","R$","%","R$","%","R$","%","R$","%","R$","%","R$","%","R$","%","R$","%","R$","R$"]
["Profissionais mensalistas"]
["P8001","Advogado júnior","mês",4915.72,0.79300000000000004,3898.16,0.14990000000000001,736.74,5.4999999999999997E-3,26.96,0,0,0,0,5.9999999999999995E-4,2.86,0,0,6.3E-2,309.62,2E-3,9.98,1.014,4984.34,9900.0499999999993,{"$f":"Y5-F5-D5","v":1086.17}]
["P8002","Advogado pleno","mês",6554.29,0.79300000000000004,5197.55,0.1124,736.74,4.1000000000000003E-3,26.96,0,0,0,0,4.0000000000000002E-4,2.86,0,0,4.7199999999999999E-2,309.62,1.5E-3,9.98,0.9587,6283.72,12838.01,{"$f":"Y6-F6-D6","v":1086.17}]
["P8003","Advogado sênior","mês",12196.82,0.79300000000000004,9672.08,6.0400000000000002E-2,736.74,2.2000000000000001E-3,26.96,0,0,0,0,2.0000000000000001E-4,2.86,0,0,2.5399999999999999E-2,309.62,8.0000000000000004E-4,9.98,0.8821,10758.25,22955.07,1086.17]
["P8007","Analista de desenvolvimento de sistemas júnior","mês",4417.8100000000004,0.79590000000000005,3516.13,0.1668,736.74,0,0,0,0,0,0,8.0000000000000004E-4,3.5,0,0,7.0099999999999996E-2,309.62,2.3E-3,9.98,1.0358000000000001,4575.97,8993.7800000000007,1059.8399999999999]
["P8008","Analista de desenvolvimento de sistemas pleno","mês",5699.98,0.79590000000000005,4536.6099999999997,0.1293,736.74,0,0,0,0,0,0,5.9999999999999995E-4,3.5,0,0,5.4300000000000001E-2,309.62,1.8E-3,9.98,0.98180000000000001,5596.45,11296.43,1059.8399999999999]
["P8009","Analista de desenvolvimento de sistemas sênior","mês",10119.99,0.79590000000000005,8054.5,7.2800000000000004E-2,736.74,0,0,0,0,0,0,2.9999999999999997E-4,3.5,0,0,3.0599999999999999E-2,309.62,1E-3,9.98,0.90059999999999996,9114.34,19234.34,1059.8499999999999]
{"$rows_left_out":96}
{"sheet":"C.G - DNIT","index":12,"n_rows":27,"n_cols":8,"rows_kept":27,"cut":false,"hidden":false,"merged":[[24,3,24,4],[25,3,25,4],[3,1,4,1],[5,1,9,1],[15,1,16,1],[17,1,18,1],[19,1,23,1],[24,1,25,1],[3,2,4,2],[3,3,4,3],[3,4,4,4],[18,3,18,4],[19,3,19,4],[20,3,20,4],[21,3,21,4],[22,3,22,4],[3,5,3,6],[14,3,14,4],[15,3,15,4],[16,3,16,4],[17,3,17,4]]}
[null,"2025-01-01"]
[null,"Tabela 1 - Custos de veículos "]
[null,{"$f":"\"Tabela de Preços de Consultoria - mês de referência: \"&TEXT(B1,\"MMMM\")&\" de \"&TEXT(B1,\"AAAA\")","v":"Tabela de Preços de Consultoria - mês de referência: janeiro de 2025"}]
[null,"Item","Código","Tipo","Unidade","Custo unitário (R$ / un)",null,"S"]
[{"$nulls":5},"Produtivo","Improdutivo"]
[null,"Veículos","E8889","Veículo leve - 53 kW (sem motorista)","hora",35.28,6.33]
[null,null,"E8890","Veículo leve - 53 kW (com motorista)","hora",62.59,33.64]
[null,null,"E8891","Veículo leve picape 4 x 4 com capacidade de 1,10 t - 147 kW (sem motorista)","hora",78.47,22.75]
[null,null,"E8888","Veículo tipo van furgão com capacidade de 1,38 t - 100 kW (sem motorista)","hora",55.73,17.2]
[null,null,"E8887","Veículo tipo van furgão com capacidade de 1,38 t - 100 kW (com motorista)","hora",83.04,44.51]
{"$rows_left_out":18}
{"sheet":"AUX - MOBILIÁRIO","index":13,"n_rows":71,"n_cols":7,"rows_kept":71,"cut":false,"hidden":false,"merged":[[0,0,3,5],[4,0,5,5],[7,1,7,4],[44,0,44,6],[70,0,70,6],[7,0,8,0],[7,5,8,5]]}
[]
[]
[]
[]
["COMPOSIÇÃO DO PREÇO UNITÁRIO MENSAL PARA ALUGUEL DE MOBILIÁRIO E EQUIPAMENTOS DE ESCRITÓRIO"]
[]
[]
[" AQUISIÇÃO DE MOBILIÁRIO","VALOR DA DEPRECIAÇÃO",null,null,null,"VALOR MENSAL TOTAL (R$)"]
[null,"Tempo de Utilização (Anos)","Meses p/Ano de Uso","Percentual Residual (%)","Depreciação        Mensal - R$"]
[{"$f":"SUM(E13:E17)","v":3354.99},1.5,12,0.2,{"$f":"ROUND((A10*(100%-D10))/(B10*C10),2)","v":149.11000000000001},{"$f":"E10","v":149.11000000000001}]
{"$rows_left_out":30}
{"sheet":"AUX - NOTEBOOK","index":14,"n_rows":47,"n_cols":10,"rows_kept":47,"cut":false,"hidden":false,"merged":[[0,0,3,7],[4,0,5,7],[7,1,7,4],[7,5,7,6],[46,0,46,8],[72,0,72,8],[7,0,8,0],[7,7,8,7]]}
[]
[]
[]
[]
["COMPOSIÇÃO DO PREÇO UNITÁRIO MENSAL PARA ALUGUEL DE NOTEBOOK"]
[]
[]
[" AQUISIÇÃO DE EQUIPAMENTO","VALOR DA DEPRECIAÇÃO",null,null,null,"MANUTENÇÃO",null,"VALOR MENSAL TOTAL (R$)"]
[null,"Tempo de Utilização (Anos)","Meses p/Ano de Uso","Percentual Residual (%)","Depreciação        Mensal - R$","Percentual Anual (%)","Valor Mensal (R$)"]
[{"$f":"SUM(E13:E18)","v":2599.0571428571402},1.5,12,0.25,{"$f":"ROUND((A10*(100%-D10))/(B10*C10),2)","v":108.29},0.05,{"$f":"ROUND((F10*A10)/12,2)","v":10.83},{"$f":"E10+G10","v":119.12}]
{"$rows_left_out":14}
{"sheet":"AUX - IMPRESSORA","index":15,"n_rows":47,"n_cols":8,"rows_kept":47,"cut":false,"hidden":false,"merged":[[0,0,3,7],[4,0,5,7],[7,1,7,4],[7,5,7,6],[46,0,46,8],[72,0,72,8],[7,0,8,0],[7,7,8,7]]}
[]
[]
[]
[]
["COMPOSIÇÃO DO PREÇO UNITÁRIO MENSAL PARA ALUGUEL DE IMPRESSORA"]
[]
[]
[" AQUISIÇÃO DE EQUIPAMENTO","VALOR DA DEPRECIAÇÃO",null,null,null,"MANUTENÇÃO",null,"VALOR MENSAL TOTAL (R$)"]
[null,"Tempo de Utilização (Anos)","Meses p/Ano de Uso","Percentual Residual (%)","Depreciação        Mensal - R$","Percentual Anual (%)","Valor Mensal (R$)"]
[{"$f":"SUM(E13:E18)","v":1528.2280000000001},1.5,12,0.25,{"$f":"ROUND((A10*(100%-D10))/(B10*C10),2)","v":63.68},0.05,{"$f":"ROUND((F10*A10)/12,2)","v":6.37},{"$f":"E10+G10","v":70.05}]
{"$rows_left_out":14}