{"text_format":"2","workbook":"xlsx","n_sheets":7,"sheets":["ORÇAMENTO","CPU-SERV","CPU-FORNEC","AUX-VEIC.","BDI SERV","BDI FORN","CRONOGRAMA"],"not_rendered":{"charts":0,"images":3,"macros":0,"external_links":1,"defined_names":9,"comments":2,"pivot_tables":0},"unopened":[],"bounds":{"document_bytes":16777216,"sheet_cells":100000,"run_cost":"one","rows_first":2000,"rows_last":500,"rows_between":2000,"halvings":0,"cell_chars":16384,"cell_head_chars":4096},"cells_cut":0,"cells_raw":0,"read":"whole","date_system":"1900"}

{"sheet":"ORÇAMENTO","index":0,"n_rows":43,"n_cols":24,"rows_kept":43,"cut":false,"hidden":false,"merged":[[42,1,42,4],[0,0,8,0],[0,4,0,11],[1,4,1,11],[2,4,2,11],[6,1,6,4],[7,1,7,11],[4,2,4,8],[5,2,5,8],[5,9,5,10],[6,9,6,10],[29,14,29,16],[35,14,35,16],[4,9,4,10],[16,14,16,16],[23,14,23,16],[9,14,9,16]]}
["<---- NUMERAR SERVIÇOS PARA CPU",null,null,null,"Ministério do Desenvolvimento Regional"]
[{"$nulls":4},"Companhia de Desenvolvimento dos Vales do São Francisco e do Parnaíba"]
[{"$nulls":4},"1ª Superintendência Regional"]
[]
[null,"OBRA: "," PAVIMENTAÇÃO ASFÁLTICA EM CBUQ - VIAS URBANAS DIVERSAS - BOCAIUVA / MG",{"$nulls":6},"BDI Serviços % :",null,{"$f":"'BDI SERV'!E26","v":21.35}]
[null,"DATA:"," SETEMBRO / 2025",{"$nulls":6},"BDI Diferenc. Serviços % :",null,{"$f":"'BDI FORN'!D31","v":15}]
[null,"PRAZO DE EXECUÇÃO:     180 DIAS",{"$nulls":7},"BDI Fornecimentos % :",null,{"$f":"'BDI FORN'!D31","v":15}]
[null,"PLANILHA DE ORÇAMENTAÇÃO"]
[null,"ITEM","CÓDIGO","FONTE","DISCRIMINAÇÃO","TIPO","UNID.","QUANT.","VR.UNIT.S/BDI","PR. UNIT.C/BDI","C. TOT.S/BDI","P. TOT.C/BDI"]
["A",1,null,null,"SERVIÇOS PRELIMINARES ",{"$nulls":5},{"$f":"SUM(K11:K16)","v":220989.65999999997},{"$f":"SUM(L11:L16)","v":268123.43}]
[1,"1.1","CPU.1","CODEVASF","MOBILIZAÇÃO E DESMOBILIZAÇÃO","SERV","GL",1,{"$f":"VLOOKUP(A11,'CPU-SERV'!A:K,11,0)","v":13699.37},{"$f":"TRUNC(IF(F11=\"SERV\",I11*(1+$L$5/100),IF(F11=\"SERV DIF\",I11*(1+$L$6/100),IF(F11=\"FORN\",I11*(1+$L$7/100),))),2)","v":16624.18},{"$f":"TRUNC(H11*I11,2)","v":13699.37},{"$f":"TRUNC(H11*J11,2)","v":16624.18}]
[2,"1.2","CPU.2","CODEVASF","ADMINISTRAÇÃO LOCAL ","SERV","GL",1,{"$f":"VLOOKUP(A12,'CPU-SERV'!A:K,11,0)","v":140558.79},{"$f":"TRUNC(IF(F12=\"SERV\",I12*(1+$L$5/100),IF(F12=\"SERV DIF\",I12*(1+$L$6/100),IF(F12=\"FORN\",I12*(1+$L$7/100),))),2)","v":170568.09},{"$f":"TRUNC(H12*I12,2)","v":140558.79},{"$f":"TRUNC(H12*J12,2)","v":170568.09}]
[3,"1.3","CPU.3","CODEVASF","CANTEIRO DE OBRAS ","SERV","GL",1,{"$f":"VLOOKUP(A13,'CPU-SERV'!A:K,11,0)","v":14467.74},17556.599999999999,14467.74,17556.599999999999]
[4,"1.4",103689,"SINAPI","PLACA DE OBRA EM CHAPA DE AÇO GALVANIZADO","SERV","M2",4,{"$f":"VLOOKUP(A14,'CPU-SERV'!A:K,11,0)","v":547.64},664.56,2190.56,2658.24]
[5,"1.5","CPU.4","CODEVASF","VEÍCULO PARA A FISCALIZAÇÃO, MÁXIMO 02 ANOS DE USO OU 50.000KM, PREFERENCIALMENTE NA COR BRANCA, COM IDENTIFICAÇÃO CONFORME ESPECIFICAÇÕES DA CODEVASF, INCLUSIVE COMBUSTÍVEL, MANUTENÇÃO, SEGURO E IMPOSTOS - CONFORME ESPECIFICAÇÕES","SERV","MÊS",8,{"$f":"VLOOKUP(A15,'CPU-SERV'!A:K,11,0)","v":4264.1499999999996},5174.54,34113.199999999997,41396.32]
[6,"1.6",78472,"SINAPI","SERVIÇOS TOPOGRÁFICOS PARA PAVIMENTAÇÃO, INCLUSIVE LEVANTAMENTO PLANIALTIMÉTRICO CADASTRAL, GERAÇÃO DE NOTAS DE SERVIÇO, SEÇÕES TRANSVERSAIS E GREIDE, ESTAQUEAMENTO E ACOMPANHAMENTO EXECUTIVO","SERV","M2",28000,{"$f":"VLOOKUP(A16,'CPU-SERV'!A:K,11,0)","v":0.56999999999999995},0.69,15960,19320]
["B",2,null,null,"TERRAPLANAGEM E PAVIMENTAÇÃO",{"$nulls":5},{"$f":"SUM(K18:K23)","v":665476},{"$f":"SUM(L18:L23)","v":806976}]
[7,"2.1",5502140,"SICRO","ESCAVAÇÃO, CARGA E TRANSPORTE DE MATERIAL DE 1ª CATEGORIA - DMT 1.000 A 1.200M, CAMINHO DE SERVIÇO EM REVESTIMENTO PRIMÁRIO","SERV","M3",4200,{"$f":"VLOOKUP(A18,'CPU-SERV'!A:K,11,0)","v":6.9},8.3699999999999992,{"$f":"TRUNC(H18*I18,2)","v":28980},{"$f":"TRUNC(H18*J18,2)","v":35154}]
[9,"2.3",4011209,"SICRO","REGULARIZAÇÃO DO SUBLEITO - 100% PROCTOR INTERMEDIÁRIO","SERV","M2",28000,{"$f":"VLOOKUP(A19,'CPU-SERV'!A:K,11,0)","v":1.56},1.89,43680,52920]
[10,"2.4","4011276a","SICRO","EXECUÇÃO E COMPACTAÇÃO DE BASE E OU SUB BASE PARA PAVIMENTAÇÃO DE BICA CORRIDA COM BRITA COMERCIAL - 100% PROCTOR MODIFICADO","SERV","M3",4200,{"$f":"VLOOKUP(A20,'CPU-SERV'!A:K,11,0)","v":46.3},56.18,194460,235956]
[12,"2.5",4011352,"SICRO","IMPRIMAÇÃO COM EMULSÃO ASFÁLTICA (EAI)","SERV","M2",28000,{"$f":"VLOOKUP(A21,'CPU-SERV'!A:K,11,0)","v":0.41},0.49,11480,13720,{"$nulls":11},"valor do item"]
[13,"2.6",4011353,"SICRO","PINTURA DE LIGAÇÃO COM EMULSÃO ASFÁLTICA RR-1C","SERV","M2",24200,{"$f":"VLOOKUP(A22,'CPU-SERV'!A:K,11,0)","v":0.28000000000000003},0.33,6776,7986]
[14,"2.7",4011463,"SICRO","EXECUÇÃO DE PAVIMENTO COM APLICAÇÃO DE CONCRETO ASFÁLTICO USINADO A QUENTE (CBUQ), CAMADA DE ROLAMENTO - EXCLUSIVE TRANSPORTE","SERV","T",2000,{"$f":"VLOOKUP(A23,'CPU-SERV'!A:K,11,0)","v":190.05},230.62,380100,461240]
["C",3,null,null,"TRANSPORTE DE MATERIAIS",{"$nulls":5},{"$f":"SUM(K25:K29)","v":286790},{"$f":"SUM(L25:L29)","v":347238}]
[15,"3.1",5915321,"SICRO","TRANSPORTE COM CAMINHÃO BASCULANTE, EM RODOVIA PAVIMENTADA","SERV","TXKM",260000,{"$f":"VLOOKUP(A25,'CPU-SERV'!A:K,11,0)","v":0.66},0.8,{"$f":"TRUNC(H25*I25,2)","v":171600},{"$f":"TRUNC(H25*J25,2)","v":208000}]
[16,"3.2",5915320,"SICRO","TRANSPORTE COM CAMINHÃO BASCULANTE, RODOVIA EM REVESTIMENTO PRIMÁRIO","SERV","TXKM",32000,{"$f":"VLOOKUP(A26,'CPU-SERV'!A:K,11,0)","v":0.73},0.88,23360,28160]
[17,"3.3",5914434,"SICRO","TRANSPORTE COM CAMINHÃO CARROCERIA 9T, EM VIA URBANA PAVIMENTADA","SERV","TXKM",4600,{"$f":"VLOOKUP(A27,'CPU-SERV'!A:K,11,0)","v":0.79},0.95,3634,4370]
[18,"3.4",5914612,"SICRO","TRANSPORTE DE MASSA ASFÁLTICA COM CAMINHÃO BASCULANTE COM CAÇAMBA TÉRMICA, EM VIA URBANA PAVIMENTADA","SERV","TXKM",108000,{"$f":"VLOOKUP(A28,'CPU-SERV'!A:K,11,0)","v":0.81},0.98,87480,105840]
[20,"3.5",5914622,"SICRO","TRANSPORTE COM CAMINHÃO TANQUE DE TRANSPORTE DE MATERIAL ASFÁLTICO DE 30000 L, EM VIA URBANA PAVIMENTADA","SERV","TXKM",400,{"$f":"VLOOKUP(A29,'CPU-SERV'!A:K,11,0)","v":1.79},2.17,716,868]
["E",4,null,null,"DRENAGEM E OBRAS COMPLEMENTARES",{"$nulls":5},{"$f":"SUM(K31:K35)","v":572856.69999999995},{"$f":"SUM(L31:L35)","v":695149.2}]
[21,"4.1",94273,"SINAPI","ASSENTAMENTO DE GUIA (MEIO-FIO) PRÉ-MOLDADO DE CONCRETO - 100X15X13X30 CM (COMPRIMENTO X BASE INFERIOR X BASE SUPERIOR X ALTURA) - USO VIÁRIO","SERV","M",8400,{"$f":"VLOOKUP(A31,'CPU-SERV'!A:K,11,0)","v":42.58},51.67,{"$f":"TRUNC(H31*I31,2)","v":357672},{"$f":"TRUNC(H31*J31,2)","v":434028}]
[23,"4.2","94287a","SINAPI","EXECUÇÃO DE SARJETA EM CONCRETO USINADO, MOLDADO IN LOCO - 30CM DE BASE X 5CM DE ALTURA","SERV","M",8400,{"$f":"VLOOKUP(A32,'CPU-SERV'!A:K,11,0)","v":24.03},29.16,201852,244944]
[46,"4.3",5213440,"SICRO","PLACA DE REGULAMENTAÇÃO EM AÇO, D=60CM - PELÍCULA RETRORREFLETIVA - FORNECIMENTO E INSTALAÇÃO, INCLUSIVE  SUPORTE","SERV","UN.",10,{"$f":"VLOOKUP(A33,'CPU-SERV'!A:K,11,0)","v":271.87},329.91,2718.7,3299.1]
[49,"4.4",5213401,"SICRO","PINTURA DE EIXO VIÁRIO SOBRE ASFALTO COM TINTA RETRORREFLETIVA A BASE DE RESINA ACRÍLICA COM MICROESFERAS DE VIDRO, APLICAÇÃO MECÂNICA COM DEMARCADORA AUTOPROPELIDA","SERV","M2",210,{"$f":"VLOOKUP(A34,'CPU-SERV'!A:K,11,0)","v":27.24},33.049999999999997,5720.4,6940.5]
[51,"4.5",5213405,"SICRO","PINTURA DE FAIXA DE PEDESTRE OU ZEBRADA TINTA RETRORREFLETIVA A BASE DE RESINA ACRÍLICA COM MICROESFERAS DE VIDRO, APLICAÇÃO MANUAL","SERV","M2",120,{"$f":"VLOOKUP(A35,'CPU-SERV'!A:K,11,0)","v":40.78},49.48,4893.6000000000004,5937.6]
["F",5,null,null,"FORNECIMENTOS - MATERIAL ASFÁLTICO (BDI DIFERENCIADO)",{"$nulls":5},{"$f":"SUM(K37:K42)","v":728273.29},{"$f":"SUM(L37:L42)","v":837513.37999999989}]
["F1","5.1","CPU.5","CODEVASF","AQUISIÇÃO DE EMULSÃO ASFÁLTICA PARA IMPRIMAÇÃO (EAI) - EXCLUSIVE TRANSPORTE","FORN","T",36,{"$f":"VLOOKUP(A37,'CPU-FORNEC'!A:J,9,0)","v":2732.37},3142.22,{"$f":"TRUNC(H37*I37,2)","v":98365.32},{"$f":"TRUNC(H37*J37,2)","v":113119.92}]
["F2","5.2","CPU.6","CODEVASF","TRANSPORTE DE EMULSÃO ASFÁLTICA PARA IMPRIMAÇÃO (EAI)","SERV DIF","T",36,{"$f":"VLOOKUP(A38,'CPU-FORNEC'!A:J,9,0)","v":359.79},413.75,12952.44,14895]
["F3","5.3","CPU.7","CODEVASF","AQUISIÇÃO DE EMULSAO ASFALTICA CATIONICA RR-1C - EXCLUSIVE TRANSPORTE","FORN","T",10.8,{"$f":"VLOOKUP(A39,'CPU-FORNEC'!A:J,9,0)","v":3375.89},3882.27,36459.61,41928.51]
["F4","5.4","CPU.8","CODEVASF","TRANSPORTE DE EMULSÃO ASFÁLTICA CATIONICA RR-1C","SERV DIF","T",10.8,{"$f":"VLOOKUP(A40,'CPU-FORNEC'!A:J,9,0)","v":393.78},452.84,4252.82,4890.67]
["F5","5.5","CPU.9","CODEVASF","AQUISIÇÃO DE CONCRETO ASFÁLTICO DE PETRÓLEO - CAP 50/70 - EXCLUSIVE TRANSPORTE","FORN","T",110.8,{"$f":"VLOOKUP(A41,'CPU-FORNEC'!A:J,9,0)","v":4511.6000000000004},5188.34,499885.28,574868.06999999995]
["F6","5.6","CPU.10","CODEVASF","TRANSPORTE DE CONCRETO ASFÁLTICO DE PETRÓLEO - CAP 50/70","SERV DIF","T",110.8,{"$f":"VLOOKUP(A42,'CPU-FORNEC'!A:J,9,0)","v":689.15},792.52,76357.820000000007,87811.21]
[null,"TOTAL GERAL DA OBRA COM BDI ",{"$nulls":8},{"$f":"SUM(K10,K17,K24,K30,K36)","v":2474385.65},{"$f":"SUM(L10,L17,L24,L30,L36)-0.01","v":2955000}]

{"sheet":"CPU-SERV","index":1,"n_rows":954,"n_cols":11,"rows_kept":954,"cut":false,"hidden":false,"merged":[[42,0,84,0],[43,2,43,9],[497,1,498,3],[497,4,497,5],[498,4,498,5],[499,2,499,7],[499,8,499,9],[500,1,501,2],[500,3,501,3],[500,4,500,5],[500,6,500,7],[495,0,547,0],[496,2,496,9],[46,2,46,7],[46,8,46,9],[47,1,48,2],[60,3,60,7],[63,7,63,9],[66,3,66,7],[67,7,67,9],[44,1,45,3],[44,4,44,5],[45,4,45,5],[72,3,72,7],[580,1,581,2],[580,3,581,3],[580,4,581,4],[580,5,580,7],[580,9,581,9],[527,3,527,7],[529,8,529,9],[536,3,536,7],[562,3,562,7],[546,5,546,7],[574,3,574,7],[537,1,538,2],[554,1,555,2],[554,4,554,5],[554,6,554,7],[559,7,559,9],[553,2,553,7],[545,3,545,7],[619,4,620,4],[619,5,619,7],[619,9,620,9],[623,3,623,7],[508,7,508,9],[510,3,510,7],[511,3,511,7],[512,3,512,7],[515,7,515,9],[520,7,520,8],[576,8,576,9],[579,3,579,7],[525,7,525,9],[524,3,524,7],[537,3,538,3],[537,4,538,4],[537,5,537,7],[537,9,538,9],[564,3,564,7],[567,7,567,9],[570,3,570,7],[571,7,571,9],[553,8,553,9],[554,3,555,3],[588,0,625,0],[589,2,589,9],[590,1,591,3],[590,4,590,5],[591,4,591,5],[592,2,592,7],[592,8,592,9],[593,1,594,2],[593,3,594,3],[593,4,593,5],[593,6,593,7],[598,7,598,9],[601,3,601,7],[602,3,602,7],[603,3,603,7],[606,7,606,9],[609,3,609,7],[610,7,610,9],[613,3,613,7],[615,8,615,9],[624,5,624,7],[618,3,618,7],[619,1,620,2],[619,3,620,3],[7,13,7,15],[18,11,18,13],[24,3,24,7],[4,2,4,7],[4,8,4,9],[5,1,6,2],[5,3,6,3],[5,4,5,5],[5,6,5,7],[0,0,40,0],[3,4,3,5],[0,11,0,12],[1,11,1,12],[2,4,2,5],[1,2,1,9],[2,1,3,3],[34,3,35,3],[34,4,35,4],[34,5,34,7],[34,9,35,9],[38,3,38,7],[39,5,39,7],[13,7,13,9],[16,3,16,7],[17,3,17,7],[18,3,18,7],[21,7,21,9],[33,3,33,7],[34,1,35,2],[25,7,25,9],[28,3,28,7],[2,10,2,11],[30,8,30,9],[74,8,74,9],[47,3,48,3],[47,4,47,5],[47,6,47,7],[52,7,52,9],[58,3,58,7],[59,3,59,7],[82,3,82,7],[83,5,83,7],[88,4,88,5],[77,3,77,7],[78,1,79,2],[78,3,79,3],[78,4,79,4],[78,5,78,7],[78,9,79,9],[117,1,118,2],[117,3,118,3],[117,4,118,4],[117,5,117,7],[117,9,118,9],[121,3,121,7],[96,7,96,9],[101,3,101,7],[104,7,104,9],[107,3,107,7],[108,7,108,9],[111,3,111,7],[113,8,113,9],[116,3,116,7],[99,3,99,7],[100,3,100,7],[122,5,122,7],[125,0,164,0],[126,2,126,9],[127,1,128,3],[127,4,127,5],[128,4,128,5],[129,2,129,7],[129,8,129,9],[162,3,162,7],[163,5,163,7],[86,0,123,0],[87,2,87,9],[88,1,89,3],[89,4,89,5],[90,2,90,7],[90,8,90,9],[91,1,92,2],[91,3,92,3],[91,4,91,5],[91,6,91,7],[139,3,139,7],[140,3,140,7],[143,7,143,9],[148,3,148,7],[149,7,149,9],[152,3,152,7],[130,1,131,2],[130,3,131,3],[130,4,130,5],[130,6,130,7],[135,7,135,9],[138,3,138,7],[154,8,154,9],[157,3,157,7],[158,1,159,2],[158,3,159,3],[158,4,159,4],[158,5,158,7],[158,9,159,9],[199,3,199,7],[201,8,201,9],[179,3,179,7],[180,3,180,7],[181,3,181,7],[170,8,170,9],[171,1,172,2],[171,3,172,3],[171,4,171,5],[171,6,171,7],[213,0,252,0],[214,2,214,9],[215,1,216,3],[215,4,215,5],[216,4,216,5],[217,2,217,7],[250,3,250,7],[251,5,251,7],[166,0,211,0],[167,2,167,9],[168,1,169,3],[168,4,168,5],[169,4,169,5],[170,2,170,7],[204,3,204,7],[205,1,206,2],[205,3,206,3],[205,4,206,4],[205,5,205,7],[205,9,206,9],[258,8,258,9],[259,1,260,2],[259,3,260,3],[259,4,259,5],[176,7,176,9],[228,3,228,7],[229,3,229,7],[230,3,230,7],[233,7,233,9],[236,3,236,7],[237,7,237,9],[217,8,217,9],[218,1,219,2],[218,3,219,3],[218,4,218,5],[218,6,218,7],[223,7,223,9],[209,3,209,7],[210,5,210,7],[184,7,184,9],[187,3,187,7],[188,7,188,9],[259,6,259,7],[254,0,291,0],[255,2,255,9],[256,1,257,3],[256,4,256,5],[257,4,257,5],[258,2,258,7],[240,3,240,7],[242,8,242,9],[245,3,245,7],[246,1,247,2],[246,3,247,3],[246,4,247,4],[246,5,246,7],[246,9,247,9],[279,3,279,7],[281,8,281,9],[284,3,284,7],[285,1,286,2],[285,3,286,3],[285,4,286,4],[285,5,285,7],[285,9,286,9],[267,3,267,7],[268,3,268,7],[336,0,375,0],[337,2,337,9],[338,1,339,3],[338,4,338,5],[339,4,339,5],[340,2,340,7],[373,3,373,7],[374,5,374,7],[293,0,334,0],[294,2,294,9],[295,1,296,3],[295,4,295,5],[296,4,296,5],[297,2,297,7],[322,3,322,7],[324,8,324,9],[327,3,327,7],[328,1,329,2],[328,3,329,3],[328,4,329,4],[297,8,297,9],[298,1,299,2],[298,3,299,3],[298,4,298,5],[264,7,264,9],[289,3,289,7],[290,5,290,7],[269,3,269,7],[272,7,272,9],[275,3,275,7],[276,7,276,9],[310,3,310,7],[311,3,311,7],[298,6,298,7],[307,7,307,9],[312,3,312,7],[315,7,315,9],[318,3,318,7],[319,7,319,9],[363,3,363,7],[365,8,365,9],[368,3,368,7],[351,3,351,7],[352,3,352,7],[353,3,353,7],[356,7,356,9],[359,3,359,7],[340,8,340,9],[341,3,342,3],[341,4,341,5],[341,6,341,7],[348,7,348,9],[369,1,370,2],[369,3,370,3],[369,4,370,4],[369,5,369,7],[369,9,370,9],[328,5,328,7],[328,9,329,9],[360,7,360,9],[341,1,342,2],[332,3,332,7],[333,5,333,7],[395,7,395,9],[398,3,398,7],[399,7,399,9],[402,3,402,7],[404,8,404,9],[407,3,407,7],[377,0,414,0],[378,2,378,9],[379,1,380,3],[379,4,379,5],[380,4,380,5],[381,2,381,7],[412,3,412,7],[413,5,413,7],[396,7,396,8],[408,1,409,2],[408,3,409,3],[408,4,409,4],[408,5,408,7],[408,9,409,9],[381,8,381,9],[382,1,383,2],[382,3,383,3],[382,4,382,5],[382,6,382,7],[387,7,387,9],[390,3,390,7],[391,3,391,7],[392,3,392,7],[481,3,481,7],[455,0,493,0],[456,2,456,9],[457,1,458,3],[457,4,457,5],[458,4,458,5],[459,2,459,7],[491,3,491,7],[492,5,492,7],[483,8,483,9],[486,3,486,7],[487,1,488,2],[487,3,488,3],[487,4,488,4],[487,5,487,7],[487,9,488,9],[469,3,469,7],[470,3,470,7],[471,3,471,7],[474,7,474,9],[477,3,477,7],[478,7,478,9],[459,8,459,9],[460,1,461,2],[416,0,453,0],[417,2,417,9],[418,1,419,3],[418,4,418,5],[419,4,419,5],[420,2,420,7],[443,8,443,9],[446,3,446,7],[447,1,448,2],[447,3,448,3],[437,3,437,7],[438,7,438,9],[447,4,448,4],[447,5,447,7],[447,9,448,9],[429,3,429,7],[420,8,420,9],[421,1,422,2],[421,3,422,3],[421,4,421,5],[421,6,421,7],[426,7,426,9],[441,3,441,7],[434,7,434,9],[460,3,461,3],[460,4,460,5],[460,6,460,7],[466,7,466,9],[451,3,451,7],[452,5,452,7],[430,3,430,7],[431,3,431,7],[435,7,435,8],[584,3,584,7],[585,5,585,7],[627,0,664,0],[628,2,628,9],[629,1,630,3],[629,4,629,5],[630,4,630,5],[631,2,631,7],[662,3,662,7],[663,5,663,7],[549,0,586,0],[550,2,550,9],[551,1,552,3],[551,4,551,5],[552,4,552,5],[652,3,652,7],[654,8,654,9],[657,3,657,7],[658,1,659,2],[658,3,659,3],[658,4,659,4],[658,5,658,7],[658,9,659,9],[563,3,563,7],[670,8,670,9],[671,1,672,2],[671,3,672,3],[671,4,671,5],[671,6,671,7],[676,7,676,9],[649,7,649,9],[631,8,631,9],[632,1,633,2],[632,3,633,3],[632,4,632,5],[632,6,632,7],[637,7,637,9],[640,3,640,7],[641,3,641,7],[642,3,642,7],[645,7,645,9],[648,3,648,7],[691,3,691,7],[693,8,693,9],[696,3,696,7],[697,1,698,2],[697,3,698,3],[697,4,698,4],[697,5,697,7],[697,9,698,9],[679,3,679,7],[680,3,680,7],[681,3,681,7],[684,7,684,9],[687,3,687,7],[688,7,688,9],[709,8,709,9],[710,1,711,2],[710,3,711,3],[710,4,710,5],[710,6,710,7],[715,7,715,9],[701,3,701,7],[702,5,702,7],[705,0,742,0],[706,2,706,9],[707,1,708,3],[707,4,707,5],[708,4,708,5],[709,2,709,7],[740,3,740,7],[741,5,741,7],[666,0,703,0],[667,2,667,9],[668,1,669,3],[668,4,668,5],[669,4,669,5],[670,2,670,7],[730,3,730,7],[732,8,732,9],[749,1,750,2],[749,3,750,3],[749,4,749,5],[749,6,749,7],[754,7,754,9],[718,3,718,7],[719,3,719,7],[720,3,720,7],[723,7,723,9],[726,3,726,7],[727,7,727,9],[735,3,735,7],[736,1,737,2],[736,3,737,3],[736,4,737,4],[736,5,736,7],[736,9,737,9],[780,5,780,7],[801,7,801,9],[806,3,806,7],[807,7,807,9],[787,8,787,9],[775,1,776,2],[775,3,776,3],[775,4,776,4],[775,5,775,7],[775,9,776,9],[788,1,789,2],[788,3,789,3],[788,4,788,5],[788,6,788,7],[793,7,793,9],[787,2,787,7],[769,3,769,7],[771,8,771,9],[774,3,774,7],[748,8,748,9],[779,3,779,7],[757,3,757,7],[758,3,758,7],[759,3,759,7],[762,7,762,9],[765,3,765,7],[766,7,766,9],[744,0,781,0],[745,2,745,9],[746,1,747,3],[746,4,746,5],[747,4,747,5],[748,2,748,7],[796,3,796,7],[783,0,822,0],[784,2,784,9],[785,1,786,3],[785,4,785,5],[786,4,786,5],[820,3,820,7],[821,5,821,7],[810,3,810,7],[812,8,812,9],[815,3,815,7],[816,1,817,2],[816,3,817,3],[816,4,817,4],[816,5,816,7],[816,9,817,9],[797,3,797,7],[798,3,798,7],[855,1,856,2],[855,3,856,3],[855,4,856,4],[855,5,855,7],[855,9,856,9],[842,7,842,9],[845,3,845,7],[846,7,846,9],[824,0,861,0],[825,2,825,9],[826,1,827,3],[826,4,826,5],[827,4,827,5],[828,2,828,7],[828,8,828,9],[829,1,830,2],[829,3,830,3],[829,4,829,5],[829,6,829,7],[834,7,834,9],[837,3,837,7],[838,3,838,7],[839,3,839,7],[859,3,859,7],[860,5,860,7],[849,3,849,7],[851,8,851,9],[854,3,854,7],[909,0,953,0],[910,2,910,9],[911,1,912,3],[911,4,911,5],[912,4,912,5],[913,2,913,7],[951,3,951,7],[952,5,952,7],[863,0,907,0],[864,2,864,9],[865,1,866,3],[865,4,865,5],[866,4,866,5],[905,3,905,7],[906,5,906,7],[891,3,891,7],[893,8,893,9],[898,3,898,7],[899,1,900,2],[887,3,887,7],[939,8,939,9],[944,3,944,7],[945,1,946,2],[945,3,946,3],[945,4,946,4],[945,5,945,7],[945,9,946,9],[899,3,900,3],[899,4,900,4],[899,5,899,7],[899,9,900,9],[922,3,922,7],[923,3,923,7],[924,3,924,7],[927,7,927,9],[933,3,933,7],[934,7,934,9],[913,8,913,9],[914,1,915,2],[914,3,915,3],[914,4,914,5],[914,6,914,7],[919,7,919,9],[888,7,888,9],[867,8,867,9],[868,1,869,2],[868,3,869,3],[937,3,937,7],[868,6,868,7],[873,7,873,9],[867,2,867,7],[876,3,876,7],[868,4,868,5],[877,3,877,7],[878,3,878,7],[881,7,881,9]]}
[1,"1ª/GRD",{"$nulls":8},{"$f":"J40","v":13699.37}]
[null,"OBRA:"," PAVIMENTAÇÃO ASFÁLTICA EM CBUQ - VIAS URBANAS DIVERSAS - BOCAIUVA / MG"]
[null,"Custo Unitário de Referência",null,null,"Minas Gerais"]
[{"$nulls":4}," Abril/2025 ",null,null,"Produção da equipe ",0.5,{"$f":"VLOOKUP(A1,ORÇAMENTO!$A$10:$L$43,7,1)","v":"GL"}]
[null,"CPU.1","MOBILIZAÇÃO E DESMOBILIZAÇÃO",{"$nulls":5},"Valores em reais (R$)"]
[null,"A - EQUIPAMENTOS",null,"Quantidade","Utilização",null,"Custo Horário",null,null,"Custo"]
[{"$nulls":4},"Operativa","Improdutiva","Produtivo","Improdutivo",null,"Horário Total"]
[null,"E9687","Caminhão carroceria com capacidade de 5 t - 120 kW",8,0.6,0.4,154.82689999999999,59.719900000000003,null,{"$f":"D8*(E8*G8+F8*H8)","v":934.27279999999996}]
[null,"E9571","Caminhão tanque com capacidade de 10.000 l - 188 kW",2,1,0,332.8408,83.189300000000003,null,{"$f":"D9*(E9*G9+F9*H9)","v":665.6816}]
[null,"E9509","Caminhão tanque distribuidor de asfalto com capacidade de 6.000 l - 7 kW/136 kW",2,1,0,267.51929999999999,74.644499999999994,null,535.03859999999997]
[null,"E9514","Distribuidor de agregados sobre pneus autopropelido - 130 kW",2,1,0,293.41419999999999,107.0603,null,586.82839999999999]
[null,"E9575","Caminhão basculante com caçamba estanque com capacidade de 14 m³ - 210 kW",8,1,0,314.16070000000002,91.266099999999994,null,{"$f":"D12*(E12*G12+F12*H12)","v":2513.2856000000002}]
[{"$nulls":7},"Custo horário total de equipamentos",null,{"$f":"SUM(J8:J12)","v":5235.107}]
[null,"B - MÃO DE OBRA",null,"Quantidade","Unidade",null,"Custo Horário","Custo Horário Total"]
[null,"P9824","Servente",8,"h",null,21.435400000000001,null,null,{"$f":"D15*G15","v":171.48320000000001}]
[{"$nulls":9},{"$f":"D16*G16","v":0}]
[null,null,null,"Custo horário total de mão de obra",{"$nulls":5},{"$f":"SUM(J15:J16)","v":171.48320000000001}]
[null,null,null,"Custo horário total de execução",{"$nulls":5},{"$f":"J13+J17","v":5406.5901999999996}]
[null,null,null,"Custo unitário de execução",{"$nulls":5},{"$f":"J18/I4","v":10813.180399999999}]
[{"$nulls":7},"Custo do FIC",null,0]
[{"$nulls":7},"Custo do FIT",null,0]
[null,"C - MATERIAL",null,"Quantidade","Unidade",null,"Preço Unitário","Custo Unitário"]
[null,"-",0,null,0,null,0,null,null,{"$f":"D23*G23","v":0}]
[null,"-",0,null,0,null,0,null,null,{"$f":"D24*G24","v":0}]
[null,null,null,"Custo unitário total de material",{"$nulls":5},{"$f":"SUM(J23:J24)","v":0}]
[null,"D - ATIVIDADES AUXILIARES",null,"Quantidade","Unidade",null,"Custo Unitário","Custo Unitário"]
[null,5914640,"Transporte com cavalo mecânico com semirreboque com capacidade de 32 t - rodovia pavimentada",5063.5,"tkm",null,0.56999999999999995,null,null,{"$f":"D27*G27","v":2886.1949999999997}]
[null,"-",0,0,0,null,0,null,null,{"$f":"D28*G28","v":0}]
[null,null,null,"Custo total de atividades auxiliares",{"$nulls":5},{"$f":"SUM(J27:J28)","v":2886.1949999999997}]
[{"$nulls":7},"Subtotal",null,{"$f":"J19+J25+J29+J20+J21","v":13699.375399999999}]
[null,"E - TEMPO FIXO",null,"Código","Quantidade","Unidade",null,"Custo Unitário","Custo Unitário"]
[null,"-",0,"-",null,0,null,0,null,{"$f":"ROUNDDOWN(E32*H32,4)","v":0}]
[null,"-",0,"-",null,0,null,0,null,{"$f":"ROUNDDOWN(E33*H33,4)","v":0}]
[null,null,null,"Custo unitário total de tempo fixo",{"$nulls":5},{"$f":"SUM(J32:J33)","v":0}]
[null,"F - MOMENTO DE TRANSPORTE",null,"Quantidade","Unidade","DMT",null,null,null,"Custo Unitário"]
[{"$nulls":5},"LN","RP","P"]
[null,"-",0,null,"tkm"]
[null,"-",0,null,"tkm"]
[null,null,null,"Custo unitário total de transporte"]
[{"$nulls":5},"Custo unitário direto total",null,null,null,{"$f":"TRUNC(J30+J34,2)","v":13699.37}]
[null,"Obs."]
[]
[2,"1ª/GRD",{"$nulls":8},{"$f":"J84","v":140558.79}]
[null,"OBRA:"," PAVIMENTAÇÃO ASFÁLTICA EM CBUQ - VIAS URBANAS DIVERSAS - BOCAIUVA / MG"]
[null,"Custo Unitário de Referência",null,null,"Minas Gerais"]
[{"$nulls":4}," Abril/2025 ",null,null,"Produção da equipe ",{"$f":"1/6","v":0.16666666666666666},{"$f":"VLOOKUP(A43,ORÇAMENTO!$A$10:$L$43,7,1)","v":"GL"}]
[null,"CPU.2","ADMINISTRAÇÃO LOCAL ",{"$nulls":5},"Valores em reais (R$)"]
[null,"A - EQUIPAMENTOS",null,"Quantidade","Utilização",null,"Custo Horário",null,null,"Custo"]
[{"$nulls":4},"Operativa","Improdutiva","Produtivo","Improdutivo",null,"Horário Total"]
[null,"-",0,null,null,null,0,0,null,{"$f":"D50*(E50*G50+F50*H50)","v":0}]
[null,"-",0,null,null,null,0,0,null,{"$f":"D51*(E51*G51+F51*H51)","v":0}]
[{"$nulls":7},"Custo horário total de equipamentos",null,{"$f":"SUM(J50:J51)","v":0}]
[null,"B - MÃO DE OBRA",null,"Quantidade","Unidade",null,"Custo Horário","Custo Horário Total"]
[null,"P9812","Engenheiro",0.21086009755646312,"mês",null,26402.7353,null,null,{"$f":"D54*G54","v":5567.2833411154725}]
[null,"P9840","Encarregado geral",1,"mês",null,10169.553075,null,null,{"$f":"D55*G55","v":10169.553075}]
[null,"P9876","Técnico de segurança do trabalho",0.5,"mês",null,5978.5158000000001,null,null,2989.2579000000001]
[null,"P9858","Laboratorista",0.5,"mês",null,4843.3442249999998,null,null,2421.6721124999999]
[null,"P9806","Auxiliar administrativo",0.5,"mês",null,3423.5984249999997,null,null,1711.7992124999998]
[null,null,null,"Custo horário total de mão de obra",{"$nulls":5},{"$f":"SUM(J54:J58)","v":22859.56564111547}]
[null,null,null,"Custo horário total de execução",{"$nulls":5},{"$f":"J52+J59","v":22859.56564111547}]
[null,null,null,"Custo unitário de execução",{"$nulls":5},{"$f":"J60/I46","v":137157.39384669284}]
[{"$nulls":7},"Custo do FIC",null,0]
[{"$nulls":7},"Custo do FIT",null,"-"]
[null,"C - MATERIAL",null,"Quantidade","Unidade",null,"Preço Unitário","Custo Unitário"]
[null,"-",0,0,0,null,0,null,null,{"$f":"D65*G65","v":0}]
[null,"-",0,0,0,null,0,null,null,0]
[null,null,null,"Custo unitário total de material",{"$nulls":5},{"$f":"SUM(J65:J66)","v":0}]
[null,"D - ATIVIDADES AUXILIARES",null,"Quantidade","Unidade",null,"Custo Unitário","Custo Unitário"]
[null,14250,"Energia Elétrica",360,"kwh",null,1.1399999999999999,null,null,{"$f":"D69*G69","v":410.4}]
[null,44480,"Tarifa A - Água e Esgoto",24,"m³",null,21.57,null,null,{"$f":"D70*G70","v":517.68000000000006}]
[null,5212560,"Placa de advertência para sinalização de obras montada em suporte metálico móvel, lado 1,00 m - utilização de 600 ciclos - fornecimento, 01 implantação e 01 retirada diária",528,"un.dia",null,3.89,null,null,{"$f":"D71*G71","v":2053.92}]
[null,"Cotação","Telefone",6,"mês",null,69.900000000000006,null,null,{"$f":"D72*G72","v":419.40000000000003}]
[null,null,null,"Custo total de atividades auxiliares",{"$nulls":5},{"$f":"SUM(J69:J72)","v":3401.4}]
[{"$nulls":7},"Subtotal",null,{"$f":"J61+J67+J73","v":140558.79384669283}]
[null,"E - TEMPO FIXO",null,"Código","Quantidade","Unidade",null,"Custo Unitário","Custo Unitário"]
[null,"-",0,"-",0,"t",null,0,null,{"$f":"ROUNDDOWN(E76*H76,4)","v":0}]
[null,"-",0,"-",0,"t",null,0,null,{"$f":"ROUNDDOWN(E77*H77,4)","v":0}]
[null,null,null,"Custo unitário total de tempo fixo",{"$nulls":5},{"$f":"SUM(J76:J77)","v":0}]
[null,"F - MOMENTO DE TRANSPORTE",null,"Quantidade","Unidade","DMT",null,null,null,"Custo Unitário"]
[{"$nulls":5},"LN","RP","P"]
[null,"-",0,null,"tkm"]
[null,"-",0,null,"tkm"]
[null,null,null,"Custo unitário total de transporte"]
[{"$nulls":5},"Custo unitário direto total",null,null,null,{"$f":"TRUNC(J74+J78,2)","v":140558.79}]
[null,"Obs."]
[]
[3,"1ª/GRD",{"$nulls":8},{"$f":"J123","v":14467.74}]
[null,"OBRA:"," PAVIMENTAÇÃO ASFÁLTICA EM CBUQ - VIAS URBANAS DIVERSAS - BOCAIUVA / MG"]
[null,"Custo Unitário de Referência",null,null,"Minas Gerais"]
[{"$nulls":4}," Abril/2025 ",null,null,"Produção da equipe ",1,{"$f":"VLOOKUP(A87,ORÇAMENTO!$A$10:$L$43,7,1)","v":"GL"}]
[null,"CPU.3","CANTEIRO DE OBRAS ",{"$nulls":5},"Valores em reais (R$)"]
[null,"A - EQUIPAMENTOS",null,"Quantidade","Utilização",null,"Custo Horário",null,null,"Custo"]
[{"$nulls":4},"Operativa","Improdutiva","Produtivo","Improdutivo",null,"Horário Total"]
[null,"-",0,null,null,null,0,0,null,{"$f":"D94*(E94*G94+F94*H94)","v":0}]
[null,"-",0,null,null,null,0,0,null,{"$f":"D95*(E95*G95+F95*H95)","v":0}]
[{"$nulls":7},"Custo horário total de equipamentos",null,{"$f":"SUM(J94:J95)","v":0}]
[null,"B - MÃO DE OBRA",null,"Quantidade","Unidade",null,"Custo Horário","Custo Horário Total"]
[null,"P9824","Servente",8,"h",null,21.435400000000001,null,null,{"$f":"D98*G98","v":171.48320000000001}]
[null,"P9808","Carpinteiro",8,"h",null,26.881399999999999,null,null,{"$f":"D99*G99","v":215.05119999999999}]
[null,null,null,"Custo horário total de mão de obra",{"$nulls":5},{"$f":"SUM(J98:J99)","v":386.53440000000001}]
[null,null,null,"Custo horário total de execução",{"$nulls":5},{"$f":"J96+J100","v":386.53440000000001}]
[null,null,null,"Custo unitário de execução",{"$nulls":5},{"$f":"J101/I90","v":386.53440000000001}]
[{"$nulls":7},"Custo do FIC",null,"-"]
[{"$nulls":7},"Custo do FIT",null,"-"]
[null,"C - MATERIAL",null,"Quantidade","Unidade",null,"Preço Unitário","Custo Unitário"]
[null,"M0053","Tela plástica em polipropileno na cor laranja para tapume - L = 1,2 m",100,"m",null,1.7621,null,null,{"$f":"D106*G106","v":176.21}]
[null,"-",0,0,0,null,0,null,null,{"$f":"D107*G107","v":0}]
[null,null,null,"Custo unitário total de material",{"$nulls":5},{"$f":"SUM(J106:J107)","v":176.21}]
[null,"D - ATIVIDADES AUXILIARES",null,"Quantidade","Unidade",null,"Custo Unitário","Custo Unitário"]
[null,10775,"Locação de container 2,30 X 6,00 m, alt. 2,50 m, com 1 sanitário, para escritório, completo, sem divisórias internas",6,"mês",null,1030,null,null,{"$f":"D110*G110","v":6180}]
[null,10779,"Locação de container 2,30 X 4,30 m, alt. 2,50 M, p/ sanitário, c/ 5 bacias, 1 lavatório e 4 mictórios",6,"mês",null,1287.5,null,null,{"$f":"D111*G111","v":7725}]
[null,null,null,"Custo total de atividades auxiliares",{"$nulls":5},{"$f":"SUM(J110:J111)","v":13905}]
[{"$nulls":7},"Subtotal",null,{"$f":"J102+J108+J112","v":14467.7444}]
[null,"E - TEMPO FIXO",null,"Código","Quantidade","Unidade",null,"Custo Unitário","Custo Unitário"]
[null,"-",0,"-",0,"t",null,0,null,{"$f":"ROUNDDOWN(E115*H115,4)","v":0}]
[null,"-",0,"-",0,"t",null,0,null,{"$f":"ROUNDDOWN(E116*H116,4)","v":0}]
[null,null,null,"Custo unitário total de tempo fixo",{"$nulls":5},{"$f":"SUM(J115:J116)","v":0}]
[null,"F - MOMENTO DE TRANSPORTE",null,"Quantidade","Unidade","DMT",null,null,null,"Custo Unitário"]
[{"$nulls":5},"LN","RP","P"]
[null,"-",0,0,"tkm"]
[null,"-",0,0,"tkm"]
[null,null,null,"Custo unitário total de transporte"]
[{"$nulls":5},"Custo unitário direto total",null,null,null,{"$f":"TRUNC(J113+J117,2)","v":14467.74}]
[null,"Obs."]
[]
[4,"1ª/GRD",{"$nulls":8},{"$f":"J164","v":547.64}]
[null,"OBRA:"," PAVIMENTAÇÃO ASFÁLTICA EM CBUQ - VIAS URBANAS DIVERSAS - BOCAIUVA / MG"]
[null,"Custo Unitário de Referência",null,null,"Minas Gerais"]
[{"$nulls":4}," Abril/2025 ",null,null,"Produção da equipe ",1,{"$f":"VLOOKUP(A126,ORÇAMENTO!$A$10:$L$43,7,1)","v":"M2"}]
[null,103689,"PLACA DE OBRA EM CHAPA DE AÇO GALVANIZADO",{"$nulls":5},"Valores em reais (R$)"]
[null,"A - EQUIPAMENTOS",null,"Quantidade","Utilização",null,"Custo Horário",null,null,"Custo"]
[{"$nulls":4},"Operativa","Improdutiva","Produtivo","Improdutivo",null,"Horário Total"]
[null,"-",0,null,null,null,0,0,null,{"$f":"D133*(E133*G133+F133*H133)","v":0}]
[null,"-",0,null,null,null,0,0,null,{"$f":"D134*(E134*G134+F134*H134)","v":0}]
[{"$nulls":7},"Custo horário total de equipamentos",null,{"$f":"SUM(J133:J134)","v":0}]
[null,"B - MÃO DE OBRA",null,"Quantidade","Unidade",null,"Custo Horário","Custo Horário Total"]
[null,"P9824","Servente",1.1186,"h",null,21.435400000000001,null,null,{"$f":"D137*G137","v":23.977638440000003}]
[null,"P9808","Carpinteiro",0.37290000000000001,"h",null,26.881399999999999,null,null,{"$f":"D138*G138","v":10.02407406}]
[null,null,null,"Custo horário total de mão de obra",{"$nulls":5},{"$f":"SUM(J137:J138)","v":34.001712500000004}]
[null,null,null,"Custo horário total de execução",{"$nulls":5},{"$f":"J135+J139","v":34.001712500000004}]
[null,null,null,"Custo unitário de execução",{"$nulls":5},{"$f":"J140/I129","v":34.001712500000004}]
[{"$nulls":7},"Custo do FIC",null,"-"]
[{"$nulls":7},"Custo do FIT",null,"-"]
[null,"C - MATERIAL",null,"Quantidade","Unidade",null,"Preço Unitário","Custo Unitário"]
[null,"M1358","Sarrafo em madeira de terceira - E = 2,5 cm e L = 5 cm",6.4165999999999999,"m",null,2.0291000000000001,null,null,{"$f":"D145*G145","v":13.01992306}]
[null,"M1205","Prego de ferro",2.4500000000000001E-2,"kg",null,16.771799999999999,null,null,{"$f":"D146*G146","v":0.41090909999999997}]
[null,"M0998","Madeira estrutural de eucalipto",2.2608E-2,"m³",null,2685.3184000000001,null,null,{"$f":"D147*G147","v":60.7096783872}]
[null,4813,"Placa de obra (para construção civil) em chapa galvanizada *N. 22*, adesivada, de *2,4 X 1,2* m (sem postes para fixação)",1,"m²",null,439.5,"(SINAPI)",null,439.5]
[null,null,null,"Custo unitário total de material",{"$nulls":5},{"$f":"SUM(J145:J148)","v":513.64051054719994}]
[null,"D - ATIVIDADES AUXILIARES",null,"Quantidade","Unidade",null,"Custo Unitário","Custo Unitário"]
[null,"-",0,0,0,null,0,null,null,{"$f":"D151*G151","v":0}]
[null,"-",0,0,0,null,0,null,null,{"$f":"D152*G152","v":0}]
[null,null,null,"Custo total de atividades auxiliares",{"$nulls":5},{"$f":"SUM(J151:J152)","v":0}]
[{"$nulls":7},"Subtotal",null,{"$f":"J141+J149+J153","v":547.64222304719999}]
[null,"E - TEMPO FIXO",null,"Código","Quantidade","Unidade",null,"Custo Unitário","Custo Unitário"]
[null,"-",0,"-",0,"t",null,0,null,{"$f":"ROUNDDOWN(E156*H156,4)","v":0}]
[null,"-",0,"-",0,"t",null,0,null,{"$f":"ROUNDDOWN(E157*H157,4)","v":0}]
[null,null,null,"Custo unitário total de tempo fixo",{"$nulls":5},{"$f":"SUM(J156:J157)","v":0}]
[null,"F - MOMENTO DE TRANSPORTE",null,"Quantidade","Unidade","DMT",null,null,null,"Custo Unitário"]
[{"$nulls":5},"LN","RP","P"]
[null,"-",0,0,"tkm"]
[null,"-",0,0,"tkm"]
[null,null,null,"Custo unitário total de transporte"]
[{"$nulls":5},"Custo unitário direto total",null,null,null,{"$f":"TRUNC(J154+J158,2)","v":547.64}]
[null,"Obs."]
[]
[5,"1ª/GRD",{"$nulls":8},{"$f":"J211","v":4264.1499999999996}]
[null,"OBRA:"," PAVIMENTAÇÃO ASFÁLTICA EM CBUQ - VIAS URBANAS DIVERSAS - BOCAIUVA / MG"]
[null,"Custo Unitário de Referência",null,null,"Minas Gerais"]
[{"$nulls":4}," Abril/2025 ",null,null,"Produção da equipe ",1,{"$f":"VLOOKUP(A167,ORÇAMENTO!$A$10:$L$43,7,1)","v":"MÊS"}]
[null,"CPU.4","VEÍCULO PARA A FISCALIZAÇÃO, MÁXIMO 02 ANOS DE USO OU 50.000KM, PREFERENCIALMENTE NA COR BRANCA, COM IDENTIFICAÇÃO CONFORME ESPECIFICAÇÕES DA CODEVASF, INCLUSIVE COMBUSTÍVEL, MANUTENÇÃO, SEGURO E IMPOSTOS - CONFORME ESPECIFICAÇÕES",{"$nulls":5},"Valores em reais (R$)"]
[null,"A - EQUIPAMENTOS",null,"Quantidade","Utilização",null,"Custo Horário",null,null,"Custo"]
[{"$nulls":4},"Operativa","Improdutiva","Produtivo","Improdutivo",null,"Horário Total"]
[null,"-",0,null,null,null,0,0,null,{"$f":"D174*(E174*G174+F174*H174)","v":0}]
[null,"-",0,null,null,null,0,0,null,{"$f":"D175*(E175*G175+F175*H175)","v":0}]
[{"$nulls":7},"Custo horário total de equipamentos",null,{"$f":"SUM(J174:J175)","v":0}]
[null,"B - MÃO DE OBRA",null,"Quantidade","Unidade",null,"Custo Horário","Custo Horário Total"]
[null,"-",0,null,0,null,0,null,null,{"$f":"D178*G178","v":0}]
[null,"-",0,null,0,null,0,null,null,{"$f":"D179*G179","v":0}]
[null,null,null,"Custo horário total de mão de obra",{"$nulls":5},{"$f":"SUM(J178:J179)","v":0}]
[null,null,null,"Custo horário total de execução",{"$nulls":5},{"$f":"J176+J180","v":0}]
[null,null,null,"Custo unitário de execução",{"$nulls":5},{"$f":"J181/I170","v":0}]
[{"$nulls":7},"Custo do FIC",null,"-"]
[{"$nulls":7},"Custo do FIT",null,"-"]
[null,"C - MATERIAL",null,"Quantidade","Unidade",null,"Preço Unitário","Custo Unitário"]
[null,"-",0,null,0,null,0,null,null,{"$f":"D186*G186","v":0}]
[null,"-",0,null,0,null,0,null,null,{"$f":"D187*G187","v":0}]
[null,null,null,"Custo unitário total de material",{"$nulls":5},{"$f":"SUM(J186:J187)","v":0}]
[null,"D - ATIVIDADES AUXILIARES",null,"Quantidade","Unidade",null,"Custo Unitário","Custo Unitário"]
[null,"-","Depreciação",1,"vb",null,692.66666666666663,null,null,{"$f":"D190*G190","v":692.66666666666663}]
[null,"-","Oportunidade de Capital",1,"vb",null,510.84,null,null,{"$f":"D191*G191","v":510.84}]
[null,"-","Impostos e Licenciamento",1,"vb",null,346.33,null,null,346.33]
[null,"-","Seguro Total",1,"vb",null,281.58,null,null,281.58]
[null,"-","Combustível",1,"vb",null,1287.8599999999999,null,null,1287.8599999999999]
[null,"-","Manutenções Preventivas",1,"vb",null,254.02,null,null,254.02]
[null,"-","Limpeza",1,"vb",null,100,null,null,100]
[null,"-","Pneus",1,"vb",null,115.18,null,null,115.18]
[null,"-","Peças",1,"vb",null,77.22,null,null,77.22]
[null,"-","Manutenção Corretiva (%)",1,"vb",null,598.46,null,null,598.46]
[null,null,null,"Custo total de atividades auxiliares",{"$nulls":5},{"$f":"SUM(J190:J199)","v":4264.1566666666658}]
[{"$nulls":7},"Subtotal",null,{"$f":"J182+J188+J200","v":4264.1566666666658}]
[null,"E - TEMPO FIXO",null,"Código","Quantidade","Unidade",null,"Custo Unitário","Custo Unitário"]
[null,"-",0,"-",0,"t",null,0,null,{"$f":"ROUNDDOWN(E203*H203,4)","v":0}]
[null,"-",0,"-",0,"t",null,0,null,{"$f":"ROUNDDOWN(E204*H204,4)","v":0}]
[null,null,null,"Custo unitário total de tempo fixo",{"$nulls":5},{"$f":"SUM(J203:J204)","v":0}]
[null,"F - MOMENTO DE TRANSPORTE",null,"Quantidade","Unidade","DMT",null,null,null,"Custo Unitário"]
[{"$nulls":5},"LN","RP","P"]
[null,"-",0]
[null,"-",0]
[null,null,null,"Custo unitário total de transporte"]
[{"$nulls":5},"Custo unitário direto total",null,null,null,{"$f":"TRUNC(J201+J205,2)","v":4264.1499999999996}]
[null,"Obs."]
[]
[6,"1ª/GRD",{"$nulls":8},{"$f":"J252","v":0.56999999999999995}]
[null,"OBRA:"," PAVIMENTAÇÃO ASFÁLTICA EM CBUQ - VIAS URBANAS DIVERSAS - BOCAIUVA / MG"]
[null,"Custo Unitário de Referência",null,null,"Minas Gerais"]
[{"$nulls":4}," Abril/2025 ",null,null,"Produção da equipe ",1,{"$f":"VLOOKUP(A214,ORÇAMENTO!$A$10:$L$43,7,1)","v":"M2"}]
[null,78472,"SERVIÇOS TOPOGRÁFICOS PARA PAVIMENTAÇÃO, INCLUSIVE LEVANTAMENTO PLANIALTIMÉTRICO CADASTRAL, GERAÇÃO DE NOTAS DE SERVIÇO, SEÇÕES TRANSVERSAIS E GREIDE, ESTAQUEAMENTO E ACOMPANHAMENTO EXECUTIVO",{"$nulls":5},"Valores em reais (R$)"]
[null,"A - EQUIPAMENTOS",null,"Quantidade","Utilização",null,"Custo Horário",null,null,"Custo"]
[{"$nulls":4},"Operativa","Improdutiva","Produtivo","Improdutivo",null,"Horário Total"]
[null,92145,"Caminhonete cabine simples com motor 1.6 flex, câmbio manual, potência 101/104 cv, 2 portas",5.0000000000000001E-4,1,0,83.97,0,null,{"$f":"D221*(E221*G221+F221*H221)","v":4.1985000000000001E-2}]
[null,"-",0,null,null,null,0,0,null,{"$f":"D222*(E222*G222+F222*H222)","v":0}]
[{"$nulls":7},"Custo horário total de equipamentos",null,{"$f":"SUM(J221:J222)","v":4.1985000000000001E-2}]
[null,"B - MÃO DE OBRA",null,"Quantidade","Unidade",null,"Custo Horário","Custo Horário Total"]
[null,"P9949","Topógrafo",2.0000000000000002E-5,"mês",null,6936.5330000000004,28.902220833333335,null,{"$f":"D225*G225","v":0.13873066000000001}]
[null,"P9950","Auxiliar de topografia",2.0000000000000002E-5,"mês",null,6476.4769999999999,23.986951851851853,null,{"$f":"D226*G226","v":0.12952954}]
[null,"P9824","Servente",7.4999999999999997E-3,"h",null,21.435400000000001,8.9314166666666667E-2,null,{"$f":"D227*G227","v":0.16076550000000001}]
[null,"P9848","Desenhista",1.0000000000000001E-5,"mês",null,10596.234399999999,39.24531259259259,null,{"$f":"D228*G228","v":0.105962344}]
[null,null,null,"Custo horário total de mão de obra",{"$nulls":5},{"$f":"SUM(J225:J228)","v":0.534988044}]
[null,null,null,"Custo horário total de execução",{"$nulls":5},{"$f":"J223+J229","v":0.57697304400000005}]
[null,null,null,"Custo unitário de execução",{"$nulls":5},{"$f":"J230/I217","v":0.57697304400000005}]
[{"$nulls":7},"Custo do FIC",null,"-"]
[{"$nulls":7},"Custo do FIT",null,"-"]
[null,"C - MATERIAL",null,"Quantidade","Unidade",null,"Preço Unitário","Custo Unitário"]
[null,"-",0,0,0,null,0,null,null,{"$f":"D235*G235","v":0}]
[null,"-",0,0,0,null,0,null,null,0]
[null,null,null,"Custo unitário total de material",{"$nulls":5},{"$f":"SUM(J235:J236)","v":0}]
[null,"D - ATIVIDADES AUXILIARES",null,"Quantidade","Unidade",null,"Custo Unitário","Custo Unitário"]
[null,"-",0,0,0,null,0,null,null,{"$f":"D239*G239","v":0}]
[null,"-",0,0,0,null,0,null,null,{"$f":"D240*G240","v":0}]
[null,null,null,"Custo total de atividades auxiliares",{"$nulls":5},{"$f":"SUM(J239:J240)","v":0}]
[{"$nulls":7},"Subtotal",null,{"$f":"J231+J237+J241","v":0.57697304400000005}]
[null,"E - TEMPO FIXO",null,"Código","Quantidade","Unidade",null,"Custo Unitário","Custo Unitário"]
[null,"-",0,"-",0,"t",null,0,null,{"$f":"ROUNDDOWN(E244*H244,4)","v":0}]
[null,"-",0,"-",0,"t",null,0,null,{"$f":"ROUNDDOWN(E245*H245,4)","v":0}]
[null,null,null,"Custo unitário total de tempo fixo",{"$nulls":5},{"$f":"SUM(J244:J245)","v":0}]
[null,"F - MOMENTO DE TRANSPORTE",null,"Quantidade","Unidade","DMT",null,null,null,"Custo Unitário"]
[{"$nulls":5},"LN","RP","P"]
[null,"-",0,0,"tkm"]
[null,"-",0,0,"tkm"]
[null,null,null,"Custo unitário total de transporte"]
[{"$nulls":5},"Custo unitário direto total",null,null,null,{"$f":"TRUNC(J242+J246,2)","v":0.56999999999999995}]
[null,"Obs."]
[]
[7,"1ª/GRD",{"$nulls":8},{"$f":"J291","v":6.9}]
[null,"OBRA:"," PAVIMENTAÇÃO ASFÁLTICA EM CBUQ - VIAS URBANAS DIVERSAS - BOCAIUVA / MG"]
[null,"Custo Unitário de Referência",null,null,"Minas Gerais"]
[{"$nulls":4}," Abril/2025 ",null,null,"Produção da equipe ",230.19,{"$f":"VLOOKUP(A255,ORÇAMENTO!$A$10:$L$43,7,1)","v":"M3"}]
[null,5502140,"ESCAVAÇÃO, CARGA E TRANSPORTE DE MATERIAL DE 1ª CATEGORIA - DMT 1.000 A 1.200M, CAMINHO DE SERVIÇO EM REVESTIMENTO PRIMÁRIO",{"$nulls":5},"Valores em reais (R$)"]
[null,"A - EQUIPAMENTOS",null,"Quantidade","Utilização",null,"Custo Horário",null,null,"Custo"]
[{"$nulls":4},"Operativa","Improdutiva","Produtivo","Improdutivo",null,"Horário Total"]
[null,"E9667","Caminhão basculante com capacidade de 14 m³ - 210 kW",4,0.97,0.03,313.74529999999999,91.048100000000005,null,{"$f":"D262*(E262*G262+F262*H262)","v":1228.2575360000001}]
[null,"E9515","Escavadeira hidráulica sobre esteiras com caçamba com capacidade de 1,56 m³ - 118 kW",1,1,0,307.78859999999997,139.61009999999999,null,{"$f":"D263*(E263*G263+F263*H263)","v":307.78859999999997}]
[{"$nulls":7},"Custo horário total de equipamentos",null,{"$f":"SUM(J262:J263)","v":1536.0461359999999}]
[null,"B - MÃO DE OBRA",null,"Quantidade","Unidade",null,"Custo Horário","Custo Horário Total"]
[null,"P9824","Servente",1,"h",null,21.435400000000001,null,null,{"$f":"D266*G266","v":21.435400000000001}]
[{"$nulls":9},{"$f":"D267*G267","v":0}]
[null,null,null,"Custo horário total de mão de obra",{"$nulls":5},{"$f":"SUM(J266:J267)","v":21.435400000000001}]
[null,null,null,"Custo horário total de execução",{"$nulls":5},{"$f":"J264+J268","v":1557.481536}]
[null,null,null,"Custo unitário de execução",{"$nulls":5},{"$f":"J269/I258","v":6.7660694904209571}]
[{"$nulls":7},"Custo do FIC",null,0.13819999999999999]
[{"$nulls":7},"Custo do FIT",null,0]
[null,"C - MATERIAL",null,"Quantidade","Unidade",null,"Preço Unitário","Custo Unitário"]
[null,"-",0,null,0,null,0,null,null,{"$f":"D274*G274","v":0}]
[null,"-",0,null,0,null,0,null,null,{"$f":"D275*G275","v":0}]
[null,null,null,"Custo unitário total de material",{"$nulls":5},{"$f":"SUM(J274:J275)","v":0}]
[null,"D - ATIVIDADES AUXILIARES",null,"Quantidade","Unidade",null,"Custo Unitário","Custo Unitário"]
[null,"-",0,0,0,null,0,null,null,{"$f":"D278*G278","v":0}]
[null,"-",0,0,0,null,0,null,null,{"$f":"D279*G279","v":0}]
[null,null,null,"Custo total de atividades auxiliares",{"$nulls":5},{"$f":"SUM(J278:J279)","v":0}]
[{"$nulls":7},"Subtotal",null,{"$f":"J270+J276+J280+J271+J272","v":6.9042694904209574}]
[null,"E - TEMPO FIXO",null,"Código","Quantidade","Unidade",null,"Custo Unitário","Custo Unitário"]
[null,"-",0,"-",0,"t",null,0,null,{"$f":"ROUNDDOWN(E283*H283,4)","v":0}]
[null,"-",0,"-",0,"t",null,0,null,{"$f":"ROUNDDOWN(E284*H284,4)","v":0}]
[null,null,null,"Custo unitário total de tempo fixo",{"$nulls":5},{"$f":"SUM(J283:J284)","v":0}]
[null,"F - MOMENTO DE TRANSPORTE",null,"Quantidade","Unidade","DMT",null,null,null,"Custo Unitário"]
[{"$nulls":5},"LN","RP","P"]
[null,"-",0,null,"tkm","5914449","5914464","5914479"]
[null,"-",0,null,"tkm","5914449","5914464","5914479"]
[null,null,null,"Custo unitário total de transporte"]
[{"$nulls":5},"Custo unitário direto total",null,null,null,{"$f":"TRUNC(J281+J285,2)","v":6.9}]
[null,"Obs."]
[]
[9,"1ª/GRD",{"$nulls":8},{"$f":"J334","v":1.56}]
[null,"OBRA:"," PAVIMENTAÇÃO ASFÁLTICA EM CBUQ - VIAS URBANAS DIVERSAS - BOCAIUVA / MG"]
[null,"Custo Unitário de Referência",null,null,"Minas Gerais"]
[{"$nulls":4}," Abril/2025 ",null,null,"Produção da equipe ",672.8,{"$f":"VLOOKUP(A294,ORÇAMENTO!$A$10:$L$43,7,1)","v":"M2"}]
[null,4011209,"REGULARIZAÇÃO DO SUBLEITO - 100% PROCTOR INTERMEDIÁRIO",{"$nulls":5},"Valores em reais (R$)"]
[null,"A - EQUIPAMENTOS",null,"Quantidade","Utilização",null,"Custo Horário",null,null,"Custo"]
[{"$nulls":4},"Operativa","Improdutiva","Produtivo","Improdutivo",null,"Horário Total"]
[null,"E9571","Caminhão tanque com capacidade de 10.000 l - 188 kW",1,0.61,0.39,332.8408,83.189300000000003,null,{"$f":"D301*(E301*G301+F301*H301)","v":235.47671499999998}]
[null,"E9518","Grade de 24 discos rebocável de D = 60 cm (24\")",1,0.41,0.59,4.9446000000000003,3.4432999999999998,null,{"$f":"D302*(E302*G302+F302*H302)","v":4.0588329999999999}]
[null,"E9524","Motoniveladora - 93 kW",1,0.43,0.56999999999999995,283.71199999999999,122.7861,null,191.98423699999998]
[null,"E9762","Rolo compactador de pneus autopropelido de 27 t - 85 kW",1,0.96,0.04,257.48289999999997,125.15349999999999,null,252.18972399999996]
[null,"E9685","Rolo compactador pé de carneiro vibratório autopropelido por pneus de 11,6 t - 82 kW",1,1,0,228.8742,102.6397,null,228.8742]
[null,"E9577","Trator agrícola sobre pneus - 77 kW",1,0.41,0.59,154.65969999999999,55.817599999999999,null,96.342860999999999]
[{"$nulls":7},"Custo horário total de equipamentos",null,{"$f":"SUM(J301:J306)","v":1008.9265699999999}]
[null,"B - MÃO DE OBRA",null,"Quantidade","Unidade",null,"Custo Horário","Custo Horário Total"]
[null,"P9824","Servente",1,"h",null,21.435400000000001,null,null,{"$f":"D309*G309","v":21.435400000000001}]
[null,"-",null,0,0,null,0,null,null,{"$f":"D310*G310","v":0}]
[null,null,null,"Custo horário total de mão de obra",{"$nulls":5},{"$f":"SUM(J309:J310)","v":21.435400000000001}]
[null,null,null,"Custo horário total de execução",{"$nulls":5},{"$f":"J307+J311","v":1030.3619699999999}]
[null,null,null,"Custo unitário de execução",{"$nulls":5},{"$f":"J312/I297","v":1.5314535820451842}]
[{"$nulls":7},"Custo do FIC",null,3.1300000000000001E-2]
[{"$nulls":7},"Custo do FIT",null,0]
[null,"C - MATERIAL",null,"Quantidade","Unidade",null,"Preço Unitário","Custo Unitário"]
[null,"-",0,null,0,null,0,null,null,{"$f":"D317*G317","v":0}]
[null,"-",0,null,0,null,0,null,null,{"$f":"D318*G318","v":0}]
[null,null,null,"Custo unitário total de material",{"$nulls":5},{"$f":"SUM(J317:J318)","v":0}]
[null,"D - ATIVIDADES AUXILIARES",null,"Quantidade","Unidade",null,"Custo Unitário","Custo Unitário"]
[null,"-",0,0,0,null,0,null,null,{"$f":"D321*G321","v":0}]
[null,"-",0,0,0,null,0,null,null,{"$f":"D322*G322","v":0}]
[null,null,null,"Custo total de atividades auxiliares",{"$nulls":5},{"$f":"SUM(J321:J322)","v":0}]
[{"$nulls":7},"Subtotal",null,{"$f":"J313+J319+J323+J314+J315","v":1.5627535820451843}]
[null,"E - TEMPO FIXO",null,"Código","Quantidade","Unidade",null,"Custo Unitário","Custo Unitário"]
[null,"-",0,"-",0,"t",null,0,null,{"$f":"ROUNDDOWN(E326*H326,4)","v":0}]
[null,"-",0,"-",0,"t",null,0,null,{"$f":"ROUNDDOWN(E327*H327,4)","v":0}]
[null,null,null,"Custo unitário total de tempo fixo",{"$nulls":5},{"$f":"SUM(J326:J327)","v":0}]
[null,"F - MOMENTO DE TRANSPORTE",null,"Quantidade","Unidade","DMT",null,null,null,"Custo Unitário"]
[{"$nulls":5},"LN","RP","P"]
[null,"-",0,null,"tkm","5914449","5914464","5914479"]
[null,"-",0,null,"tkm","5914449","5914464","5914479"]
[null,null,null,"Custo unitário total de transporte"]
[{"$nulls":5},"Custo unitário direto total",null,null,null,{"$f":"TRUNC(J324+J328,2)","v":1.56}]
[null,"Obs."]
[]
[10,"1ª/GRD",{"$nulls":8},{"$f":"J375","v":46.3}]
[null,"OBRA:"," PAVIMENTAÇÃO ASFÁLTICA EM CBUQ - VIAS URBANAS DIVERSAS - BOCAIUVA / MG"]
[null,"Custo Unitário de Referência",null,null,"Minas Gerais"]
[{"$nulls":4}," Abril/2025 ",null,null,"Produção da equipe ",113.18,{"$f":"VLOOKUP(A337,ORÇAMENTO!$A$10:$L$43,7,1)","v":"M3"}]
[null,"4011276a","EXECUÇÃO E COMPACTAÇÃO DE BASE E OU SUB BASE PARA PAVIMENTAÇÃO DE BICA CORRIDA COM BRITA COMERCIAL - 100% PROCTOR MODIFICADO",{"$nulls":5},"Valores em reais (R$)"]
[null,"A - EQUIPAMENTOS",null,"Quantidade","Utilização",null,"Custo Horário",null,null,"Custo"]
[{"$nulls":4},"Operativa","Improdutiva","Produtivo","Improdutivo",null,"Horário Total"]
[null,"E9571","Caminhão tanque com capacidade de 10.000 l - 188 kW",1,0.34,0.66,332.8408,83.189300000000003,null,{"$f":"D344*(E344*G344+F344*H344)","v":168.07080999999999}]
[null,"E9514","Distribuidor de agregados sobre pneus autopropelido - 130 kW",1,1,0,293.41419999999999,107.0603,null,{"$f":"D345*(E345*G345+F345*H345)","v":293.41419999999999}]
[null,"E9762","Rolo compactador de pneus autopropelido de 27 t - 85 kW",1,0.97,0.03,257.48289999999997,125.15349999999999,null,253.51301799999996]
[null,"E9530","Rolo compactador liso vibratório autopropelido por pneus de 11 t - 97 kW",1,0.79,0.21,264.91219999999998,115.2555,null,233.48429300000001]
[{"$nulls":7},"Custo horário total de equipamentos",null,{"$f":"SUM(J344:J347)","v":948.48232099999996}]
[null,"B - MÃO DE OBRA",null,"Quantidade","Unidade",null,"Custo Horário","Custo Horário Total"]
[null,"P9824","Servente",1,"h",null,21.435400000000001,null,null,{"$f":"D350*G350","v":21.435400000000001}]
[null,"-",0,0,0,null,0,null,null,{"$f":"D351*G351","v":0}]
[null,null,null,"Custo horário total de mão de obra",{"$nulls":5},{"$f":"SUM(J350:J351)","v":21.435400000000001}]
[null,null,null,"Custo horário total de execução",{"$nulls":5},{"$f":"J348+J352","v":969.91772099999991}]
[null,null,null,"Custo unitário de execução",{"$nulls":5},{"$f":"J353/I340","v":8.5696918271779445}]
[{"$nulls":7},"Custo do FIC",null,0.189]
[{"$nulls":7},"Custo do FIT",null,0]
[null,"C - MATERIAL",null,"Quantidade","Unidade",null,"Preço Unitário","Custo Unitário"]
[null,"-",0,null,0,null,0,null,null,{"$f":"D358*G358","v":0}]
[null,"-",0,null,0,null,0,null,null,{"$f":"D359*G359","v":0}]
[null,null,null,"Custo unitário total de material",{"$nulls":5},{"$f":"SUM(J358:J359)","v":0}]
[null,"D - ATIVIDADES AUXILIARES",null,"Quantidade","Unidade",null,"Custo Unitário","Custo Unitário"]
[null,"6416040a","Usinagem de bica corrida com brita comercial em usina ",1,"m³",null,35,"COTAÇÃO",null,{"$f":"D362*G362","v":35}]
[null,"-",0,0,0,null,0,null,null,{"$f":"D363*G363","v":0}]
[null,null,null,"Custo total de atividades auxiliares",{"$nulls":5},{"$f":"SUM(J362:J363)","v":35}]
[{"$nulls":7},"Subtotal",null,{"$f":"J354+J360+J364+J355+J356","v":43.758691827177948}]
[null,"E - TEMPO FIXO",null,"Código","Quantidade","Unidade",null,"Custo Unitário","Custo Unitário"]
[null,"6416040a","Usinagem de bica corrida com brita comercial em usina ",5914354,1.4,"t",null,1.82,null,{"$f":"ROUNDDOWN(E367*H367,4)","v":2.548}]
[null,"-",0,"-",null,"t",null,0,null,{"$f":"ROUNDDOWN(E368*H368,4)","v":0}]
[null,null,null,"Custo unitário total de tempo fixo",{"$nulls":5},{"$f":"SUM(J367:J368)","v":2.548}]
[null,"F - MOMENTO DE TRANSPORTE",null,"Quantidade","Unidade","DMT",null,null,null,"Custo Unitário"]
[{"$nulls":5},"LN","RP","P"]
[null,"6416040a","Usinagem de bica corrida com brita comercial em usina ",1.4,"tkm","5914359","5914374","5914389"]
[null,"-",0,0,"tkm"]
[null,null,null,"Custo unitário total de transporte"]
[{"$nulls":5},"Custo unitário direto total",null,null,null,{"$f":"TRUNC(J365+J369,2)","v":46.3}]
[null,"Obs."]
[]
[12,"1ª/GRD",{"$nulls":8},{"$f":"J414","v":0.41}]
[null,"OBRA:"," PAVIMENTAÇÃO ASFÁLTICA EM CBUQ - VIAS URBANAS DIVERSAS - BOCAIUVA / MG"]
[null,"Custo Unitário de Referência",null,null,"Minas Gerais"]
[{"$nulls":4}," Abril/2025 ",null,null,"Produção da equipe ",1038.46,{"$f":"VLOOKUP(A378,ORÇAMENTO!$A$10:$L$43,7,1)","v":"M2"}]
[null,4011352,"IMPRIMAÇÃO COM EMULSÃO ASFÁLTICA (EAI)",{"$nulls":5},"Valores em reais (R$)"]
[null,"A - EQUIPAMENTOS",null,"Quantidade","Utilização",null,"Custo Horário",null,null,"Custo"]
[{"$nulls":4},"Operativa","Improdutiva","Produtivo","Improdutivo",null,"Horário Total"]
[null,"E9509","Caminhão tanque distribuidor de asfalto com capacidade de 6.000 l - 7 kW/136 kW",1,1,0,267.51929999999999,74.644499999999994,null,{"$f":"D385*(E385*G385+F385*H385)","v":267.51929999999999}]
[null,"E9558","Tanque de estocagem de asfalto com capacidade de 30.000 l",2,1,0,57.98,39.604599999999998,null,{"$f":"D386*(E386*G386+F386*H386)","v":115.96}]
[{"$nulls":7},"Custo horário total de equipamentos",null,{"$f":"SUM(J385:J386)","v":383.47929999999997}]
[null,"B - MÃO DE OBRA",null,"Quantidade","Unidade",null,"Custo Horário","Custo Horário Total"]
[null,"P9824","Servente",2,"h",null,21.435400000000001,null,null,{"$f":"D389*G389","v":42.870800000000003}]
[null,"-",{"$nulls":7},{"$f":"D390*G390","v":0}]
[null,null,null,"Custo horário total de mão de obra",{"$nulls":5},{"$f":"SUM(J389:J390)","v":42.870800000000003}]
[null,null,null,"Custo horário total de execução",{"$nulls":5},{"$f":"J387+J391","v":426.3501}]
[null,null,null,"Custo unitário de execução",{"$nulls":5},{"$f":"J392/I381","v":0.41055996379253895}]
[{"$nulls":7},"Custo do FIC",null,1.4E-3]
[{"$nulls":7},"Custo do FIT",null,0]
[null,"C - MATERIAL",null,"Quantidade","Unidade",null,"Preço Unitário","Custo Unitário"]
[null,"M2092","Emulsão asfáltica para imprimação",1.2999999999999999E-3,"t",null,0,"FORNECIMENTO COM BDI DIFERENCIADO",null,{"$f":"D397*G397","v":0}]
[null,"-",0,0,0,null,0,null,null,{"$f":"D398*G398","v":0}]
[null,null,null,"Custo unitário total de material",{"$nulls":5},{"$f":"SUM(J397:J398)","v":0}]
[null,"D - ATIVIDADES AUXILIARES",null,"Quantidade","Unidade",null,"Custo Unitário","Custo Unitário"]
[null,"-",0,0,0,null,0,null,null,{"$f":"D401*G401","v":0}]
[null,"-",0,0,0,null,0,null,null,{"$f":"D402*G402","v":0}]
[null,null,null,"Custo total de atividades auxiliares",{"$nulls":5},{"$f":"SUM(J401:J402)","v":0}]
[{"$nulls":7},"Subtotal",null,{"$f":"J393+J399+J403+J394+J395","v":0.41195996379253896}]
[null,"E - TEMPO FIXO",null,"Código","Quantidade","Unidade",null,"Custo Unitário","Custo Unitário"]
[null,"-",0,"-",0,"t",null,0,null,{"$f":"ROUNDDOWN(E406*H406,4)","v":0}]
[null,"-",0,"-",0,"t",null,0,null,{"$f":"ROUNDDOWN(E407*H407,4)","v":0}]
[null,null,null,"Custo unitário total de tempo fixo",{"$nulls":5},{"$f":"SUM(J406:J407)","v":0}]
[null,"F - MOMENTO DE TRANSPORTE",null,"Quantidade","Unidade","DMT",null,null,null,"Custo Unitário"]
[{"$nulls":5},"LN","RP","P"]
[null,"-",0,null,"tkm"]
[null,"-",0,null,"tkm"]
[null,null,null,"Custo unitário total de transporte"]
[{"$nulls":5},"Custo unitário direto total",null,null,null,{"$f":"TRUNC(J404+J408,2)","v":0.41}]
[null,"Obs."]
[]
[13,"1ª/GRD",{"$nulls":8},{"$f":"J453","v":0.28000000000000003}]
[null,"OBRA:"," PAVIMENTAÇÃO ASFÁLTICA EM CBUQ - VIAS URBANAS DIVERSAS - BOCAIUVA / MG"]
[null,"Custo Unitário de Referência",null,null,"Minas Gerais"]
[{"$nulls":4}," Abril/2025 ",null,null,"Produção da equipe ",1500,{"$f":"VLOOKUP(A417,ORÇAMENTO!$A$10:$L$43,7,1)","v":"M2"}]
[null,4011353,"PINTURA DE LIGAÇÃO COM EMULSÃO ASFÁLTICA RR-1C",{"$nulls":5},"Valores em reais (R$)"]
[null,"A - EQUIPAMENTOS",null,"Quantidade","Utilização",null,"Custo Horário",null,null,"Custo"]
[{"$nulls":4},"Operativa","Improdutiva","Produtivo","Improdutivo",null,"Horário Total"]
[null,"E9509","Caminhão tanque distribuidor de asfalto com capacidade de 6.000 l - 7 kW/136 kW",1,1,0,267.51929999999999,74.644499999999994,null,{"$f":"D424*(E424*G424+F424*H424)","v":267.51929999999999}]
[null,"E9558","Tanque de estocagem de asfalto com capacidade de 30.000 l",2,1,0,57.98,39.604599999999998,null,{"$f":"D425*(E425*G425+F425*H425)","v":115.96}]
[{"$nulls":7},"Custo horário total de equipamentos",null,{"$f":"SUM(J424:J425)","v":383.47929999999997}]
[null,"B - MÃO DE OBRA",null,"Quantidade","Unidade",null,"Custo Horário","Custo Horário Total"]
[null,"P9824","Servente",2,"h",null,21.435400000000001,null,null,{"$f":"D428*G428","v":42.870800000000003}]
[null,"-",{"$nulls":7},{"$f":"D429*G429","v":0}]
[null,null,null,"Custo horário total de mão de obra",{"$nulls":5},{"$f":"SUM(J428:J429)","v":42.870800000000003}]
[null,null,null,"Custo horário total de execução",{"$nulls":5},{"$f":"J426+J430","v":426.3501}]
[null,null,null,"Custo unitário de execução",{"$nulls":5},{"$f":"J431/I420","v":0.28423340000000002}]
[{"$nulls":7},"Custo do FIC",null,1E-3]
[{"$nulls":7},"Custo do FIT",null,0]
[null,"C - MATERIAL",null,"Quantidade","Unidade",null,"Preço Unitário","Custo Unitário"]
[null,"M1946","Emulsão asfáltica - RR-1C",4.4999999999999999E-4,"t",null,0,"FORNECIMENTO COM BDI DIFERENCIADO",null,{"$f":"D436*G436","v":0}]
[null,"-",0,null,0,null,0,null,null,{"$f":"D437*G437","v":0}]
[null,null,null,"Custo unitário total de material",{"$nulls":5},{"$f":"SUM(J436:J437)","v":0}]
[null,"D - ATIVIDADES AUXILIARES",null,"Quantidade","Unidade",null,"Custo Unitário","Custo Unitário"]
[null,"-",0,0,0,null,0,null,null,{"$f":"D440*G440","v":0}]
[null,"-",0,0,0,null,0,null,null,{"$f":"D441*G441","v":0}]
[null,null,null,"Custo total de atividades auxiliares",{"$nulls":5},{"$f":"SUM(J440:J441)","v":0}]
[{"$nulls":7},"Subtotal",null,{"$f":"J432+J438+J442+J433+J434","v":0.28523340000000003}]
[null,"E - TEMPO FIXO",null,"Código","Quantidade","Unidade",null,"Custo Unitário","Custo Unitário"]
[null,"-",0,"-",0,"t",null,0,null,{"$f":"ROUNDDOWN(E445*H445,4)","v":0}]
[null,"-",0,"-",0,"t",null,0,null,{"$f":"ROUNDDOWN(E446*H446,4)","v":0}]
[null,null,null,"Custo unitário total de tempo fixo",{"$nulls":5},{"$f":"SUM(J445:J446)","v":0}]
[null,"F - MOMENTO DE TRANSPORTE",null,"Quantidade","Unidade","DMT",null,null,null,"Custo Unitário"]
[{"$nulls":5},"LN","RP","P"]
[null,"-",0,null,"tkm"]
[null,"-",0,null,"tkm"]
[null,null,null,"Custo unitário total de transporte"]
[{"$nulls":5},"Custo unitário direto total",null,null,null,{"$f":"TRUNC(J443+J447,2)","v":0.28000000000000003}]
[null,"Obs."]
[]
[14,"1ª/GRD",{"$nulls":8},{"$f":"J493","v":190.05}]
[null,"OBRA:"," PAVIMENTAÇÃO ASFÁLTICA EM CBUQ - VIAS URBANAS DIVERSAS - BOCAIUVA / MG"]
[null,"Custo Unitário de Referência",null,null,"Minas Gerais"]
[{"$nulls":4}," Abril/2025 ",null,null,"Produção da equipe ",99.6,{"$f":"VLOOKUP(A456,ORÇAMENTO!$A$10:$L$43,7,1)","v":"T"}]
[null,4011463,"EXECUÇÃO DE PAVIMENTO COM APLICAÇÃO DE CONCRETO ASFÁLTICO USINADO A QUENTE (CBUQ), CAMADA DE ROLAMENTO - EXCLUSIVE TRANSPORTE",{"$nulls":5},"Valores em reais (R$)"]
[null,"A - EQUIPAMENTOS",null,"Quantidade","Utilização",null,"Custo Horário",null,null,"Custo"]
[{"$nulls":4},"Operativa","Improdutiva","Produtivo","Improdutivo",null,"Horário Total"]
[null,"E9762","Rolo compactador de pneus autopropelido de 27 t - 85 kW",1,0.71,0.28999999999999998,257.48289999999997,125.15349999999999,null,{"$f":"D463*(E463*G463+F463*H463)","v":219.10737399999996}]
[null,"E9681","Rolo compactador liso tandem vibratório autopropelido de 10,4 t - 82 kW",1,0.82,0.18,299.81799999999998,113.9695,null,{"$f":"D464*(E464*G464+F464*H464)","v":266.36526999999995}]
[null,"E9545","Vibroacabadora de asfalto sobre esteiras - 97 kW",1,1,0,365.24360000000001,156.6223,null,{"$f":"D465*(E465*G465+F465*H465)","v":365.24360000000001}]
[{"$nulls":7},"Custo horário total de equipamentos",null,{"$f":"SUM(J463:J465)","v":850.71624399999996}]
[null,"B - MÃO DE OBRA",null,"Quantidade","Unidade",null,"Custo Horário","Custo Horário Total"]
[null,"P9824","Servente",8,"h",null,21.435400000000001,null,null,{"$f":"D468*G468","v":171.48320000000001}]
[null,"-",0,null,0,null,0,null,null,{"$f":"D469*G469","v":0}]
[null,null,null,"Custo horário total de mão de obra",{"$nulls":5},{"$f":"SUM(J468:J469)","v":171.48320000000001}]
[null,null,null,"Custo horário total de execução",{"$nulls":5},{"$f":"J466+J470","v":1022.199444}]
[null,null,null,"Custo unitário de execução",{"$nulls":5},{"$f":"J471/I459","v":10.263046626506025}]
[{"$nulls":7},"Custo do FIC",null,3.49E-2]
[{"$nulls":7},"Custo do FIT",null,0]
[null,"C - MATERIAL",null,"Quantidade","Unidade",null,"Preço Unitário","Custo Unitário"]
[null,"-",0,null,0,null,0,null,null,{"$f":"D476*G476","v":0}]
[null,"-",0,null,0,null,0,null,null,{"$f":"D477*G477","v":0}]
[null,null,null,"Custo unitário total de material",{"$nulls":5},{"$f":"SUM(J476:J477)","v":0}]
[null,"D - ATIVIDADES AUXILIARES",null,"Quantidade","Unidade",null,"Custo Unitário","Custo Unitário"]
[null,6416078,"Usinagem de concreto asfáltico - faixa C-12,5 - areia e brita comerciais",1,"t",null,172.06900777916869,null,null,{"$f":"D480*G480","v":172.06900777916869}]
[null,"-",0,0,0,null,0,null,null,{"$f":"D481*G481","v":0}]
[null,null,null,"Custo total de atividades auxiliares",{"$nulls":5},{"$f":"SUM(J480:J481)","v":172.06900777916869}]
[{"$nulls":7},"Subtotal",null,{"$f":"J472+J478+J482+J473+J474","v":182.3669544056747}]
[null,"E - TEMPO FIXO",null,"Código","Quantidade","Unidade",null,"Custo Unitário","Custo Unitário"]
[null,6416078,"Usinagem de concreto asfáltico - faixa C-12,5 - areia e brita comerciais",5914649,1,"t",null,7.69,null,{"$f":"ROUNDDOWN(E485*H485,4)","v":7.69}]
[null,"-",0,"-",0,"t",null,0,null,{"$f":"ROUNDDOWN(E486*H486,4)","v":0}]
[null,null,null,"Custo unitário total de tempo fixo",{"$nulls":5},{"$f":"SUM(J485:J486)","v":7.69}]
[null,"F - MOMENTO DE TRANSPORTE",null,"Quantidade","Unidade","DMT",null,null,null,"Custo Unitário"]
[{"$nulls":5},"LN","RP","P"]
[null,6416078,"Usinagem de concreto asfáltico - faixa C-12,5 - areia e brita comerciais",1,"tkm"]
[null,"-",0,0,"tkm"]
[null,null,null,"Custo unitário total de transporte"]
[{"$nulls":5},"Custo unitário direto total",null,null,null,{"$f":"TRUNC(J483+J487,2)","v":190.05}]
[null,"Obs."]
[]
[null,"1ª/GRD",{"$nulls":8},{"$f":"J547","v":172.06900777916869}]
[null,"OBRA:"," PAVIMENTAÇÃO ASFÁLTICA EM CBUQ - VIAS URBANAS DIVERSAS - BOCAIUVA / MG"]
[null,"Custo Unitário de Referência - Auxiliar",null,null,"Minas Gerais"]
[{"$nulls":4}," Abril/2025 ",null,null,"Produção da equipe ",99.6,"t"]
[null,6416078,"Usinagem de concreto asfáltico - faixa C - areia e brita comerciais",{"$nulls":5},"Valores em reais (R$)"]
[null,"A - EQUIPAMENTOS",null,"Quantidade","Utilização",null,"Custo Horário",null,null,"Custo"]
[{"$nulls":4},"Operativa","Improdutiva","Produtivo","Improdutivo",null,"Horário Total"]
[null,"E9559","Aquecedor de fluido térmico - 12 kW",1,1,0,76.738399999999999,44.1357,null,{"$f":"D503*(E503*G503+F503*H503)","v":76.738399999999999}]
[null,"E9584","Carregadeira de pneus com capacidade de 1,72 m³ - 113 kW",1,0.86,0.14000000000000001,207.10550000000001,103.1602,null,{"$f":"D504*(E504*G504+F504*H504)","v":192.553158}]
[null,"E9021","Grupo gerador - 456 kVA",1,1,0,423.6705,22.1999,null,423.6705]
[null,"E9558","Tanque de estocagem de asfalto com capacidade de 30.000 l",2,1,0,57.98,39.604599999999998,null,115.96]
[null,"E9689","Usina de asfalto a quente gravimétrica com capacidade de 100/140 t/h - 260 kW",1,1,0,1240.8839,658.63800000000003,null,{"$f":"D507*(E507*G507+F507*H507)","v":1240.8839}]
[{"$nulls":7},"Custo horário total de equipamentos",null,{"$f":"SUM(J503:J507)","v":2049.8059579999999}]
[null,"B - MÃO DE OBRA",null,"Quantidade","Unidade",null,"Custo Horário","Custo Horário Total"]
[null,"P9824","Servente",4,"h",null,21.435400000000001,null,null,{"$f":"D510*G510","v":85.741600000000005}]
[null,null,null,"Custo horário total de mão de obra",{"$nulls":5},{"$f":"SUM(J510:J510)","v":85.741600000000005}]
[null,null,null,"Custo horário total de execução",{"$nulls":5},{"$f":"J508+J511","v":2135.5475579999998}]
[null,null,null,"Custo unitário de execução",{"$nulls":5},{"$f":"J512/I499","v":21.441240542168675}]
[{"$nulls":7},"Custo do FIC",null,0]
[{"$nulls":7},"Custo do FIT",null,0]
[null,"C - MATERIAL",null,"Quantidade","Unidade",null,"Preço Unitário","Custo Unitário"]
[null,"M0028","Areia média",2.7009999999999999E-2,"m³",null,145.6,null,null,{"$f":"D517*G517","v":3.9326559999999997}]
[null,"M0005","Brita 0",9.0029999999999999E-2,"m³",null,152.6,null,null,{"$f":"D518*G518","v":13.738577999999999}]
[null,"M0191","Brita 1",3.2149999999999998E-2,"m³",null,145.6,null,null,4.6810399999999994]
[null,"M0344","Cal hidratada - a granel",14.4636,"kg",null,0.64459999999999995,null,null,9.3232365599999998]
[null,"M1943","Cimento asfáltico de petróleo - CAP 50/70",5.5449999999999999E-2,"t",null,0,"FORNECIMENTO COM BDI DIFERENCIADO",null,0]
[null,"M1941","Óleo tipo A1",8,"l",null,5.1599000000000004,null,null,41.279200000000003]
[null,"M1103","Pedrisco",0.1479,"m³",null,152.6,null,null,22.56954]
[null,"M1135","Pó de pedra",0.33631,"m³",null,158.14670000000001,null,null,53.186316677000001]
[null,null,null,"Custo unitário total de material",{"$nulls":5},{"$f":"SUM(J517:J524)","v":148.71056723699999}]
[null,"D - ATIVIDADES AUXILIARES",null,"Quantidade","Unidade",null,"Custo Unitário","Custo Unitário"]
[null,"-",0,0,0,null,0,null,null,{"$f":"D527*G527","v":0}]
[null,null,null,"Custo total de atividades auxiliares",{"$nulls":5},{"$f":"SUM(J527:J527)","v":0}]
[{"$nulls":7},"Subtotal",null,{"$f":"J513+J525+J528+J514+J515","v":170.15180777916868}]
[null,"E - TEMPO FIXO",null,"Código","Quantidade","Unidade",null,"Custo Unitário","Custo Unitário"]
[null,"M0028","Areia média",5914647,4.052E-2,"t",null,1.75,null,{"$f":"ROUNDDOWN(E531*H531,4)","v":7.0900000000000005E-2}]
[null,"M0005","Brita 0",5914647,0.13505,"t",null,1.75,null,0.23630000000000001]
[null,"M0191","Brita 1",5914647,4.8230000000000002E-2,"t",null,1.75,null,8.4400000000000003E-2]
[null,"M0344","Cal hidratada - a granel",5914363,1.4460000000000001E-2,"t",null,17.61,null,0.25459999999999999]
[null,"M1103","Pedrisco",5914647,0.22184999999999999,"t",null,1.75,null,{"$f":"ROUNDDOWN(E535*H535,4)","v":0.38819999999999999}]
[null,"M1135","Pó de pedra",5914647,0.50446999999999997,"t",null,1.75,null,{"$f":"ROUNDDOWN(E536*H536,4)","v":0.88280000000000003}]
[null,null,null,"Custo unitário total de tempo fixo",{"$nulls":5},{"$f":"SUM(J531:J536)","v":1.9172000000000002}]
[null,"F - MOMENTO DE TRANSPORTE",null,"Quantidade","Unidade","DMT",null,null,null,"Custo Unitário"]
[{"$nulls":5},"LN","RP","P"]
[null,"M0028","Areia média",4.052E-2,"tkm"]
[null,"M0005","Brita 0",0.13505,"tkm"]
[null,"M0191","Brita 1",4.8230000000000002E-2,"tkm"]
[null,"M0344","Cal hidratada - a granel",1.4460000000000001E-2,"tkm"]
[null,"M1103","Pedrisco",0.22184999999999999,"tkm"]
[null,"M1135","Pó de pedra",0.50446999999999997,"tkm"]
[null,null,null,"Custo unitário total de transporte"]
[{"$nulls":5},"Custo unitário direto total",null,null,null,{"$f":"J529+J537","v":172.06900777916869}]
[null,"Obs."]
[]
[15,"1ª/GRD",{"$nulls":8},{"$f":"J586","v":0.66}]
[null,"OBRA:"," PAVIMENTAÇÃO ASFÁLTICA EM CBUQ - VIAS URBANAS DIVERSAS - BOCAIUVA / MG"]
[null,"Custo Unitário de Referência",null,null,"Minas Gerais"]
[{"$nulls":4}," Abril/2025 ",null,null,"Produção da equipe ",470.61,{"$f":"VLOOKUP(A550,ORÇAMENTO!$A$10:$L$43,7,1)","v":"TXKM"}]
[null,5915321,"TRANSPORTE COM CAMINHÃO BASCULANTE, EM RODOVIA PAVIMENTADA",{"$nulls":5},"Valores em reais (R$)"]
[null,"A - EQUIPAMENTOS",null,"Quantidade","Utilização",null,"Custo Horário",null,null,"Custo"]
[{"$nulls":4},"Operativa","Improdutiva","Produtivo","Improdutivo",null,"Horário Total"]
[null,"E9667","Caminhão basculante com capacidade de 14 m³ - 210 kW",1,1,0,313.74529999999999,91.048100000000005,null,{"$f":"D557*(E557*G557+F557*H557)","v":313.74529999999999}]
[null,"-",0,null,null,null,0,0,null,{"$f":"D558*(E558*G558+F558*H558)","v":0}]
[{"$nulls":7},"Custo horário total de equipamentos",null,{"$f":"SUM(J557:J558)","v":313.74529999999999}]
[null,"B - MÃO DE OBRA",null,"Quantidade","Unidade",null,"Custo Horário","Custo Horário Total"]
[null,"-",0,null,0,null,0,null,null,{"$f":"D561*G561","v":0}]
[null,"-",0,null,0,null,0,null,null,{"$f":"D562*G562","v":0}]
[null,null,null,"Custo horário total de mão de obra",{"$nulls":5},{"$f":"SUM(J561:J562)","v":0}]
[null,null,null,"Custo horário total de execução",{"$nulls":5},{"$f":"J559+J563","v":313.74529999999999}]
[null,null,null,"Custo unitário de execução",{"$nulls":5},{"$f":"J564/I553","v":0.66667792864580011}]
[{"$nulls":7},"Custo do FIC",null,0]
[{"$nulls":7},"Custo do FIT",null,0]
[null,"C - MATERIAL",null,"Quantidade","Unidade",null,"Preço Unitário","Custo Unitário"]
[null,"-",0,0,0,null,0,null,null,{"$f":"D569*G569","v":0}]
[null,"-",0,0,0,null,0,null,null,{"$f":"D570*G570","v":0}]
[null,null,null,"Custo unitário total de material",{"$nulls":5},{"$f":"SUM(J569:J570)","v":0}]
[null,"D - ATIVIDADES AUXILIARES",null,"Quantidade","Unidade",null,"Custo Unitário","Custo Unitário"]
[null,"-",0,0,0,null,0,null,null,{"$f":"D573*G573","v":0}]
[null,"-",0,0,0,null,0,null,null,{"$f":"D574*G574","v":0}]
[null,null,null,"Custo total de atividades auxiliares",{"$nulls":5},{"$f":"SUM(J573:J574)","v":0}]
[{"$nulls":7},"Subtotal",null,{"$f":"J565+J571+J575+J566+J567","v":0.66667792864580011}]
[null,"E - TEMPO FIXO",null,"Código","Quantidade","Unidade",null,"Custo Unitário","Custo Unitário"]
[null,"-",0,"-",0,"t",null,0,null,{"$f":"ROUNDDOWN(E578*H578,4)","v":0}]
[null,"-",0,"-",0,"t",null,0,null,{"$f":"ROUNDDOWN(E579*H579,4)","v":0}]
[null,null,null,"Custo unitário total de tempo fixo",{"$nulls":5},{"$f":"SUM(J578:J579)","v":0}]
[null,"F - MOMENTO DE TRANSPORTE",null,"Quantidade","Unidade","DMT",null,null,null,"Custo Unitário"]
[{"$nulls":5},"LN","RP","P"]
[null,"-",0,0,"tkm"]
[null,"-",0,0,"tkm"]
[null,null,null,"Custo unitário total de transporte"]
[{"$nulls":5},"Custo unitário direto total",null,null,null,{"$f":"TRUNC(J576+J580,2)","v":0.66}]
[null,"Obs."]
[]
[16,"1ª/GRD",{"$nulls":8},{"$f":"J625","v":0.73}]
[null,"OBRA:"," PAVIMENTAÇÃO ASFÁLTICA EM CBUQ - VIAS URBANAS DIVERSAS - BOCAIUVA / MG"]
[null,"Custo Unitário de Referência",null,null,"Minas Gerais"]
[{"$nulls":4}," Abril/2025 ",null,null,"Produção da equipe ",435.75,{"$f":"VLOOKUP(A589,ORÇAMENTO!$A$10:$L$43,7,1)","v":"TXKM"}]
[null,5915320,"TRANSPORTE COM CAMINHÃO BASCULANTE, RODOVIA EM REVESTIMENTO PRIMÁRIO",{"$nulls":5},"Valores em reais (R$)"]
[null,"A - EQUIPAMENTOS",null,"Quantidade","Utilização",null,"Custo Horário",null,null,"Custo"]
[{"$nulls":4},"Operativa","Improdutiva","Produtivo","Improdutivo",null,"Horário Total"]
[null,"E9667","Caminhão basculante com capacidade de 14 m³ - 210 kW",1,1,0,313.74529999999999,91.048100000000005,null,{"$f":"D596*(E596*G596+F596*H596)","v":313.74529999999999}]
[null,"-",0,null,null,null,0,0,null,{"$f":"D597*(E597*G597+F597*H597)","v":0}]
[{"$nulls":7},"Custo horário total de equipamentos",null,{"$f":"SUM(J596:J597)","v":313.74529999999999}]
[null,"B - MÃO DE OBRA",null,"Quantidade","Unidade",null,"Custo Horário","Custo Horário Total"]
[null,"-",0,null,0,null,0,null,null,{"$f":"D600*G600","v":0}]
[null,"-",0,null,0,null,0,null,null,{"$f":"D601*G601","v":0}]
[null,null,null,"Custo horário total de mão de obra",{"$nulls":5},{"$f":"SUM(J600:J601)","v":0}]
[null,null,null,"Custo horário total de execução",{"$nulls":5},{"$f":"J598+J602","v":313.74529999999999}]
[null,null,null,"Custo unitário de execução",{"$nulls":5},{"$f":"J603/I592","v":0.72001216293746406}]
[{"$nulls":7},"Custo do FIC",null,1.47E-2]
[{"$nulls":7},"Custo do FIT",null,0]
[null,"C - MATERIAL",null,"Quantidade","Unidade",null,"Preço Unitário","Custo Unitário"]
[null,"-",0,0,0,null,0,null,null,{"$f":"D608*G608","v":0}]
[null,"-",0,0,0,null,0,null,null,{"$f":"D609*G609","v":0}]
[null,null,null,"Custo unitário total de material",{"$nulls":5},{"$f":"SUM(J608:J609)","v":0}]
[null,"D - ATIVIDADES AUXILIARES",null,"Quantidade","Unidade",null,"Custo Unitário","Custo Unitário"]
[null,"-",0,0,0,null,0,null,null,{"$f":"D612*G612","v":0}]
[null,"-",0,0,0,null,0,null,null,{"$f":"D613*G613","v":0}]
[null,null,null,"Custo total de atividades auxiliares",{"$nulls":5},{"$f":"SUM(J612:J613)","v":0}]
[{"$nulls":7},"Subtotal",null,{"$f":"J604+J610+J614+J605+J606","v":0.73471216293746411}]
[null,"E - TEMPO FIXO",null,"Código","Quantidade","Unidade",null,"Custo Unitário","Custo Unitário"]
[null,"-",0,"-",0,"t",null,0,null,{"$f":"ROUNDDOWN(E617*H617,4)","v":0}]
[null,"-",0,"-",0,"t",null,0,null,{"$f":"ROUNDDOWN(E618*H618,4)","v":0}]
[null,null,null,"Custo unitário total de tempo fixo",{"$nulls":5},{"$f":"SUM(J617:J618)","v":0}]
[null,"F - MOMENTO DE TRANSPORTE",null,"Quantidade","Unidade","DMT",null,null,null,"Custo Unitário"]
[{"$nulls":5},"LN","RP","P"]
[null,"-",0,0,"tkm"]
[null,"-",0,0,"tkm"]
[null,null,null,"Custo unitário total de transporte"]
[{"$nulls":5},"Custo unitário direto total",null,null,null,{"$f":"TRUNC(J615+J619,2)","v":0.73}]
[null,"Obs."]
[]
[17,"1ª/GRD",{"$nulls":8},{"$f":"J664","v":0.79}]
[null,"OBRA:"," PAVIMENTAÇÃO ASFÁLTICA EM CBUQ - VIAS URBANAS DIVERSAS - BOCAIUVA / MG"]
[null,"Custo Unitário de Referência",null,null,"Minas Gerais"]
[{"$nulls":4}," Abril/2025 ",null,null,"Produção da equipe ",231.3,{"$f":"VLOOKUP(A628,ORÇAMENTO!$A$10:$L$43,7,1)","v":"TXKM"}]
[null,5914434,"TRANSPORTE COM CAMINHÃO CARROCERIA 9T, EM VIA URBANA PAVIMENTADA",{"$nulls":5},"Valores em reais (R$)"]
[null,"A - EQUIPAMENTOS",null,"Quantidade","Utilização",null,"Custo Horário",null,null,"Custo"]
[{"$nulls":4},"Operativa","Improdutiva","Produtivo","Improdutivo",null,"Horário Total"]
[null,"E9508","Caminhão carroceria com capacidade de 9 t - 136 kW",1,1,0,183.48670000000001,69.869600000000005,null,{"$f":"D635*(E635*G635+F635*H635)","v":183.48670000000001}]
[null,"-",0,null,null,null,0,0,null,{"$f":"D636*(E636*G636+F636*H636)","v":0}]
[{"$nulls":7},"Custo horário total de equipamentos",null,{"$f":"SUM(J635:J636)","v":183.48670000000001}]
[null,"B - MÃO DE OBRA",null,"Quantidade","Unidade",null,"Custo Horário","Custo Horário Total"]
[null,"-",0,0,0,null,0,null,null,{"$f":"D639*G639","v":0}]
[null,"-",0,0,0,null,0,null,null,{"$f":"D640*G640","v":0}]
[null,null,null,"Custo horário total de mão de obra",{"$nulls":5},{"$f":"SUM(J639:J640)","v":0}]
[null,null,null,"Custo horário total de execução",{"$nulls":5},{"$f":"J637+J641","v":183.48670000000001}]
[null,null,null,"Custo unitário de execução",{"$nulls":5},{"$f":"J642/I631","v":0.79328447903156074}]
[{"$nulls":7},"Custo do FIC",null,0]
[{"$nulls":7},"Custo do FIT",null,0]
[null,"C - MATERIAL",null,"Quantidade","Unidade",null,"Preço Unitário","Custo Unitário"]
[null,"-",0,0,0,null,0,null,null,{"$f":"D647*G647","v":0}]
[null,"-",0,0,0,null,0,null,null,{"$f":"D648*G648","v":0}]
[null,null,null,"Custo unitário total de material",{"$nulls":5},{"$f":"SUM(J647:J648)","v":0}]
[null,"D - ATIVIDADES AUXILIARES",null,"Quantidade","Unidade",null,"Custo Unitário","Custo Unitário"]
[null,"-",0,0,0,null,0,null,null,{"$f":"D651*G651","v":0}]
[null,"-",0,0,0,null,0,null,null,{"$f":"D652*G652","v":0}]
[null,null,null,"Custo total de atividades auxiliares",{"$nulls":5},{"$f":"SUM(J651:J652)","v":0}]
[{"$nulls":7},"Subtotal",null,{"$f":"J643+J649+J653+J644+J645","v":0.79328447903156074}]
[null,"E - TEMPO FIXO",null,"Código","Quantidade","Unidade",null,"Custo Unitário","Custo Unitário"]
[null,"-",0,"-",0,"t",null,0,null,{"$f":"ROUNDDOWN(E656*H656,4)","v":0}]
[null,"-",0,"-",0,"t",null,0,null,{"$f":"ROUNDDOWN(E657*H657,4)","v":0}]
[null,null,null,"Custo unitário total de tempo fixo",{"$nulls":5},{"$f":"SUM(J656:J657)","v":0}]
[null,"F - MOMENTO DE TRANSPORTE",null,"Quantidade","Unidade","DMT",null,null,null,"Custo Unitário"]
[{"$nulls":5},"LN","RP","P"]
[null,"-",0,0,"tkm"]
[null,"-",0,0,"tkm"]
[null,null,null,"Custo unitário total de transporte"]
[{"$nulls":5},"Custo unitário direto total",null,null,null,{"$f":"TRUNC(J654+J658,2)","v":0.79}]
[null,"Obs."]
[]
[18,"1ª/GRD",{"$nulls":8},{"$f":"J703","v":0.81}]
[null,"OBRA:"," PAVIMENTAÇÃO ASFÁLTICA EM CBUQ - VIAS URBANAS DIVERSAS - BOCAIUVA / MG"]
[null,"Custo Unitário de Referência",null,null,"Minas Gerais"]
[{"$nulls":4}," Abril/2025 ",null,null,"Produção da equipe ",224.1,{"$f":"VLOOKUP(A667,ORÇAMENTO!$A$10:$L$43,7,1)","v":"TXKM"}]
[null,5914612,"TRANSPORTE DE MASSA ASFÁLTICA COM CAMINHÃO BASCULANTE COM CAÇAMBA TÉRMICA, EM VIA URBANA PAVIMENTADA",{"$nulls":5},"Valores em reais (R$)"]
[null,"A - EQUIPAMENTOS",null,"Quantidade","Utilização",null,"Custo Horário",null,null,"Custo"]
[{"$nulls":4},"Operativa","Improdutiva","Produtivo","Improdutivo",null,"Horário Total"]
[null,"E9520","Caminhão com caçamba térmica com capacidade de 6 m³ - 136 kW",1,1,0,183.2457,69.798699999999997,null,{"$f":"D674*(E674*G674+F674*H674)","v":183.2457}]
[null,"-",0,null,null,null,0,0,null,{"$f":"D675*(E675*G675+F675*H675)","v":0}]
[{"$nulls":7},"Custo horário total de equipamentos",null,{"$f":"SUM(J674:J675)","v":183.2457}]
[null,"B - MÃO DE OBRA",null,"Quantidade","Unidade",null,"Custo Horário","Custo Horário Total"]
[null,"-",0,0,0,null,0,null,null,{"$f":"D678*G678","v":0}]
[null,"-",0,0,0,null,0,null,null,{"$f":"D679*G679","v":0}]
[null,null,null,"Custo horário total de mão de obra",{"$nulls":5},{"$f":"SUM(J678:J679)","v":0}]
[null,null,null,"Custo horário total de execução",{"$nulls":5},{"$f":"J676+J680","v":183.2457}]
[null,null,null,"Custo unitário de execução",{"$nulls":5},{"$f":"J681/I670","v":0.81769611780455154}]
[{"$nulls":7},"Custo do FIC",null,0]
[{"$nulls":7},"Custo do FIT",null,0]
[null,"C - MATERIAL",null,"Quantidade","Unidade",null,"Preço Unitário","Custo Unitário"]
[null,"-",0,0,0,null,0,null,null,{"$f":"D686*G686","v":0}]
[null,"-",0,0,0,null,0,null,null,{"$f":"D687*G687","v":0}]
[null,null,null,"Custo unitário total de material",{"$nulls":5},{"$f":"SUM(J686:J687)","v":0}]
[null,"D - ATIVIDADES AUXILIARES",null,"Quantidade","Unidade",null,"Custo Unitário","Custo Unitário"]
[null,"-",0,0,0,null,0,null,null,{"$f":"D690*G690","v":0}]
[null,"-",0,0,0,null,0,null,null,{"$f":"D691*G691","v":0}]
[null,null,null,"Custo total de atividades auxiliares",{"$nulls":5},{"$f":"SUM(J690:J691)","v":0}]
[{"$nulls":7},"Subtotal",null,{"$f":"J682+J688+J692+J683+J684","v":0.81769611780455154}]
[null,"E - TEMPO FIXO",null,"Código","Quantidade","Unidade",null,"Custo Unitário","Custo Unitário"]
[null,"-",0,"-",0,"t",null,0,null,{"$f":"ROUNDDOWN(E695*H695,4)","v":0}]
[null,"-",0,"-",0,"t",null,0,null,{"$f":"ROUNDDOWN(E696*H696,4)","v":0}]
[null,null,null,"Custo unitário total de tempo fixo",{"$nulls":5},{"$f":"SUM(J695:J696)","v":0}]
[null,"F - MOMENTO DE TRANSPORTE",null,"Quantidade","Unidade","DMT",null,null,null,"Custo Unitário"]
[{"$nulls":5},"LN","RP","P"]
[null,"-",0,0,"tkm"]
[null,"-",0,0,"tkm"]
[null,null,null,"Custo unitário total de transporte"]
[{"$nulls":5},"Custo unitário direto total",null,null,null,{"$f":"TRUNC(J693+J697,2)","v":0.81}]
[null,"Obs."]
[]
[20,"1ª/GRD",{"$nulls":8},{"$f":"J742","v":1.79}]
[null,"OBRA:"," PAVIMENTAÇÃO ASFÁLTICA EM CBUQ - VIAS URBANAS DIVERSAS - BOCAIUVA / MG"]
[null,"Custo Unitário de Referência",null,null,"Minas Gerais"]
[{"$nulls":4}," Abril/2025 ",null,null,"Produção da equipe ",149.4,{"$f":"VLOOKUP(A706,ORÇAMENTO!$A$10:$L$43,7,1)","v":"TXKM"}]
[null,5914622,"TRANSPORTE COM CAMINHÃO TANQUE DE TRANSPORTE DE MATERIAL ASFÁLTICO DE 30000 L, EM VIA URBANA PAVIMENTADA",{"$nulls":5},"Valores em reais (R$)"]
[null,"A - EQUIPAMENTOS",null,"Quantidade","Utilização",null,"Custo Horário",null,null,"Custo"]
[{"$nulls":4},"Operativa","Improdutiva","Produtivo","Improdutivo",null,"Horário Total"]
[null,"E9509","Caminhão tanque distribuidor de asfalto com capacidade de 6.000 l - 7 kW/136 kW",1,1,0,267.51929999999999,74.644499999999994,null,{"$f":"D713*(E713*G713+F713*H713)","v":267.51929999999999}]
[null,"-",0,null,null,null,0,0,null,{"$f":"D714*(E714*G714+F714*H714)","v":0}]
[{"$nulls":7},"Custo horário total de equipamentos",null,{"$f":"SUM(J713:J714)","v":267.51929999999999}]
[null,"B - MÃO DE OBRA",null,"Quantidade","Unidade",null,"Custo Horário","Custo Horário Total"]
[null,"-",0,0,0,null,0,null,null,{"$f":"D717*G717","v":0}]
[null,"-",0,0,0,null,0,null,null,{"$f":"D718*G718","v":0}]
[null,null,null,"Custo horário total de mão de obra",{"$nulls":5},{"$f":"SUM(J717:J718)","v":0}]
[null,null,null,"Custo horário total de execução",{"$nulls":5},{"$f":"J715+J719","v":267.51929999999999}]
[null,null,null,"Custo unitário de execução",{"$nulls":5},{"$f":"J720/I709","v":1.7906244979919677}]
[{"$nulls":7},"Custo do FIC",null,0]
[{"$nulls":7},"Custo do FIT",null,0]
[null,"C - MATERIAL",null,"Quantidade","Unidade",null,"Preço Unitário","Custo Unitário"]
[null,"-",0,996,0,null,0,null,null,{"$f":"D725*G725","v":0}]
[null,"-",0,89.28,0,null,0,null,null,{"$f":"D726*G726","v":0}]
[null,null,null,"Custo unitário total de material",{"$nulls":5},{"$f":"SUM(J725:J726)","v":0}]
[null,"D - ATIVIDADES AUXILIARES",null,"Quantidade","Unidade",null,"Custo Unitário","Custo Unitário"]
[null,"-",0,0,0,null,0,null,null,{"$f":"D729*G729","v":0}]
[null,"-",0,0,0,null,0,null,null,{"$f":"D730*G730","v":0}]
[null,null,null,"Custo total de atividades auxiliares",{"$nulls":5},{"$f":"SUM(J729:J730)","v":0}]
[{"$nulls":7},"Subtotal",null,{"$f":"J721+J727+J731+J722+J723","v":1.7906244979919677}]
[null,"E - TEMPO FIXO",null,"Código","Quantidade","Unidade",null,"Custo Unitário","Custo Unitário"]
[null,"-",0,"-",0,"t",null,0,null,{"$f":"ROUNDDOWN(E734*H734,4)","v":0}]
[null,"-",0,"-",0,"t",null,0,null,{"$f":"ROUNDDOWN(E735*H735,4)","v":0}]
[null,null,null,"Custo unitário total de tempo fixo",{"$nulls":5},{"$f":"SUM(J734:J735)","v":0}]
[null,"F - MOMENTO DE TRANSPORTE",null,"Quantidade","Unidade","DMT",null,null,null,"Custo Unitário"]
[{"$nulls":5},"LN","RP","P"]
[null,"-",0,0,"tkm"]
[null,"-",0,0,"tkm"]
[null,null,null,"Custo unitário total de transporte"]
[{"$nulls":5},"Custo unitário direto total",null,null,null,{"$f":"TRUNC(J732+J736,2)","v":1.79}]
[null,"Obs."]
[]
[21,"1ª/GRD",{"$nulls":8},{"$f":"J781","v":42.58}]
[null,"OBRA:"," PAVIMENTAÇÃO ASFÁLTICA EM CBUQ - VIAS URBANAS DIVERSAS - BOCAIUVA / MG"]
[null,"Custo Unitário de Referência",null,null,"Minas Gerais"]
[{"$nulls":4}," Abril/2025 ",null,null,"Produção da equipe ",1,{"$f":"VLOOKUP(A745,ORÇAMENTO!$A$10:$L$43,7,1)","v":"M"}]
[null,94273,"ASSENTAMENTO DE GUIA (MEIO-FIO) PRÉ-MOLDADO DE CONCRETO - 100X15X13X30 CM (COMPRIMENTO X BASE INFERIOR X BASE SUPERIOR X ALTURA) - USO VIÁRIO",{"$nulls":5},"Valores em reais (R$)"]
[null,"A - EQUIPAMENTOS",null,"Quantidade","Utilização",null,"Custo Horário",null,null,"Custo"]
[{"$nulls":4},"Operativa","Improdutiva","Produtivo","Improdutivo",null,"Horário Total"]
[null,"-",0,null,null,null,0,0,null,{"$f":"D752*(E752*G752+F752*H752)","v":0}]
[null,"-",0,null,null,null,0,0,null,{"$f":"D753*(E753*G753+F753*H753)","v":0}]
[{"$nulls":7},"Custo horário total de equipamentos",null,{"$f":"SUM(J752:J753)","v":0}]
[null,"B - MÃO DE OBRA",null,"Quantidade","Unidade",null,"Custo Horário","Custo Horário Total"]
[null,"P9824","Servente",0.2296,"h",null,21.435400000000001,null,null,{"$f":"D756*G756","v":4.9215678400000007}]
[null,"P9821","Pedreiro",0.2296,"h",null,27.132200000000001,null,null,{"$f":"D757*G757","v":6.2295531200000003}]
[null,null,null,"Custo horário total de mão de obra",{"$nulls":5},{"$f":"SUM(J756:J757)","v":11.15112096}]
[null,null,null,"Custo horário total de execução",{"$nulls":5},{"$f":"J754+J758","v":11.15112096}]
[null,null,null,"Custo unitário de execução",{"$nulls":5},{"$f":"J759/I748","v":11.15112096}]
[{"$nulls":7},"Custo do FIC",null,0]
[{"$nulls":7},"Custo do FIT",null,0]
[null,"C - MATERIAL",null,"Quantidade","Unidade",null,"Preço Unitário","Custo Unitário"]
[null,"M0082","Areia média lavada",6.6E-3,"m³",null,145.6,null,null,{"$f":"D764*G764","v":0.96095999999999993}]
[null,4059,"Meio-fio ou guia de concreto, pré-moldado, comp.1,0m x 30 x 12/15 cm (H X L1/L2)",1.0049999999999999,"m",null,29.45,"PREBOC",null,29.597249999999995]
[null,null,null,"Custo unitário total de material",{"$nulls":5},{"$f":"SUM(J764:J765)","v":30.558209999999995}]
[null,"D - ATIVIDADES AUXILIARES",null,"Quantidade","Unidade",null,"Custo Unitário","Custo Unitário"]
[null,1109669,"Argamassa de cimento e areia 1:3 - confecção em betoneira e lançamento manual - areia comercial",1.8E-3,"m³",null,488.89,null,null,{"$f":"D768*G768","v":0.88000199999999995}]
[null,"-",0,0,0,null,0,null,null,{"$f":"D769*G769","v":0}]
[null,null,null,"Custo total de atividades auxiliares",{"$nulls":5},{"$f":"SUM(J768:J769)","v":0.88000199999999995}]
[{"$nulls":7},"Subtotal",null,{"$f":"J760+J766+J770+J761+J762","v":42.589332959999993}]
[null,"E - TEMPO FIXO",null,"Código","Quantidade","Unidade",null,"Custo Unitário","Custo Unitário"]
[null,"-",0,"-",0,"t",null,0,null,{"$f":"ROUNDDOWN(E773*H773,4)","v":0}]
[null,"-",0,"-",0,"t",null,0,null,{"$f":"ROUNDDOWN(E774*H774,4)","v":0}]
[null,null,null,"Custo unitário total de tempo fixo",{"$nulls":5},{"$f":"SUM(J773:J774)","v":0}]
[null,"F - MOMENTO DE TRANSPORTE",null,"Quantidade","Unidade","DMT",null,null,null,"Custo Unitário"]
[{"$nulls":5},"LN","RP","P"]
[null,"-",0,0,"tkm","5914449","5914464","5914479"]
[null,"-",0,0,"tkm","5914449","5914464","5914479"]
[null,null,null,"Custo unitário total de transporte"]
[{"$nulls":5},"Custo unitário direto total",null,null,null,{"$f":"TRUNC(J771+J775,2)","v":42.58}]
[null,"Obs."]
[]
[23,"1ª/GRD",{"$nulls":8},{"$f":"J822","v":24.03}]
[null,"OBRA:"," PAVIMENTAÇÃO ASFÁLTICA EM CBUQ - VIAS URBANAS DIVERSAS - BOCAIUVA / MG"]
[null,"Custo Unitário de Referência",null,null,"Minas Gerais"]
[{"$nulls":4}," Abril/2025 ",null,null,"Produção da equipe ",{"$f":"1/0.2326","v":4.2992261392949267},{"$f":"VLOOKUP(A784,ORÇAMENTO!$A$10:$L$43,7,1)","v":"M"}]
[null,"94287a","EXECUÇÃO DE SARJETA EM CONCRETO USINADO, MOLDADO IN LOCO - 30CM DE BASE X 5CM DE ALTURA",{"$nulls":5},"Valores em reais (R$)"]
[null,"A - EQUIPAMENTOS",null,"Quantidade","Utilização",null,"Custo Horário",null,null,"Custo"]
[{"$nulls":4},"Operativa","Improdutiva","Produtivo","Improdutivo",null,"Horário Total"]
[null,"-",0,null,null,null,0,0,null,{"$f":"D791*(E791*G791+F791*H791)","v":0}]
[null,"-",0,null,null,null,0,0,null,{"$f":"D792*(E792*G792+F792*H792)","v":0}]
[{"$nulls":7},"Custo horário total de equipamentos",null,{"$f":"SUM(J791:J792)","v":0}]
[null,"B - MÃO DE OBRA",null,"Quantidade","Unidade",null,"Custo Horário","Custo Horário Total"]
[null,"P9821","Pedreiro",1,"h",null,27.132200000000001,null,null,{"$f":"D795*G795","v":27.132200000000001}]
[null,"P9824","Servente",1,"h",null,21.435400000000001,null,null,{"$f":"D796*G796","v":21.435400000000001}]
[null,null,null,"Custo horário total de mão de obra",{"$nulls":5},{"$f":"SUM(J795:J796)","v":48.567599999999999}]
[null,null,null,"Custo horário total de execução",{"$nulls":5},{"$f":"J793+J797","v":48.567599999999999}]
[null,null,null,"Custo unitário de execução",{"$nulls":5},{"$f":"J798/I787","v":11.296823760000001}]
[{"$nulls":7},"Custo do FIC",null,0]
[{"$nulls":7},"Custo do FIT",null,0]
[null,"C - MATERIAL",null,"Quantidade","Unidade",null,"Preço Unitário","Custo Unitário"]
[null,"M0082","Areia média lavada",9.9000000000000008E-3,"m³",null,145.6,null,null,{"$f":"D803*G803","v":1.4414400000000001}]
[null,"M0286","Tábua - E = 2,5 cm e L = 30 cm",8.3299999999999999E-2,"m",null,15.813599999999999,null,null,{"$f":"D804*G804","v":1.31727288}]
[null,"M0451","Concreto usinado - fck = 20 MPa (comercial)",1.8800000000000001E-2,"m³",null,520,"SINAPI - 34492",null,9.7759999999999998]
[null,"M1358","Sarrafo em madeira de terceira - E = 2,5 cm e L = 5 cm",0.1,"m",null,2.0291000000000001,null,null,0.20291000000000003]
[null,null,null,"Custo unitário total de material",{"$nulls":5},{"$f":"SUM(J803:J806)","v":12.73762288}]
[null,"D - ATIVIDADES AUXILIARES",null,"Quantidade","Unidade",null,"Custo Unitário","Custo Unitário"]
[null,"-",0,null,0,null,0,null,null,{"$f":"D809*G809","v":0}]
[null,"-",0,null,0,null,0,null,null,{"$f":"D810*G810","v":0}]
[null,null,null,"Custo total de atividades auxiliares",{"$nulls":5},{"$f":"SUM(J809:J810)","v":0}]
[{"$nulls":7},"Subtotal",null,{"$f":"J799+J807+J811+J800+J801","v":24.034446639999999}]
[null,"E - TEMPO FIXO",null,"Código","Quantidade","Unidade",null,"Custo Unitário","Custo Unitário"]
[null,"-",0,"-",0,"t",null,0,null,{"$f":"ROUNDDOWN(E814*H814,4)","v":0}]
[null,"-",0,"-",0,"t",null,0,null,{"$f":"ROUNDDOWN(E815*H815,4)","v":0}]
[null,null,null,"Custo unitário total de tempo fixo",{"$nulls":5},{"$f":"SUM(J814:J815)","v":0}]
[null,"F - MOMENTO DE TRANSPORTE",null,"Quantidade","Unidade","DMT",null,null,null,"Custo Unitário"]
[{"$nulls":5},"LN","RP","P"]
[null,"-",0,0,"tkm"]
[null,"-",0,0,"tkm"]
[null,null,null,"Custo unitário total de transporte"]
[{"$nulls":5},"Custo unitário direto total",null,null,null,{"$f":"TRUNC(J812+J816,2)","v":24.03}]
[null,"Obs."]
[]
[46,"1ª/GRD",{"$nulls":8},{"$f":"J861","v":271.87}]
[null,"OBRA:"," PAVIMENTAÇÃO ASFÁLTICA EM CBUQ - VIAS URBANAS DIVERSAS - BOCAIUVA / MG"]
[null,"Custo Unitário de Referência",null,null,"Minas Gerais"]
[{"$nulls":4}," Abril/2025 ",null,null,"Produção da equipe ",3,{"$f":"VLOOKUP(A825,ORÇAMENTO!$A$10:$L$43,7,1)","v":"UN."}]
[null,5213440,"PLACA DE REGULAMENTAÇÃO EM AÇO, D=60CM - PELÍCULA RETRORREFLETIVA - FORNECIMENTO E INSTALAÇÃO, INCLUSIVE  SUPORTE",{"$nulls":5},"Valores em reais (R$)"]
[null,"A - EQUIPAMENTOS",null,"Quantidade","Utilização",null,"Custo Horário",null,null,"Custo"]
[{"$nulls":4},"Operativa","Improdutiva","Produtivo","Improdutivo",null,"Horário Total"]
[null,"E9687","Caminhão carroceria com capacidade de 5 t - 120 kW",1,0.3,0.7,154.82689999999999,59.719900000000003,null,{"$f":"D832*(E832*G832+F832*H832)","v":88.251999999999995}]
[null,"-",0,null,null,null,0,0,null,{"$f":"D833*(E833*G833+F833*H833)","v":0}]
[{"$nulls":7},"Custo horário total de equipamentos",null,{"$f":"SUM(J832:J833)","v":88.251999999999995}]
[null,"B - MÃO DE OBRA",null,"Quantidade","Unidade",null,"Custo Horário","Custo Horário Total"]
[null,"P9830","Montador",1,"h",null,38.260300000000001,null,null,{"$f":"D836*G836","v":38.260300000000001}]
[null,"P9824","Servente",2,"h",null,21.435400000000001,null,null,{"$f":"D837*G837","v":42.870800000000003}]
[null,null,null,"Custo horário total de mão de obra",{"$nulls":5},{"$f":"SUM(J836:J837)","v":81.131100000000004}]
[null,null,null,"Custo horário total de execução",{"$nulls":5},{"$f":"J834+J838","v":169.38310000000001}]
[null,null,null,"Custo unitário de execução",{"$nulls":5},{"$f":"J839/I828","v":56.46103333333334}]
[{"$nulls":7},"Custo do FIC",null,0]
[{"$nulls":7},"Custo do FIT",null,0]
[null,"C - MATERIAL",null,"Quantidade","Unidade",null,"Preço Unitário","Custo Unitário"]
[null,"-",0,null,0,null,0,null,null,{"$f":"D844*G844","v":0}]
[null,"-",0,null,0,null,0,null,null,{"$f":"D845*G845","v":0}]
[null,null,null,"Custo unitário total de material",{"$nulls":5},{"$f":"SUM(J844:J845)","v":0}]
[null,"D - ATIVIDADES AUXILIARES",null,"Quantidade","Unidade",null,"Custo Unitário","Custo Unitário"]
[null,5213414,"Placa em aço nº 16 galvanizado com película retrorrefletiva tipo I + SI - confecção",0.35993999999999998,"m²",null,598.48,null,null,{"$f":"D848*G848","v":215.41689120000001}]
[null,"-",0,null,0,null,0,null,null,{"$f":"D849*G849","v":0}]
[null,null,null,"Custo total de atividades auxiliares",{"$nulls":5},{"$f":"SUM(J848:J849)","v":215.41689120000001}]
[{"$nulls":7},"Subtotal",null,{"$f":"J840+J846+J850+J841+J842","v":271.87792453333333}]
[null,"E - TEMPO FIXO",null,"Código","Quantidade","Unidade",null,"Custo Unitário","Custo Unitário"]
[null,"-",0,"-",null,"t",null,0,null,{"$f":"ROUNDDOWN(E853*H853,4)","v":0}]
[null,"-",0,"-",null,"t",null,0,null,{"$f":"ROUNDDOWN(E854*H854,4)","v":0}]
[null,null,null,"Custo unitário total de tempo fixo",{"$nulls":5},{"$f":"SUM(J853:J854)","v":0}]
[null,"F - MOMENTO DE TRANSPORTE",null,"Quantidade","Unidade","DMT",null,null,null,"Custo Unitário"]
[{"$nulls":5},"LN","RP","P"]
[null,"-",0,null,"tkm"]
[null,"-",0,null,"tkm"]
[null,null,null,"Custo unitário total de transporte"]
[{"$nulls":5},"Custo unitário direto total",null,null,null,{"$f":"TRUNC(J851+J855,2)","v":271.87}]
[null,"Obs."]
[]
[49,"1ª/GRD",{"$nulls":8},{"$f":"J907","v":27.24}]
[null,"OBRA:"," PAVIMENTAÇÃO ASFÁLTICA EM CBUQ - VIAS URBANAS DIVERSAS - BOCAIUVA / MG"]
[null,"Custo Unitário de Referência",null,null,"Minas Gerais"]
[{"$nulls":4}," Abril/2025 ",null,null,"Produção da equipe ",149.4,{"$f":"VLOOKUP(A864,ORÇAMENTO!$A$10:$L$43,7,1)","v":"M2"}]
[null,5213401,"PINTURA DE EIXO VIÁRIO SOBRE ASFALTO COM TINTA RETRORREFLETIVA A BASE DE RESINA ACRÍLICA COM MICROESFERAS DE VIDRO, APLICAÇÃO MECÂNICA COM DEMARCADORA AUTOPROPELIDA",{"$nulls":5},"Valores em reais (R$)"]
[null,"A - EQUIPAMENTOS",null,"Quantidade","Utilização",null,"Custo Horário",null,null,"Custo"]
[{"$nulls":4},"Operativa","Improdutiva","Produtivo","Improdutivo",null,"Horário Total"]
[null,"E9644","Caminhão demarcador de faixas com sistema de pintura a frio - 28 kW/129 kW",1,1,0,403.09390000000002,159.4639,null,{"$f":"D871*(E871*G871+F871*H871)","v":403.09390000000002}]
[null,"-",0,null,null,null,0,0,null,{"$f":"D872*(E872*G872+F872*H872)","v":0}]
[{"$nulls":7},"Custo horário total de equipamentos",null,{"$f":"SUM(J871:J872)","v":403.09390000000002}]
[null,"B - MÃO DE OBRA",null,"Quantidade","Unidade",null,"Custo Horário","Custo Horário Total"]
[null,"P9853","Pré-marcador",1,"h",null,23.213999999999999,null,null,{"$f":"D875*G875","v":23.213999999999999}]
[null,"P9824","Servente",4,"h",null,21.435400000000001,null,null,{"$f":"D876*G876","v":85.741600000000005}]
[null,null,null,"Custo horário total de mão de obra",{"$nulls":5},{"$f":"SUM(J875:J876)","v":108.9556}]
[null,null,null,"Custo horário total de execução",{"$nulls":5},{"$f":"J873+J877","v":512.04950000000008}]
[null,null,null,"Custo unitário de execução",{"$nulls":5},{"$f":"J878/I867","v":3.4273728246318611}]
[{"$nulls":7},"Custo do FIC",null,0]
[{"$nulls":7},"Custo do FIT",null,0]
[null,"C - MATERIAL",null,"Quantidade","Unidade",null,"Preço Unitário","Custo Unitário"]
[null,"M2037","Microesferas refletivas de vidro tipo I-B",0.12,"kg",null,8.7142999999999997,null,null,{"$f":"D883*G883","v":1.0457159999999999}]
[null,"M2038","Microesferas refletivas de vidro tipo II-A",0.35,"kg",null,8.8077000000000005,null,null,{"$f":"D884*G884","v":3.0826950000000002}]
[null,"M2034","Solvente para tinta à base de resina acrílica",0.03,"l",null,16.6828,null,null,0.50048400000000004]
[null,"M2044","Tinta à base de resina acrílica emulsionada em água para pré-marcação viária",9.7000000000000005E-4,"l",null,19.888300000000001,null,null,1.9291651000000003E-2]
[null,"M2027","Tinta à base de resina acrílica estirenada para demarcação viária",0.6,"l",null,31.8858,null,null,19.13148]
[null,null,null,"Custo unitário total de material",{"$nulls":5},{"$f":"SUM(J883:J887)","v":23.779666650999999}]
[null,"D - ATIVIDADES AUXILIARES",null,"Quantidade","Unidade",null,"Custo Unitário","Custo Unitário"]
[null,"-",0,null,0,null,0,null,null,{"$f":"D890*G890","v":0}]
[null,"-",0,null,0,null,0,null,null,{"$f":"D891*G891","v":0}]
[null,null,null,"Custo total de atividades auxiliares",{"$nulls":5},{"$f":"SUM(J890:J891)","v":0}]
[{"$nulls":7},"Subtotal",null,{"$f":"J879+J888+J892+J880+J881","v":27.207039475631859}]
[null,"E - TEMPO FIXO",null,"Código","Quantidade","Unidade",null,"Custo Unitário","Custo Unitário"]
[null,"M2037","Microesferas refletivas de vidro tipo I-B",5914655,1.2E-4,"t",null,32.39,null,{"$f":"ROUNDDOWN(E895*H895,4)","v":3.8E-3}]
[null,"M2038","Microesferas refletivas de vidro tipo II-A",5914655,3.5E-4,"t",null,32.39,null,{"$f":"ROUNDDOWN(E896*H896,4)","v":1.1299999999999999E-2}]
[null,"M2034","Solvente para tinta à base de resina acrílica",5914655,3.0000000000000001E-5,"t",null,32.39,null,8.9999999999999998E-4]
[null,"M2027","Tinta à base de resina acrílica estirenada para demarcação viária",5914655,8.3000000000000001E-4,"t",null,32.39,null,2.6800000000000001E-2]
[null,null,null,"Custo unitário total de tempo fixo",{"$nulls":5},{"$f":"SUM(J895:J898)","v":4.2800000000000005E-2}]
[null,"F - MOMENTO DE TRANSPORTE",null,"Quantidade","Unidade","DMT",null,null,null,"Custo Unitário"]
[{"$nulls":5},"LN","RP","P"]
[null,"M2037","Microesferas refletivas de vidro tipo I-B",1.2E-4,"tkm"]
[null,"M2038","Microesferas refletivas de vidro tipo II-A",3.5E-4,"tkm"]
[null,"M2034","Solvente para tinta à base de resina acrílica",3.0000000000000001E-5,"tkm"]
[null,"M2027","Tinta à base de resina acrílica estirenada para demarcação viária",8.3000000000000001E-4,"tkm"]
[null,null,null,"Custo unitário total de transporte"]
[{"$nulls":5},"Custo unitário direto total",null,null,null,{"$f":"TRUNC(J893+J899,2)","v":27.24}]
[null,"Obs."]
[]
[51,"1ª/GRD",{"$nulls":8},{"$f":"J953","v":40.78}]
[null,"OBRA:"," PAVIMENTAÇÃO ASFÁLTICA EM CBUQ - VIAS URBANAS DIVERSAS - BOCAIUVA / MG"]
[null,"Custo Unitário de Referência",null,null,"Minas Gerais"]
[{"$nulls":4}," Abril/2025 ",null,null,"Produção da equipe ",30.18,{"$f":"VLOOKUP(A910,ORÇAMENTO!$A$10:$L$43,7,1)","v":"M2"}]
[null,5213405,"PINTURA DE FAIXA DE PEDESTRE OU ZEBRADA TINTA RETRORREFLETIVA A BASE DE RESINA ACRÍLICA COM MICROESFERAS DE VIDRO, APLICAÇÃO MANUAL",{"$nulls":5},"Valores em reais (R$)"]
[null,"A - EQUIPAMENTOS",null,"Quantidade","Utilização",null,"Custo Horário",null,null,"Custo"]
[{"$nulls":4},"Operativa","Improdutiva","Produtivo","Improdutivo",null,"Horário Total"]
[null,"E9644","Caminhão demarcador de faixas com sistema de pintura a frio - 28 kW/129 kW",1,1,0,403.09390000000002,159.4639,null,{"$f":"D917*(E917*G917+F917*H917)","v":403.09390000000002}]
[null,"-",0,null,null,null,0,0,null,{"$f":"D918*(E918*G918+F918*H918)","v":0}]
[{"$nulls":7},"Custo horário total de equipamentos",null,{"$f":"SUM(J917:J918)","v":403.09390000000002}]
[null,"B - MÃO DE OBRA",null,"Quantidade","Unidade",null,"Custo Horário","Custo Horário Total"]
[null,"P9853","Pré-marcador",1,"h",null,23.213999999999999,null,null,{"$f":"D921*G921","v":23.213999999999999}]
[null,"P9824","Servente",4,"h",null,21.435400000000001,null,null,{"$f":"D922*G922","v":85.741600000000005}]
[null,null,null,"Custo horário total de mão de obra",{"$nulls":5},{"$f":"SUM(J921:J922)","v":108.9556}]
[null,null,null,"Custo horário total de execução",{"$nulls":5},{"$f":"J919+J923","v":512.04950000000008}]
[null,null,null,"Custo unitário de execução",{"$nulls":5},{"$f":"J924/I913","v":16.966517561298875}]
[{"$nulls":7},"Custo do FIC",null,0]
[{"$nulls":7},"Custo do FIT",null,0]
[null,"C - MATERIAL",null,"Quantidade","Unidade",null,"Preço Unitário","Custo Unitário"]
[null,"M2037","Microesferas refletivas de vidro tipo I-B",0.12,"kg",null,8.7142999999999997,null,null,{"$f":"D929*G929","v":1.0457159999999999}]
[null,"M2038","Microesferas refletivas de vidro tipo II-A",0.35,"kg",null,8.8077000000000005,null,null,{"$f":"D930*G930","v":3.0826950000000002}]
[null,"M2034","Solvente para tinta à base de resina acrílica",0.03,"l",null,16.6828,null,null,0.50048400000000004]
[null,"M2044","Tinta à base de resina acrílica emulsionada em água para pré-marcação viária",9.7000000000000005E-4,"l",null,19.888300000000001,null,null,1.9291651000000003E-2]
[null,"M2027","Tinta à base de resina acrílica estirenada para demarcação viária",0.6,"l",null,31.8858,null,null,19.13148]
[null,null,null,"Custo unitário total de material",{"$nulls":5},{"$f":"SUM(J929:J933)","v":23.779666650999999}]
[null,"D - ATIVIDADES AUXILIARES",null,"Quantidade","Unidade",null,"Custo Unitário","Custo Unitário"]
[null,"-",0,null,0,null,0,null,null,{"$f":"D936*G936","v":0}]
[null,"-",0,null,0,null,0,null,null,{"$f":"D937*G937","v":0}]
[null,null,null,"Custo total de atividades auxiliares",{"$nulls":5},{"$f":"SUM(J936:J937)","v":0}]
[{"$nulls":7},"Subtotal",null,{"$f":"J925+J934+J938+J926+J927","v":40.746184212298871}]
[null,"E - TEMPO FIXO",null,"Código","Quantidade","Unidade",null,"Custo Unitário","Custo Unitário"]
[null,"M2037","Microesferas refletivas de vidro tipo I-B",5914655,1.2E-4,"t",null,32.39,null,{"$f":"ROUNDDOWN(E941*H941,4)","v":3.8E-3}]
[null,"M2038","Microesferas refletivas de vidro tipo II-A",5914655,3.5E-4,"t",null,32.39,null,{"$f":"ROUNDDOWN(E942*H942,4)","v":1.1299999999999999E-2}]
[null,"M2034","Solvente para tinta à base de resina acrílica",5914655,3.0000000000000001E-5,"t",null,32.39,null,8.9999999999999998E-4]
[null,"M2027","Tinta à base de resina acrílica estirenada para demarcação viária",5914655,8.3000000000000001E-4,"t",null,32.39,null,2.6800000000000001E-2]
[null,null,null,"Custo unitário total de tempo fixo",{"$nulls":5},{"$f":"SUM(J941:J944)","v":4.2800000000000005E-2}]
[null,"F - MOMENTO DE TRANSPORTE",null,"Quantidade","Unidade","DMT",null,null,null,"Custo Unitário"]
[{"$nulls":5},"LN","RP","P"]
[null,"M2037","Microesferas refletivas de vidro tipo I-B",1.2E-4,"tkm"]
[null,"M2038","Microesferas refletivas de vidro tipo II-A",3.5E-4,"tkm"]
[null,"M2034","Solvente para tinta à base de resina acrílica",3.0000000000000001E-5,"tkm"]
[null,"M2027","Tinta à base de resina acrílica estirenada para demarcação viária",8.3000000000000001E-4,"tkm"]
[null,null,null,"Custo unitário total de transporte"]
[{"$nulls":5},"Custo unitário direto total",null,null,null,{"$f":"TRUNC(J939+J945,2)","v":40.78}]
[null,"Obs."]

{"sheet":"CPU-FORNEC","index":2,"n_rows":92,"n_cols":14,"rows_kept":92,"cut":false,"hidden":false,"merged":[[71,0,80,0],[71,1,71,3],[71,4,71,7],[72,2,72,5],[73,2,73,3],[74,1,74,7],[77,1,77,3],[77,5,77,6],[78,1,78,6],[79,1,79,6],[80,1,80,6],[38,0,47,0],[38,1,38,3],[38,4,38,7],[39,2,39,5],[0,0,26,0],[0,1,0,3],[0,4,0,7],[22,1,22,3],[49,0,58,0],[49,1,49,3],[49,4,49,7],[50,2,50,5],[51,2,51,3],[52,1,52,7],[55,1,55,3],[55,5,55,6],[56,1,56,6],[57,1,57,6],[58,1,58,6],[27,1,27,3],[27,4,27,7],[28,2,28,5],[27,0,36,0],[29,2,29,3],[30,1,30,7],[33,1,33,3],[33,5,33,6],[34,1,34,6],[35,1,35,6],[36,1,36,6],[0,10,0,11],[1,2,1,5],[1,10,1,11],[2,2,2,3],[3,1,3,7],[22,5,22,6],[23,1,23,6],[24,1,24,6],[25,1,25,6],[5,1,5,7],[9,1,9,7],[13,1,13,7],[17,1,17,7],[40,2,40,3],[41,1,41,7],[44,1,44,3],[44,5,44,6],[45,1,45,6],[46,1,46,6],[47,1,47,6],[60,0,69,0],[60,1,60,3],[60,4,60,7],[61,2,61,5],[62,2,62,3],[63,1,63,7],[66,1,66,3],[66,5,66,6],[67,1,67,6],[68,1,68,6],[69,1,69,6],[81,1,81,7],[82,0,91,0],[82,1,82,3],[82,4,82,7],[83,2,83,5],[84,2,84,3],[85,1,85,7],[88,1,88,3],[88,5,88,6],[89,1,89,6],[90,1,90,6],[91,1,91,6]]}
[1,"CODEVASF",null,null," COMPOSIÇÃO DE PREÇO UNITÁRIO",null,null,null,{"$f":"H24","v":0},{"$f":"H26","v":0},"BDI CALCULADO:",null,{"$f":"ORÇAMENTO!L6","v":15}]
[null,"OBRA:  "," PAVIMENTAÇÃO ASFÁLTICA EM CBUQ - VIAS URBANAS DIVERSAS - BOCAIUVA / MG",null,null,null,"DATA: ",{"$f":"ORÇAMENTO!C6","v":" SETEMBRO / 2025"},null,null,"BDI DIFERENCIADO:",null,{"$f":"'BDI FORN'!D31/100","v":0.15}]
[null,"SERVIÇO:  ","CPU.1",null,"Referência:","CODEVASF","UNIDADE: ",{"$f":"VLOOKUP(A1,ORÇAMENTO!A11:L31,5)","v":"MOBILIZAÇÃO E DESMOBILIZAÇÃO"}]
[]
[null,"TIPO ITEM","CODIGO ITEM","DESCRIÇÃO ITEM","UNIDADE ITEM","COEFICIENTE","PRECO UNITARIO","CUSTO TOTAL",null,"distancia =",90,"B.DESPACHO"]
[null,"EQUIPAMENTOS",{"$nulls":7},"Pá carregadeira ",null,null,10.1," ton"]
[null,null,"E9001","E9001","E9001",null,"E9001"]
[]
[]
[null,"MÃO DE OBRA"]
[]
[]
[]
[null,"MATERIAIS"]
[]
[]
[{"$nulls":7},{"$f":"ROUNDDOWN(F17*G17,2)","v":0},null,"Motoniveladora ",null,null,12.47," ton"]
[null,"ATIVIDADES AUXILIARES",{"$nulls":7},"Trator de pneus",null,null,2.8," ton"]
[{"$nulls":7},{"$f":"ROUNDDOWN(F19*G19,2)","v":0}]
[{"$nulls":7},0]
[{"$nulls":7},0]
[{"$nulls":7},{"$f":"ROUNDDOWN(F22*G22,2)","v":0},null,"Rolo Compactador ",null,null,15.33," ton"]
[null,"PRODUÇÃO DA EQUIPE",null,null,1,"CUSTO ",null,{"$f":"SUM(H6:H22)","v":0},null,"Grade de disco",null,null,1," ton"]
[null,"TOTAL",{"$nulls":5},{"$f":"H23/E23","v":0},"OK","RETROESCAVADEIRA",null,null,6.67," ton"]
[null,"BDI                %",{"$nulls":5},{"$f":"1+$M$1","v":16}]
[null,"TOTAL DO SERVIÇO - R$",{"$nulls":5},{"$f":"ROUND(H24*H25,2)","v":0}]
[]
["F1","CODEVASF",null,null," COMPOSIÇÃO DE PREÇO UNITÁRIO",null,null,null,{"$f":"H35","v":2732.37},{"$f":"H37","v":3142.23}]
[null,"OBRA:  "," PAVIMENTAÇÃO ASFÁLTICA EM CBUQ - VIAS URBANAS DIVERSAS - BOCAIUVA / MG",null,null,null,"DATA: ",{"$f":"$H$2","v":" SETEMBRO / 2025"}]
[null,"SERVIÇO:  ","AQUISIÇÃO DE EMULSÃO ASFÁLTICA PARA IMPRIMAÇÃO (EAI) - EXCLUSIVE TRANSPORTE",null,"Referência:","CPU.5","UNIDADE: ",{"$f":"VLOOKUP(A28,ORÇAMENTO!$A$11:$L$43,7)","v":"T"}]
[]
[null,"TIPO ITEM","CODIGO ITEM","DESCRIÇÃO ITEM","UNIDADE ITEM","COEFICIENTE","PRECO UNITARIO","CUSTO TOTAL"]
[null,"INSUMO","ANP","EMULSÃO ASFÁLTICA PARA SERVIÇO DE IMPRIMAÇÃO (MEMÓRIA EM ANEXO)","T",1,2732.3744869653506,{"$f":"ROUNDDOWN(F33*G33,2)","v":2732.37}]
[null,"PRODUÇÃO DA EQUIPE",null,null,1,"CUSTO ",null,{"$f":"SUM(H33:H33)","v":2732.37}]
[null,"TOTAL",{"$nulls":5},{"$f":"H34/E34","v":2732.37}]
[null,"BDI                %",{"$nulls":5},{"$f":"1+$M$2","v":1.1499999999999999}]
[null,"TOTAL DO SERVIÇO - R$",{"$nulls":5},{"$f":"ROUND(H35*H36,2)","v":3142.23},"OK"]
[]
["F2","CODEVASF",null,null," COMPOSIÇÃO DE PREÇO UNITÁRIO",null,null,null,{"$f":"H46","v":359.79},{"$f":"H48","v":413.76}]
[null,"OBRA:  "," PAVIMENTAÇÃO ASFÁLTICA EM CBUQ - VIAS URBANAS DIVERSAS - BOCAIUVA / MG",null,null,null,"DATA: ",{"$f":"$H$2","v":" SETEMBRO / 2025"}]
[null,"SERVIÇO:  ","TRANSPORTE DE EMULSÃO ASFÁLTICA PARA IMPRIMAÇÃO (EAI)",null,"Referência:","CPU.6","UNIDADE: ",{"$f":"VLOOKUP(A39,ORÇAMENTO!$A$11:$L$43,7)","v":"T"}]
[]
[null,"TIPO ITEM","CODIGO ITEM","DESCRIÇÃO ITEM","UNIDADE ITEM","COEFICIENTE","PRECO UNITARIO","CUSTO TOTAL"]
[null,"INSUMO"," - ","TRANSPORTE DE EMULSÃO ASFÁLTICA PARA IMPRIMAÇÃO (EAI), INCLUINDO CUSTO TOTAL DO TRANSPORTE (COMBUSTÍVEL, PEDÁGIOS, ETC.) E ICMS - MEMÓRIA ANEXA","T",1,359.79666666666668,{"$f":"ROUNDDOWN(F44*G44,2)","v":359.79}]
[null,"PRODUÇÃO DA EQUIPE",null,null,1,"CUSTO ",null,{"$f":"SUM(H44:H44)","v":359.79}]
[null,"TOTAL",{"$nulls":5},{"$f":"H45/E45","v":359.79}]
[null,"BDI                %",{"$nulls":5},{"$f":"1+$M$2","v":1.1499999999999999}]
[null,"TOTAL DO SERVIÇO - R$",{"$nulls":5},{"$f":"ROUND(H46*H47,2)","v":413.76},"OK"]
[]
["F3","CODEVASF",null,null," COMPOSIÇÃO DE PREÇO UNITÁRIO",null,null,null,{"$f":"H57","v":3375.89},{"$f":"H59","v":3882.27}]
[null,"OBRA:  "," PAVIMENTAÇÃO ASFÁLTICA EM CBUQ - VIAS URBANAS DIVERSAS - BOCAIUVA / MG",null,null,null,"DATA: ",{"$f":"$H$2","v":" SETEMBRO / 2025"}]
[null,"SERVIÇO:  ","AQUISIÇÃO DE EMULSAO ASFALTICA CATIONICA RR-1C - EXCLUSIVE TRANSPORTE",null,"Referência:","CPU.7","UNIDADE: ",{"$f":"VLOOKUP(A50,ORÇAMENTO!$A$11:$L$43,7)","v":"T"}]
[]
[null,"TIPO ITEM","CODIGO ITEM","DESCRIÇÃO ITEM","UNIDADE ITEM","COEFICIENTE","PRECO UNITARIO","CUSTO TOTAL"]
[null,"INSUMO","ANP","EMULSÃO ASFÁLTICA CATIÔNICA RR-1C(MEMÓRIA EM ANEXO)","T",1,3375.8970747684684,{"$f":"ROUNDDOWN(F55*G55,2)","v":3375.89}]
[null,"PRODUÇÃO DA EQUIPE",null,null,1,"CUSTO ",null,{"$f":"SUM(H55:H55)","v":3375.89}]
[null,"TOTAL",{"$nulls":5},{"$f":"H56/E56","v":3375.89},"OK"]
[null,"BDI                %",{"$nulls":5},{"$f":"1+$M$2","v":1.1499999999999999}]
[null,"TOTAL DO SERVIÇO - R$",{"$nulls":5},{"$f":"ROUND(H57*H58,2)","v":3882.27}]
[]
["F4","CODEVASF",null,null," COMPOSIÇÃO DE PREÇO UNITÁRIO",null,null,null,{"$f":"H68","v":393.78},{"$f":"H70","v":452.85}]
[null,"OBRA:  "," PAVIMENTAÇÃO ASFÁLTICA EM CBUQ - VIAS URBANAS DIVERSAS - BOCAIUVA / MG",null,null,null,"DATA: ",{"$f":"$H$2","v":" SETEMBRO / 2025"}]
[null,"SERVIÇO:  ","TRANSPORTE DE EMULSÃO ASFÁLTICA CATIONICA RR-1C",null,"Referência:","CPU.8","UNIDADE: ",{"$f":"VLOOKUP(A61,ORÇAMENTO!$A$11:$L$43,7)","v":"T"}]
[]
[null,"TIPO ITEM","CODIGO ITEM","DESCRIÇÃO ITEM","UNIDADE ITEM","COEFICIENTE","PRECO UNITARIO","CUSTO TOTAL"]
[null,"INSUMO"," - ","TRANSPORTE DE EMULSÃO ASFÁLTICA CATIONICA TIPO RR-1C, INCLUINDO CUSTO TOTAL DO TRANSPORTE (COMBUSTÍVEL, PEDÁGIOS, ETC.) E ICMS - MEMÓRIA ANEXA","T",1,393.78111111111104,{"$f":"ROUNDDOWN(F66*G66,2)","v":393.78}]
[null,"PRODUÇÃO DA EQUIPE",null,null,1,"CUSTO ",null,{"$f":"SUM(H66:H66)","v":393.78}]
[null,"TOTAL",{"$nulls":5},{"$f":"H67/E67","v":393.78},"OK"]
[null,"BDI                %",{"$nulls":5},{"$f":"1+$M$2","v":1.1499999999999999}]
[null,"TOTAL DO SERVIÇO - R$",{"$nulls":5},{"$f":"ROUND(H68*H69,2)","v":452.85}]
[]
["F5","CODEVASF",null,null," COMPOSIÇÃO DE PREÇO UNITÁRIO",null,null,null,{"$f":"H79","v":4511.6000000000004},{"$f":"H81","v":5188.34}]
[null,"OBRA:  "," PAVIMENTAÇÃO ASFÁLTICA EM CBUQ - VIAS URBANAS DIVERSAS - BOCAIUVA / MG",null,null,null,"DATA: ",{"$f":"$H$2","v":" SETEMBRO / 2025"}]
[null,"SERVIÇO:  ","AQUISIÇÃO DE CONCRETO ASFÁLTICO DE PETRÓLEO - CAP 50/70 - EXCLUSIVE TRANSPORTE",null,"Referência:","CPU.9","UNIDADE: ",{"$f":"VLOOKUP(A72,ORÇAMENTO!$A$11:$L$43,7)","v":"T"}]
[]
[null,"TIPO ITEM","CODIGO ITEM","DESCRIÇÃO ITEM","UNIDADE ITEM","COEFICIENTE","PRECO UNITARIO","CUSTO TOTAL"]
[null,"INSUMO",1518,"CIMENTOS ASFÁLTICO DE PETRÓLEO TIPO CAP 50/70 (MEMÓRIA EM ANEXO)","T",1,4511.6031484658479,{"$f":"ROUNDDOWN(F77*G77,2)","v":4511.6000000000004}]
[null,"PRODUÇÃO DA EQUIPE",null,null,1,"CUSTO ",null,{"$f":"SUM(H77:H77)","v":4511.6000000000004}]
[null,"TOTAL",{"$nulls":5},{"$f":"H78/E78","v":4511.6000000000004}]
[null,"BDI                %",{"$nulls":5},{"$f":"1+$M$2","v":1.1499999999999999}]
[null,"TOTAL DO SERVIÇO - R$",{"$nulls":5},{"$f":"ROUND(H79*H80,2)","v":5188.34}]
[]
["F6","CODEVASF",null,null," COMPOSIÇÃO DE PREÇO UNITÁRIO",null,null,null,{"$f":"H90","v":689.15},{"$f":"H92","v":792.52}]
[null,"OBRA:  "," PAVIMENTAÇÃO ASFÁLTICA EM CBUQ - VIAS URBANAS DIVERSAS - BOCAIUVA / MG",null,null,null,"DATA: ",{"$f":"$H$2","v":" SETEMBRO / 2025"}]
[null,"SERVIÇO:  ","TRANSPORTE DE CONCRETO ASFÁLTICO DE PETRÓLEO - CAP 50/70",null,"Referência:","CPU.10","UNIDADE: ",{"$f":"VLOOKUP(A83,ORÇAMENTO!$A$11:$L$43,7)","v":"T"}]
[]
[null,"TIPO ITEM","CODIGO ITEM","DESCRIÇÃO ITEM","UNIDADE ITEM","COEFICIENTE","PRECO UNITARIO","CUSTO TOTAL"]
[null,"INSUMO"," - ","TRANSPORTE DE CIMENTO ASFÁLTICO DE PETRÓLEO TIPO CAP 50-70, INCLUINDO CUSTO TOTAL DO TRANSPORTE (COMBUSTÍVEL, PEDÁGIOS, ETC.) E ICMS - MEMÓRIA ANEXA","T",1,689.15509025270762,{"$f":"ROUNDDOWN(F88*G88,2)","v":689.15}]
[null,"PRODUÇÃO DA EQUIPE",null,null,1,"CUSTO ",null,{"$f":"SUM(H88:H88)","v":689.15}]
[null,"TOTAL",{"$nulls":5},{"$f":"H89/E89","v":689.15}]
[null,"BDI                %",{"$nulls":5},{"$f":"1+$M$2","v":1.1499999999999999}]
[null,"TOTAL DO SERVIÇO - R$",{"$nulls":5},{"$f":"ROUND(H90*H91,2)","v":792.52}]

{"sheet":"AUX-VEIC.","index":3,"n_rows":31,"n_cols":5,"rows_kept":31,"cut":false,"hidden":false,"merged":[[25,2,25,3],[1,1,1,4],[2,1,2,2],[3,1,3,4],[17,1,17,4],[18,2,18,3],[19,2,19,3],[20,2,20,3],[21,2,21,3],[22,2,22,3],[23,2,23,3],[24,2,24,3],[26,2,26,3],[27,2,27,3],[28,2,28,3],[29,1,30,1],[29,2,29,3],[30,2,30,3]]}
[]
[null,"CÁLCULO DO CUSTO POR MÊS DE VEÍCULOS"]
[null,"Veículo: Polo TSI, Onix Turbo, Argo 1.3, HB-20 Turbo",null,"Data:","2025-08-28"]
[null,"DADOS ELEMENTARES DO VEÍCULO"]
[null,"Dados Básicos","Preço (R$)","Quantidade","Vida Útil"]
[null,"Quilometragem média mensal",null,3000]
[null,"Valor de Aquisição (VA)",103900]
[null,"Taxa de Juros (i)%",null,14.75]
[null,"IPVA e Seguro Obrigatório (4%)",4156]
[null,"Lavagem",50,2]
[null,"Pneus",479.9,4,50000]
[null,"Combustível",6.01,14]
[null,"Óleo Lubrificante + Filtros (revisão)",846.74400000000003,1,10000]
[null,"Seguro Total Anual",3378.94]
[null,"Jogo de Amortecedores",1287,null,50000]
[null,"Coeficiente de Manutenção",null,4.7999999999999998E-6]
[null,"Motorista",3038.2740182832176,1]
[null,"CÁLCULO DO CUSTO POR MÊS"]
[null,"DEPRECIAÇÃO","D = (VA-0,60xVA) / 12 x 5",null,692.66666666666663]
[null,"JUROS","J = (VA-0,60xVA) x i / 12",null,510.84]
[null,"LICENCIAMENTO","L = (IPVA=SEG.OBRIG.)/12",null,346.33]
[null,"SEGURO TOTAL","ST = SEGURO ANUAL/12",null,281.58]
[null,"COMBUSTÍVEL","OD = (Comb./Consu)x Km.mês",null,1287.8599999999999]
[null,"ÓLEO LUBRIFICANTE","OL = ((Ol. X Quant)/Vida Útil)xKm.mês)",null,254.02]
[null,"LAVAGEM","LL = Preço Lavagem x Quantidade",null,100]
[null,"PNEUS","P = ((P. PneusxQuant)/Vida Útil)xkm.mês)",null,115.18]
[null,"AMORTECEDORES","AM = (P. Amort/Vida Útil)xkm.mês",null,77.22]
[null,"MANUTENÇÃO","M = (VA-VPxK)xkm.mês",null,598.46]
[null,"MOTORISTA","MOT = SALÁRIO+LEIS SOCIAIS",null,5276.87]
[null,"CUSTO POR MÊS","SEM MOTORISTA",null,4264.1566666666658]
[null,null,"COM MOTORISTA",null,9541.0266666666648]

{"sheet":"BDI SERV","index":4,"n_rows":41,"n_cols":5,"rows_kept":41,"cut":false,"hidden":false,"merged":[[35,0,35,5],[36,0,36,5],[38,1,38,4],[39,2,39,3],[0,1,2,4],[25,1,25,3],[26,1,26,2],[26,3,26,4],[27,3,27,4]]}
[null,"DETALHAMENTO DO BDI - SERVIÇOS"]
[]
[]
[null,"Item","Descrição dos Serviços","% - PV","% - CD"]
[]
[null,1,"ADMINISTRAÇÃO CENTRAL"," ",{"$f":"SUM(E7:E9)","v":4.01}]
[null,"1.1","ESCRITÓRIO CENTRAL",null,4.01]
[null,"1.2","VIAGENS"]
[null,"1.3","OUTROS"]
[null," "," "," "," "]
[null,2,"IMPOSTOS E TAXAS",{"$f":"SUM(D12:D15)","v":6.15},{"$f":"SUM(E12:E15)","v":0}]
[null,"2.1","ISS - Proposta",{"$f":"D34*100","v":2.5}]
[null,"2.2","PIS",0.65]
[null,"2.3","Cofins",3]
[null,"2.4","Contribuição Previdenciaria (CPRB)"]
[]
[null,3,"TAXA DE RISCO",null,{"$f":"SUM(E18:E20)","v":0.96}]
[null,"3.1","SEGURO",null,0.2]
[null,"3.2","RISCO",null,0.56000000000000005]
[null,"3.3","GARANTIA",null,0.2]
[]
[null,4,"DESPESAS FINANCEIRAS",null,1.1100000000000001]
[]
[null,5,"LUCRO",null,7.3]
[]
[null,"BDI APRESENTADO:",null,null,21.35]
[]
[null,null,"Legislação Municipal:","Lei Municipal nº 3.281/2007"]
[null,null,"Município:","Bocaiuva"]
[null,null,"Alíquota ISSQN:",0.05,"Município"]
[null,null,"Base de Cálculo:",0.5,"Art. 108, § 5"]
[null,null,"Valor Serviço:",1746112.36]
[null,null,"Dedução - Material (estimado):",587546.88622301887,{"$f":"D33/D32","v":0.33648859012888427}]
[null,null,"ISSQN BDI:",{"$f":"IF(D32=\"\",0,ROUND(IF(D31=D49,((1-(D33/D32))*D30),D30*D31),4))","v":2.5000000000000001E-2},"(*)"]
[]
["Acórdão nº 2.622/2013 - TCU Plenário"]
["BDI = ARRED((((((1+(AC+TR)/100)*(1+DF/100)*(1+L/100))/(1-IMP/100))-1)*100);2)"]
[]
[null,"(*) É obrigação da licitante a verificação da Legislação Tributária vigente no município, bem como o cálculo dos valores totais de serviços e materiais estimados, para apresentação de sua proposta."]
[]
[null,null,"Forma de Cálculo do BDI:","BDI - Acórdão nº 2.622/2013 - TCU"]

{"sheet":"BDI FORN","index":5,"n_rows":37,"n_cols":5,"rows_kept":37,"cut":false,"hidden":false,"merged":[[31,1,31,2],[32,0,34,5],[36,0,36,5],[0,1,2,4],[3,1,4,1],[3,2,4,2],[28,0,28,5],[30,1,30,2]]}
[null,"DETALHAMENTO DO BDI - FORNECIMENTO \n(MATERIAL ASFÁLTICO)"]
[]
[]
[null,"Item","Descrição dos Serviços","%","%"]
[null,null,null,"PV","CD"]
[]
[null,1,"ADMINISTRAÇÃO CENTRAL"," ",3.45]
[null,"1.1","ESCRITÓRIO CENTRAL"," "," "]
[null,"1.2","VIAGENS"," "," "]
[null,"1.3","OUTROS"," "," "]
[null," "," "," "," "]
[null,2,"IMPOSTOS E TAXAS",{"$f":"SUM(D13:D16)","v":3.65},{"$f":"SUM(E13:E16)","v":4.5600000000000005}]
[null,"2.1","ISS (*)",null,{"$f":"ROUND(D13*1.2515,2)","v":0}]
[null,"2.2","PIS",0.65,{"$f":"ROUND(D14*1.2515,2)","v":0.81}]
[null,"2.3","Cofins",3,{"$f":"ROUND(D15*1.2515,2)","v":3.75}]
[null,"2.4","CONTRIBUIÇÃO PREVIDENCIÁRIA SOBRE A RENDA BRUTA",0,{"$f":"ROUND(D16*1.2515,2)","v":0}]
[]
[null,3,"TAXA DE RISCO"," ",{"$f":"SUM(E19:E22)","v":1.08}]
[null,"3.1","SEGURO",null,0.24]
[null,"3.2","RISCO",null,0.6]
[null,"3.3","GARANTIA",null,0.24]
[]
[null,4,"DESPESAS FINANCEIRAS"," ",0.85]
[]
[null,5,"LUCRO",null,5.1100000000000003]
[]
[null," ","BDI - CALCULADO"," ",{"$f":"ROUND((((1+(E7+E18)/100)*(1+E23/100)*(1+E25/100)/(1-D12/100)-1)*100),2)","v":15}]
[]
["BDI = ((1+((AC+S+R+G)/100))x(1+DF/100)x(1+L/100)/(1-I/100)-1)*100"]
[]
[null,"BDI (CALCULADO):",null,15,"%"]
[null," "]
[]
[]
[]
[]
["BDI EM CONFORMIDADE COM OS ACÓRDÃOS Nº 2369/2011 e ACÓRDÃO Nº 2.622/2013 - TCU - PLENÁRIO"]

{"sheet":"CRONOGRAMA","index":6,"n_rows":19,"n_cols":12,"rows_kept":19,"cut":false,"hidden":false,"merged":[[15,1,16,2],[18,1,22,11],[11,0,12,0],[11,1,12,1],[11,2,12,2],[13,0,14,0],[13,1,14,1],[13,2,14,2],[9,0,10,0],[9,1,10,1],[9,2,10,2],[3,1,3,10],[5,0,6,0],[5,1,6,1],[5,2,6,2],[7,0,8,0],[7,1,8,1],[7,2,8,2],[0,1,0,11],[1,1,2,1],[1,2,2,4],[1,6,1,11],[2,6,2,11]]}
[null,"CRONOGRAMA FÍSICO-FINANCEIRO"]
[null,"OBRA: ",{"$f":"ORÇAMENTO!C5","v":" PAVIMENTAÇÃO ASFÁLTICA EM CBUQ - VIAS URBANAS DIVERSAS - BOCAIUVA / MG"},null,null,"VALOR:",{"$f":"ORÇAMENTO!L43","v":2955000}]
[{"$nulls":5},"PRAZO: ","180 DIAS "]
[]
[null,"ITEM","ETAPAS/DESCRIÇAO","FISICO/  FINANCEIRO","TOTAL    ETAPAS","MÊS 1","MÊS 2","MÊS 3","MÊS 4","MÊS 5","MÊS 6","TOTAL"]
["A",{"$f":"VLOOKUP(A6,ORÇAMENTO!$A$10:$L$43,2)","v":1},{"$f":"VLOOKUP(A6,ORÇAMENTO!$A$10:$L$43,5)","v":"SERVIÇOS PRELIMINARES "},"FISICO ",{"$f":"ROUND(E7/$G$2,4)","v":9.0700000000000003E-2},0.25,0.2,0.15,0.15,0.15,0.1,{"$f":"SUM(F6:K6)","v":1}]
[null,null,null,"FINANCEIRO",{"$f":"ORÇAMENTO!L10","v":268123.43},{"$f":"ROUND($E$7*F6,2)","v":67030.86},{"$f":"ROUND($E$7*G6,2)","v":53624.69},{"$f":"ROUND($E$7*H6,2)","v":40218.51},{"$f":"ROUND($E$7*I6,2)","v":40218.51},40218.51,26812.34,{"$f":"SUM(F7:K7)","v":268123.42000000004}]
["B",{"$f":"VLOOKUP(A8,ORÇAMENTO!$A$10:$L$43,2)","v":2},{"$f":"VLOOKUP(A8,ORÇAMENTO!$A$10:$L$43,5)","v":"TERRAPLANAGEM E PAVIMENTAÇÃO"},"FISICO ",{"$f":"ROUND(E9/$G$2,4)","v":0.27310000000000001},0.2,0.2,0.2,0.15,0.15,0.1,{"$f":"SUM(F8:K8)","v":1.0000000000000002}]
[null,null,null,"FINANCEIRO",{"$f":"ORÇAMENTO!L17","v":806976},{"$f":"ROUND($E$9*F8,2)","v":161395.20000000001},{"$f":"ROUND($E$9*G8,2)","v":161395.20000000001},{"$f":"ROUND($E$9*H8,2)","v":161395.20000000001},{"$f":"ROUND($E$9*I8,2)","v":121046.39999999999},121046.39999999999,80697.600000000006,{"$f":"SUM(F9:K9)","v":806976}]
["C",{"$f":"VLOOKUP(A10,ORÇAMENTO!$A$10:$L$43,2)","v":3},{"$f":"VLOOKUP(A10,ORÇAMENTO!$A$10:$L$43,5)","v":"TRANSPORTE DE MATERIAIS"},"FISICO ",{"$f":"ROUND(E11/$G$2,4)","v":0.11749999999999999},0.25,0.2,0.15,0.15,0.15,0.1,{"$f":"SUM(F10:K10)","v":1}]
[null,null,null,"FINANCEIRO",{"$f":"ORÇAMENTO!L24","v":347238},{"$f":"ROUND($E$11*F10,2)","v":86809.5},{"$f":"ROUND($E$11*G10,2)","v":69447.600000000006},{"$f":"ROUND($E$11*H10,2)","v":52085.7},{"$f":"ROUND($E$11*I10,2)","v":52085.7},52085.7,34723.800000000003,{"$f":"SUM(F11:K11)-0.04","v":347237.96}]
["E",{"$f":"VLOOKUP(A12,ORÇAMENTO!$A$10:$L$43,2)","v":4},{"$f":"VLOOKUP(A12,ORÇAMENTO!$A$10:$L$43,5)","v":"DRENAGEM E OBRAS COMPLEMENTARES"},"FISICO ",{"$f":"ROUND(E13/$G$2,4)","v":0.23519999999999999},0.1,0.15,0.2,0.2,0.2,0.15,{"$f":"SUM(F12:K12)","v":1}]
[null,null,null,"FINANCEIRO",{"$f":"ORÇAMENTO!L30","v":695149.2},{"$f":"ROUND($E$13*F12,2)","v":69514.92},{"$f":"ROUND($E$13*G12,2)","v":104272.38},{"$f":"ROUND($E$13*H12,2)","v":139029.84},{"$f":"ROUND($E$13*I12,2)","v":139029.84},139029.84,104272.38,{"$f":"SUM(F13:K13)-0.02","v":695149.17999999993}]
["F",{"$f":"VLOOKUP(A14,ORÇAMENTO!$A$10:$L$43,2)","v":5},{"$f":"VLOOKUP(A14,ORÇAMENTO!$A$10:$L$43,5)","v":"FORNECIMENTOS - MATERIAL ASFÁLTICO (BDI DIFERENCIADO)"},"FISICO ",{"$f":"ROUND(E15/$G$2,4)","v":0.28339999999999999},null,null,0.3,0.4,0.3,null,{"$f":"SUM(F14:K14)","v":1}]
[null,null,null,"FINANCEIRO",{"$f":"ORÇAMENTO!L36","v":837513.37999999989},{"$f":"ROUND($E$15*F14,2)","v":0},0,251254.01,335005.34999999998,251254.01,0,{"$f":"SUM(F15:K15)-0.02","v":837513.35}]
[null,"TOTAL",null,"FISICO ",{"$f":"SUM(F16:K16)","v":0.99999999323181066},{"$f":"F17/$E$17","v":0.13020320768120741},{"$f":"G17/$E$17","v":0.13155325505396531},{"$f":"H17/$E$17","v":0.21793003648754644},{"$f":"I17/$E$17","v":0.23261786723310365},0.20427562029009944,8.3420006485888321E-2,{"$f":"SUM(F16:K16)","v":0.99999999323181066}]
[null,null,null,"FINANCEIRO",{"$f":"E11+E9+E7+E15+E13","v":2955000.01},{"$f":"F11+F9+F7+F15+F13","v":384750.48},{"$f":"G11+G9+G7+G15+G13","v":388739.87},643983.26,687385.79999999993,603634.46,246506.12000000002,{"$f":"SUM(F17:K17)+0.02","v":2955000.01}]
[]
[null,"OBSERVAÇÕES:"]