{"text_format":"2","workbook":"xlsx","n_sheets":7,"sheets":["ORÇAMENTO","CPU-SERV","CPU-FORNEC","AUX-VEIC.","BDI SERV","BDI FORN","CRONOGRAMA"],"not_rendered":{"charts":0,"images":4,"macros":0,"external_links":1,"defined_names":9,"comments":2,"pivot_tables":0},"unopened":[],"bounds":{"document_bytes":16777216,"sheet_cells":100000,"run_cost":"one","rows_first":2000,"rows_last":500,"rows_between":2000,"halvings":0,"cell_chars":16384,"cell_head_chars":4096},"cells_cut":0,"cells_raw":0,"read":"whole","date_system":"1900"}

{"sheet":"ORÇAMENTO","index":0,"n_rows":43,"n_cols":24,"rows_kept":43,"cut":false,"hidden":false,"merged":[[42,1,42,4],[0,0,8,0],[0,4,0,11],[1,4,1,11],[2,4,2,11],[6,1,6,4],[7,1,7,11],[4,2,4,8],[5,2,5,8],[5,9,5,10],[6,9,6,10],[29,14,29,16],[35,14,35,16],[4,9,4,10],[16,14,16,16],[23,14,23,16],[9,14,9,16]]}
["<---- NUMERAR SERVIÇOS PARA CPU",null,null,null,"Ministério do Desenvolvimento Regional"]
[{"$nulls":4},"Companhia de Desenvolvimento dos Vales do São Francisco e do Parnaíba"]
[{"$nulls":4},"1ª Superintendência Regional"]
[]
[null,"OBRA: "," PAVIMENTAÇÃO ASFÁLTICA EM CBUQ - AV. MINISTRO FRANCISCO CAMPOS (DISTRITO DE SILVA CAMPOS - POMPÉU / MG)",{"$nulls":6},"BDI Serviços % :",null,{"$f":"TRUNC('BDI SERV'!E26,2)","v":21.49}]
[null,"DATA:"," SETEMBRO / 2025",{"$nulls":6},"BDI Diferenc. Serviços % :",null,{"$f":"TRUNC('BDI FORN'!D31,2)","v":15}]
[null,"PRAZO DE EXECUÇÃO:     150 DIAS",{"$nulls":7},"BDI Fornecimentos % :",null,{"$f":"TRUNC('BDI FORN'!D31,2)","v":15}]
[null,"PLANILHA DE ORÇAMENTAÇÃO"]
[null,"ITEM","CÓDIGO","FONTE","DISCRIMINAÇÃO","TIPO","UNID.","QUANT.","VR.UNIT.S/BDI","PR. UNIT.C/BDI","C. TOT.S/BDI","P. TOT.C/BDI"]
["A",1,null,null,"SERVIÇOS PRELIMINARES ",{"$nulls":5},{"$f":"SUM(K11:K16)","v":188695.38},{"$f":"SUM(L11:L16)","v":229084.22000000003}]
[1,"1.1","CPU.1","CODEVASF","MOBILIZAÇÃO E DESMOBILIZAÇÃO","SERV","GL",1,{"$f":"VLOOKUP(A11,'CPU-SERV'!A:K,11,0)","v":14072.28},{"$f":"TRUNC(IF(F11=\"SERV\",I11*(1+$L$5/100),IF(F11=\"SERV DIF\",I11*(1+$L$6/100),IF(F11=\"FORN\",I11*(1+$L$7/100),))),2)","v":17096.41},{"$f":"TRUNC(H11*I11,2)","v":14072.28},{"$f":"TRUNC(H11*J11,2)","v":17096.41}]
[2,"1.2","CPU.2","CODEVASF","ADMINISTRAÇÃO LOCAL ","SERV","GL",1,{"$f":"VLOOKUP(A12,'CPU-SERV'!A:K,11,0)","v":118656.88},{"$f":"TRUNC(IF(F12=\"SERV\",I12*(1+$L$5/100),IF(F12=\"SERV DIF\",I12*(1+$L$6/100),IF(F12=\"FORN\",I12*(1+$L$7/100),))),2)","v":144156.24},{"$f":"TRUNC(H12*I12,2)","v":118656.88},{"$f":"TRUNC(H12*J12,2)","v":144156.24}]
[3,"1.3","CPU.3","CODEVASF","CANTEIRO DE OBRAS ","SERV","GL",1,{"$f":"VLOOKUP(A13,'CPU-SERV'!A:K,11,0)","v":14467.74},17576.849999999999,14467.74,17576.849999999999]
[4,"1.4",103689,"SINAPI","PLACA DE OBRA EM CHAPA DE AÇO GALVANIZADO","SERV","M2",2,{"$f":"VLOOKUP(A14,'CPU-SERV'!A:K,11,0)","v":547.64},665.32,1095.28,1330.64]
[5,"1.5","CPU.4","CODEVASF","VEÍCULO PARA A FISCALIZAÇÃO, MÁXIMO 02 ANOS DE USO OU 50.000KM, PREFERENCIALMENTE NA COR BRANCA, COM IDENTIFICAÇÃO CONFORME ESPECIFICAÇÕES DA CODEVASF, INCLUSIVE COMBUSTÍVEL, MANUTENÇÃO, SEGURO E IMPOSTOS - CONFORME ESPECIFICAÇÕES","SERV","MÊS",8,{"$f":"VLOOKUP(A15,'CPU-SERV'!A:K,11,0)","v":4264.1499999999996},5180.51,34113.199999999997,41444.080000000002]
{"$rows_left_out":29}
{"sheet":"CPU-SERV","index":1,"n_rows":993,"n_cols":16,"rows_kept":993,"cut":false,"hidden":false,"merged":[[42,0,84,0],[43,2,43,9],[497,1,498,3],[497,4,497,5],[498,4,498,5],[499,2,499,7],[499,8,499,9],[500,1,501,2],[500,3,501,3],[500,4,500,5],[500,6,500,7],[495,0,547,0],[496,2,496,9],[46,2,46,7],[46,8,46,9],[47,1,48,2],[60,3,60,7],[63,7,63,9],[66,3,66,7],[67,7,67,9],[44,1,45,3],[44,4,44,5],[45,4,45,5],[72,3,72,7],[580,1,581,2],[580,3,581,3],[580,4,581,4],[580,5,580,7],[580,9,581,9],[527,3,527,7],[529,8,529,9],[536,3,536,7],[562,3,562,7],[546,5,546,7],[574,3,574,7],[537,1,538,2],[554,1,555,2],[554,4,554,5],[554,6,554,7],[559,7,559,9],[553,2,553,7],[545,3,545,7],[619,4,620,4],[619,5,619,7],[619,9,620,9],[623,3,623,7],[508,7,508,9],[510,3,510,7],[511,3,511,7],[512,3,512,7],[515,7,515,9],[520,7,520,8],[576,8,576,9],[579,3,579,7],[525,7,525,9],[524,3,524,7],[537,3,538,3],[537,4,538,4],[537,5,537,7],[537,9,538,9],[564,3,564,7],[567,7,567,9],[570,3,570,7],[571,7,571,9],[553,8,553,9],[554,3,555,3],[588,0,625,0],[589,2,589,9],[590,1,591,3],[590,4,590,5],[591,4,591,5],[592,2,592,7],[592,8,592,9],[593,1,594,2],[593,3,594,3],[593,4,593,5],[593,6,593,7],[598,7,598,9],[601,3,601,7],[602,3,602,7],[603,3,603,7],[606,7,606,9],[609,3,609,7],[610,7,610,9],[613,3,613,7],[615,8,615,9],[624,5,624,7],[618,3,618,7],[619,1,620,2],[619,3,620,3],[7,13,7,15],[18,11,18,13],[24,3,24,7],[4,2,4,7],[4,8,4,9],[5,1,6,2],[5,3,6,3],[5,4,5,5],[5,6,5,7],[0,0,40,0],[3,4,3,5],[0,11,0,12],[1,11,1,12],[2,4,2,5],[1,2,1,9],[2,1,3,3],[34,3,35,3],[34,4,35,4],[34,5,34,7],[34,9,35,9],[38,3,38,7],[39,5,39,7],[13,7,13,9],[16,3,16,7],[17,3,17,7],[18,3,18,7],[21,7,21,9],[33,3,33,7],[34,1,35,2],[25,7,25,9],[28,3,28,7],[2,10,2,11],[30,8,30,9],[74,8,74,9],[47,3,48,3],[47,4,47,5],[47,6,47,7],[52,7,52,9],[58,3,58,7],[59,3,59,7],[82,3,82,7],[83,5,83,7],[88,4,88,5],[77,3,77,7],[78,1,79,2],[78,3,79,3],[78,4,79,4],[78,5,78,7],[78,9,79,9],[117,1,118,2],[117,3,118,3],[117,4,118,4],[117,5,117,7],[117,9,118,9],[121,3,121,7],[96,7,96,9],[101,3,101,7],[104,7,104,9],[107,3,107,7],[108,7,108,9],[111,3,111,7],[113,8,113,9],[116,3,116,7],[99,3,99,7],[100,3,100,7],[122,5,122,7],[125,0,164,0],[126,2,126,9],[127,1,128,3],[127,4,127,5],[128,4,128,5],[129,2,129,7],[129,8,129,9],[162,3,162,7],[163,5,163,7],[86,0,123,0],[87,2,87,9],[88,1,89,3],[89,4,89,5],[90,2,90,7],[90,8,90,9],[91,1,92,2],[91,3,92,3],[91,4,91,5],[91,6,91,7],[139,3,139,7],[140,3,140,7],[143,7,143,9],[148,3,148,7],[149,7,149,9],[152,3,152,7],[130,1,131,2],[130,3,131,3],[130,4,130,5],[130,6,130,7],[135,7,135,9],[138,3,138,7],[154,8,154,9],[157,3,157,7],[158,1,159,2],[158,3,159,3],[158,4,159,4],[158,5,158,7],[158,9,159,9],[199,3,199,7],[201,8,201,9],[179,3,179,7],[180,3,180,7],[181,3,181,7],[170,8,170,9],[171,1,172,2],[171,3,172,3],[171,4,171,5],[171,6,171,7],[213,0,252,0],[214,2,214,9],[215,1,216,3],[215,4,215,5],[216,4,216,5],[217,2,217,7],[250,3,250,7],[251,5,251,7],[166,0,211,0],[167,2,167,9],[168,1,169,3],[168,4,168,5],[169,4,169,5],[170,2,170,7],[204,3,204,7],[205,1,206,2],[205,3,206,3],[205,4,206,4],[205,5,205,7],[205,9,206,9],[258,8,258,9],[259,1,260,2],[259,3,260,3],[259,4,259,5],[176,7,176,9],[228,3,228,7],[229,3,229,7],[230,3,230,7],[233,7,233,9],[236,3,236,7],[237,7,237,9],[217,8,217,9],[218,1,219,2],[218,3,219,3],[218,4,218,5],[218,6,218,7],[223,7,223,9],[209,3,209,7],[210,5,210,7],[184,7,184,9],[187,3,187,7],[188,7,188,9],[259,6,259,7],[254,0,291,0],[255,2,255,9],[256,1,257,3],[256,4,256,5],[257,4,257,5],[258,2,258,7],[240,3,240,7],[242,8,242,9],[245,3,245,7],[246,1,247,2],[246,3,247,3],[246,4,247,4],[246,5,246,7],[246,9,247,9],[279,3,279,7],[281,8,281,9],[284,3,284,7],[285,1,286,2],[285,3,286,3],[285,4,286,4],[285,5,285,7],[285,9,286,9],[267,3,267,7],[268,3,268,7],[336,0,375,0],[337,2,337,9],[338,1,339,3],[338,4,338,5],[339,4,339,5],[340,2,340,7],[373,3,373,7],[374,5,374,7],[293,0,334,0],[294,2,294,9],[295,1,296,3],[295,4,295,5],[296,4,296,5],[297,2,297,7],[322,3,322,7],[324,8,324,9],[327,3,327,7],[328,1,329,2],[328,3,329,3],[328,4,329,4],[297,8,297,9],[298,1,299,2],[298,3,299,3],[298,4,298,5],[264,7,264,9],[289,3,289,7],[290,5,290,7],[269,3,269,7],[272,7,272,9],[275,3,275,7],[276,7,276,9],[310,3,310,7],[311,3,311,7],[298,6,298,7],[307,7,307,9],[312,3,312,7],[315,7,315,9],[318,3,318,7],[319,7,319,9],[363,3,363,7],[365,8,365,9],[368,3,368,7],[351,3,351,7],[352,3,352,7],[353,3,353,7],[356,7,356,9],[359,3,359,7],[340,8,340,9],[341,3,342,3],[341,4,341,5],[341,6,341,7],[348,7,348,9],[369,1,370,2],[369,3,370,3],[369,4,370,4],[369,5,369,7],[369,9,370,9],[328,5,328,7],[328,9,329,9],[360,7,360,9],[341,1,342,2],[332,3,332,7],[333,5,333,7],[395,7,395,9],[398,3,398,7],[399,7,399,9],[402,3,402,7],[404,8,404,9],[407,3,407,7],[377,0,414,0],[378,2,378,9],[379,1,380,3],[379,4,379,5],[380,4,380,5],[381,2,381,7],[412,3,412,7],[413,5,413,7],[396,7,396,8],[408,1,409,2],[408,3,409,3],[408,4,409,4],[408,5,408,7],[408,9,409,9],[381,8,381,9],[382,1,383,2],[382,3,383,3],[382,4,382,5],[382,6,382,7],[387,7,387,9],[390,3,390,7],[391,3,391,7],[392,3,392,7],[481,3,481,7],[455,0,493,0],[456,2,456,9],[457,1,458,3],[457,4,457,5],[458,4,458,5],[459,2,459,7],[491,3,491,7],[492,5,492,7],[483,8,483,9],[486,3,486,7],[487,1,488,2],[487,3,488,3],[487,4,488,4],[487,5,487,7],[487,9,488,9],[469,3,469,7],[470,3,470,7],[471,3,471,7],[474,7,474,9],[477,3,477,7],[478,7,478,9],[459,8,459,9],[460,1,461,2],[416,0,453,0],[417,2,417,9],[418,1,419,3],[418,4,418,5],[419,4,419,5],[420,2,420,7],[443,8,443,9],[446,3,446,7],[447,1,448,2],[447,3,448,3],[437,3,437,7],[438,7,438,9],[447,4,448,4],[447,5,447,7],[447,9,448,9],[429,3,429,7],[420,8,420,9],[421,1,422,2],[421,3,422,3],[421,4,421,5],[421,6,421,7],[426,7,426,9],[441,3,441,7],[434,7,434,9],[460,3,461,3],[460,4,460,5],[460,6,460,7],[466,7,466,9],[451,3,451,7],[452,5,452,7],[430,3,430,7],[431,3,431,7],[435,7,435,8],[584,3,584,7],[585,5,585,7],[627,0,664,0],[628,2,628,9],[629,1,630,3],[629,4,629,5],[630,4,630,5],[631,2,631,7],[662,3,662,7],[663,5,663,7],[549,0,586,0],[550,2,550,9],[551,1,552,3],[551,4,551,5],[552,4,552,5],[652,3,652,7],[654,8,654,9],[657,3,657,7],[658,1,659,2],[658,3,659,3],[658,4,659,4],[658,5,658,7],[658,9,659,9],[563,3,563,7],[670,8,670,9],[671,1,672,2],[671,3,672,3],[671,4,671,5],[671,6,671,7],[676,7,676,9],[649,7,649,9],[631,8,631,9],[632,1,633,2],[632,3,633,3],[632,4,632,5],[632,6,632,7],[637,7,637,9],[640,3,640,7],[641,3,641,7],[642,3,642,7],[645,7,645,9],[648,3,648,7],[697,3,698,3],[697,4,698,4],[697,5,697,7],[697,9,698,9],[679,3,679,7],[680,3,680,7],[681,3,681,7],[684,7,684,9],[687,3,687,7],[688,7,688,9],[701,3,701,7],[702,5,702,7],[744,0,781,0],[745,2,745,9],[746,1,747,3],[746,4,746,5],[747,4,747,5],[748,2,748,7],[779,3,779,7],[780,5,780,7],[666,0,703,0],[667,2,667,9],[668,1,669,3],[668,4,668,5],[669,4,669,5],[670,2,670,7],[769,3,769,7],[771,8,771,9],[774,3,774,7],[775,1,776,2],[691,3,691,7],[693,8,693,9],[696,3,696,7],[697,1,698,2],[757,3,757,7],[758,3,758,7],[759,3,759,7],[762,7,762,9],[765,3,765,7],[766,7,766,9],[748,8,748,9],[749,1,750,2],[749,3,750,3],[749,4,749,5],[749,6,749,7],[754,7,754,9],[775,3,776,3],[775,4,776,4],[775,5,775,7],[775,9,776,9],[808,3,808,7],[810,8,810,9],[813,3,813,7],[814,1,815,2],[814,3,815,3],[814,4,815,4],[814,5,814,7],[814,9,815,9],[796,3,796,7],[797,3,797,7],[798,3,798,7],[801,7,801,9],[804,3,804,7],[805,7,805,9],[787,8,787,9],[788,1,789,2],[788,3,789,3],[788,4,788,5],[788,6,788,7],[793,7,793,9],[783,0,820,0],[784,2,784,9],[785,1,786,3],[785,4,785,5],[786,4,786,5],[787,2,787,7],[835,3,835,7],[822,0,861,0],[823,2,823,9],[824,1,825,3],[824,4,824,5],[825,4,825,5],[859,3,859,7],[860,5,860,7],[849,3,849,7],[851,8,851,9],[854,3,854,7],[855,1,856,2],[855,3,856,3],[855,4,856,4],[855,5,855,7],[855,9,856,9],[836,3,836,7],[837,3,837,7],[894,9,895,9],[907,6,907,7],[912,7,912,9],[906,2,906,7],[915,3,915,7],[818,3,818,7],[819,5,819,7],[840,7,840,9],[845,3,845,7],[846,7,846,9],[826,8,826,9],[827,1,828,2],[827,3,828,3],[827,4,827,5],[827,6,827,7],[832,7,832,9],[826,2,826,7],[881,7,881,9],[884,3,884,7],[885,7,885,9],[863,0,900,0],[864,2,864,9],[865,1,866,3],[865,4,865,5],[866,4,866,5],[867,2,867,7],[867,8,867,9],[868,1,869,2],[868,3,869,3],[868,4,868,5],[868,6,868,7],[873,7,873,9],[876,3,876,7],[877,3,877,7],[878,3,878,7],[898,3,898,7],[899,5,899,7],[888,3,888,7],[890,8,890,9],[893,3,893,7],[894,1,895,2],[894,3,895,3],[894,4,895,4],[894,5,894,7],[902,0,946,0],[903,2,903,9],[904,1,905,3],[904,4,904,5],[905,4,905,5],[944,3,944,7],[945,5,945,7],[930,3,930,7],[932,8,932,9],[937,3,937,7],[938,1,939,2],[926,3,926,7],[927,7,927,9],[906,8,906,9],[907,1,908,2],[907,3,908,3],[907,4,907,5],[916,3,916,7],[917,3,917,7],[920,7,920,9],[953,3,954,3],[953,4,953,5],[953,6,953,7],[958,7,958,9],[948,0,992,0],[949,2,949,9],[950,1,951,3],[950,4,950,5],[951,4,951,5],[952,2,952,7],[990,3,990,7],[991,5,991,7],[736,4,737,4],[736,5,736,7],[736,9,737,9],[740,3,740,7],[976,3,976,7],[978,8,978,9],[983,3,983,7],[984,1,985,2],[984,3,985,3],[984,4,985,4],[984,5,984,7],[984,9,985,9],[938,3,939,3],[938,4,939,4],[938,5,938,7],[938,9,939,9],[961,3,961,7],[962,3,962,7],[963,3,963,7],[966,7,966,9],[972,3,972,7],[973,7,973,9],[952,8,952,9],[953,1,954,2],[741,5,741,7],[705,0,742,0],[706,2,706,9],[707,1,708,3],[707,4,707,5],[708,4,708,5],[709,2,709,7],[709,8,709,9],[710,1,711,2],[710,3,711,3],[710,4,710,5],[710,6,710,7],[715,7,715,9],[718,3,718,7],[719,3,719,7],[720,3,720,7],[723,7,723,9],[726,3,726,7],[727,7,727,9],[730,3,730,7],[732,8,732,9],[735,3,735,7],[736,1,737,2],[736,3,737,3]]}
[1,"1ª/GRD",{"$nulls":8},{"$f":"J40","v":14072.28},"Minas Gerais"]
[null,"OBRA:"," PAVIMENTAÇÃO ASFÁLTICA EM CBUQ - AV. MINISTRO FRANCISCO CAMPOS (DISTRITO DE SILVA CAMPOS - POMPÉU / MG)",{"$nulls":8}," Abril/2025 "]
[null,"Custo Unitário de Referência",null,null,"Minas Gerais",{"$nulls":5},"QUANT.MATERIAL:",null,{"$f":"SUM(M23:M994)","v":{"$error":"#VALUE!"}},{"$f":"M3/(ORÇAMENTO!L43-ORÇAMENTO!L36)/(1+ORÇAMENTO!L6)","v":{"$error":"#VALUE!"}}]
[{"$nulls":4}," Abril/2025 ",null,null,"Produção da equipe ",0.5,{"$f":"VLOOKUP(A1,ORÇAMENTO!$A$10:$L$43,7,1)","v":"GL"}]
[null,"CPU.1","MOBILIZAÇÃO E DESMOBILIZAÇÃO",{"$nulls":5},"Valores em reais (R$)"]
[null,"A - EQUIPAMENTOS",null,"Quantidade","Utilização",null,"Custo Horário",null,null,"Custo"]
[{"$nulls":4},"Operativa","Improdutiva","Produtivo","Improdutivo",null,"Horário Total"]
[null,"E9687","Caminhão carroceria com capacidade de 5 t - 120 kW",8,0.6,0.4,154.82689999999999,59.719900000000003,null,{"$f":"D8*(E8*G8+F8*H8)","v":934.27279999999996},null,"distancia =",100,"BOM DESPACHO"]
[null,"E9571","Caminhão tanque com capacidade de 10.000 l - 188 kW",2,1,0,332.8408,83.189300000000003,null,{"$f":"D9*(E9*G9+F9*H9)","v":665.6816}]
[null,"E9509","Caminhão tanque distribuidor de asfalto com capacidade de 6.000 l - 7 kW/136 kW",2,1,0,267.51929999999999,74.644499999999994,null,535.03859999999997,null,"Pá carregadeira ",null,1,19.7," ton"]
[null,"E9514","Distribuidor de agregados sobre pneus autopropelido - 130 kW",2,1,0,293.41419999999999,107.0603,null,586.82839999999999,null,"Motoniveladora ",null,1,15.07," ton"]
[null,"E9575","Caminhão basculante com caçamba estanque com capacidade de 14 m³ - 210 kW",4,1,0,314.16070000000002,91.266099999999994,null,{"$f":"D12*(E12*G12+F12*H12)","v":1256.6428000000001},null,"Rolo Compactador Pneus",null,1,27," ton"]
[{"$nulls":7},"Custo horário total de equipamentos",null,{"$f":"SUM(J8:J12)","v":3978.4641999999999},null,"Rolo Compactador Liso",null,1,11," ton"]
[null,"B - MÃO DE OBRA",null,"Quantidade","Unidade",null,"Custo Horário","Custo Horário Total",null,null,null,"Rolo Compactador Pé-de-Carneiro",null,1,11.6," ton"]
[null,"P9824","Servente",8,"h",null,21.435400000000001,null,null,{"$f":"D15*G15","v":171.48320000000001},null,"Trator Agrícola",null,1,8.6999999999999993," ton"]
{"$rows_left_out":979}
{"sheet":"CPU-FORNEC","index":2,"n_rows":92,"n_cols":14,"rows_kept":92,"cut":false,"hidden":false,"merged":[[28,8,33,10],[71,0,80,0],[71,1,71,3],[71,4,71,7],[72,2,72,5],[73,2,73,3],[74,1,74,7],[77,1,77,3],[77,5,77,6],[78,1,78,6],[79,1,79,6],[80,1,80,6],[38,0,47,0],[38,1,38,3],[38,4,38,7],[39,2,39,5],[0,0,26,0],[0,1,0,3],[0,4,0,7],[22,1,22,3],[49,0,58,0],[49,1,49,3],[49,4,49,7],[50,2,50,5],[51,2,51,3],[52,1,52,7],[55,1,55,3],[55,5,55,6],[56,1,56,6],[57,1,57,6],[58,1,58,6],[27,1,27,3],[27,4,27,7],[28,2,28,5],[27,0,36,0],[29,2,29,3],[30,1,30,7],[33,1,33,3],[33,5,33,6],[34,1,34,6],[35,1,35,6],[36,1,36,6],[0,10,0,11],[1,2,1,5],[1,10,1,11],[2,2,2,3],[3,1,3,7],[22,5,22,6],[23,1,23,6],[24,1,24,6],[25,1,25,6],[5,1,5,7],[9,1,9,7],[13,1,13,7],[17,1,17,7],[40,2,40,3],[41,1,41,7],[44,1,44,3],[44,5,44,6],[45,1,45,6],[46,1,46,6],[47,1,47,6],[60,0,69,0],[60,1,60,3],[60,4,60,7],[61,2,61,5],[62,2,62,3],[63,1,63,7],[66,1,66,3],[66,5,66,6],[67,1,67,6],[68,1,68,6],[69,1,69,6],[81,1,81,7],[82,0,91,0],[82,1,82,3],[82,4,82,7],[83,2,83,5],[84,2,84,3],[85,1,85,7],[88,1,88,3],[88,5,88,6],[89,1,89,6],[90,1,90,6],[91,1,91,6]]}
[1,"CODEVASF",null,null," COMPOSIÇÃO DE PREÇO UNITÁRIO",null,null,null,{"$f":"H24","v":0},{"$f":"H26","v":0},"BDI CALCULADO:",null,{"$f":"ORÇAMENTO!L6","v":15}]
[null,"OBRA:  "," PAVIMENTAÇÃO ASFÁLTICA EM CBUQ - AV. MINISTRO FRANCISCO CAMPOS (DISTRITO DE SILVA CAMPOS - POMPÉU / MG)",null,null,null,"DATA: ",{"$f":"ORÇAMENTO!C6","v":" SETEMBRO / 2025"},null,null,"BDI DIFERENCIADO:",null,{"$f":"'BDI FORN'!D31/100","v":0.15}]
[null,"SERVIÇO:  ","CPU.1",null,"Referência:","CODEVASF","UNIDADE: ",{"$f":"VLOOKUP(A1,ORÇAMENTO!A11:L31,5)","v":"MOBILIZAÇÃO E DESMOBILIZAÇÃO"}]
[]
[null,"TIPO ITEM","CODIGO ITEM","DESCRIÇÃO ITEM","UNIDADE ITEM","COEFICIENTE","PRECO UNITARIO","CUSTO TOTAL",null,"distancia =",90,"B.DESPACHO"]
[null,"EQUIPAMENTOS",{"$nulls":7},"Pá carregadeira ",null,null,10.1," ton"]
[null,null,"E9001","E9001","E9001",null,"E9001"]
[]
[]
[null,"MÃO DE OBRA"]
[]
[]
[]
[null,"MATERIAIS"]
[]
{"$rows_left_out":78}
{"sheet":"AUX-VEIC.","index":3,"n_rows":31,"n_cols":6,"rows_kept":31,"cut":false,"hidden":false,"merged":[[25,2,25,3],[1,1,1,4],[2,1,2,2],[3,1,3,4],[17,1,17,4],[18,2,18,3],[19,2,19,3],[20,2,20,3],[21,2,21,3],[22,2,22,3],[23,2,23,3],[24,2,24,3],[26,2,26,3],[27,2,27,3],[28,2,28,3],[29,1,30,1],[29,2,29,3],[30,2,30,3]]}
[]
[null,"CÁLCULO DO CUSTO POR MÊS DE VEÍCULOS"]
[null,"Veículo: Polo TSI, Onix Turbo, Argo 1.3, HB-20 Turbo",null,"Data:","2025-07-28"]
[null,"DADOS ELEMENTARES DO VEÍCULO"]
[null,"Dados Básicos","Preço (R$)","Quantidade","Vida Útil"]
[null,"Quilometragem média mensal",null,3000]
[null,"Valor de Aquisição (VA)",103900]
[null,"Taxa de Juros (i)%",null,14.75]
[null,"IPVA e Seguro Obrigatório (4%)",{"$f":"0.04*C7","v":4156}]
[null,"Lavagem",50,2]
[null,"Pneus",479.9,4,50000]
[null,"Combustível",6.01,14]
[null,"Óleo Lubrificante + Filtros (revisão)",{"$f":"4*(188.59+213.69+186.16+283.83+186.16)/5","v":846.74400000000003},1,10000]
[null,"Seguro Total Anual",3378.94]
[null,"Jogo de Amortecedores",1287,null,50000]
{"$rows_left_out":17}
{"sheet":"BDI SERV","index":4,"n_rows":60,"n_cols":5,"rows_kept":60,"cut":false,"hidden":false,"merged":[[35,0,35,5],[36,0,36,5],[38,1,38,4],[39,2,39,3],[0,1,2,4],[25,1,25,3],[26,1,26,2],[26,3,26,4],[27,3,27,4]]}
[null,"DETALHAMENTO DO BDI - SERVIÇOS"]
[]
[]
[null,"Item","Descrição dos Serviços","% - PV","% - CD"]
[]
[null,1,"ADMINISTRAÇÃO CENTRAL"," ",{"$f":"SUM(E7:E9)","v":4.01}]
[null,"1.1","ESCRITÓRIO CENTRAL",null,4.01]
[null,"1.2","VIAGENS"]
[null,"1.3","OUTROS"]
[null," "," "," "," "]
[null,2,"IMPOSTOS E TAXAS",{"$f":"SUM(D12:D15)","v":5.65},{"$f":"SUM(E12:E15)","v":0}]
[null,"2.1","ISS - Proposta",{"$f":"D34*100","v":2}]
[null,"2.2","PIS",0.65]
[null,"2.3","Cofins",3]
[null,"2.4","Contribuição Previdenciaria (CPRB)"]
{"$rows_left_out":46}
{"sheet":"BDI FORN","index":5,"n_rows":37,"n_cols":5,"rows_kept":37,"cut":false,"hidden":false,"merged":[[31,1,31,2],[32,0,34,5],[36,0,36,5],[0,1,2,4],[3,1,4,1],[3,2,4,2],[28,0,28,5],[30,1,30,2]]}
[null,"DETALHAMENTO DO BDI - FORNECIMENTO \n(MATERIAL ASFÁLTICO)"]
[]
[]
[null,"Item","Descrição dos Serviços","%","%"]
[null,null,null,"PV","CD"]
[]
[null,1,"ADMINISTRAÇÃO CENTRAL"," ",3.45]
[null,"1.1","ESCRITÓRIO CENTRAL"," "," "]
[null,"1.2","VIAGENS"," "," "]
[null,"1.3","OUTROS"," "," "]
[null," "," "," "," "]
[null,2,"IMPOSTOS E TAXAS",{"$f":"SUM(D13:D16)","v":3.65},{"$f":"SUM(E13:E16)","v":4.5600000000000005}]
[null,"2.1","ISS (*)",null,{"$f":"ROUND(D13*1.2515,2)","v":0}]
[null,"2.2","PIS",0.65,{"$f":"ROUND(D14*1.2515,2)","v":0.81}]
[null,"2.3","Cofins",3,{"$f":"ROUND(D15*1.2515,2)","v":3.75}]
{"$rows_left_out":23}
{"sheet":"CRONOGRAMA","index":6,"n_rows":19,"n_cols":12,"rows_kept":19,"cut":false,"hidden":false,"merged":[[15,1,16,2],[18,1,22,11],[11,0,12,0],[11,1,12,1],[11,2,12,2],[13,0,14,0],[13,1,14,1],[13,2,14,2],[9,0,10,0],[9,1,10,1],[9,2,10,2],[3,1,3,10],[5,0,6,0],[5,1,6,1],[5,2,6,2],[7,0,8,0],[7,1,8,1],[7,2,8,2],[0,1,0,11],[1,1,2,1],[1,2,2,4],[1,6,1,11],[2,6,2,11]]}
[null,"CRONOGRAMA FÍSICO-FINANCEIRO"]
[null,"OBRA: ",{"$f":"ORÇAMENTO!C5","v":" PAVIMENTAÇÃO ASFÁLTICA EM CBUQ - AV. MINISTRO FRANCISCO CAMPOS (DISTRITO DE SILVA CAMPOS - POMPÉU / MG)"},null,null,"VALOR:",{"$f":"ORÇAMENTO!L43","v":2244250}]
[{"$nulls":5},"PRAZO: ","150 DIAS "]
[]
[null,"ITEM","ETAPAS/DESCRIÇAO","FISICO/  FINANCEIRO","TOTAL  ETAPAS","MÊS 1","MÊS 2","MÊS 3","MÊS 4","MÊS 5","MÊS 6","TOTAL"]
["A",{"$f":"VLOOKUP(A6,ORÇAMENTO!$A$10:$L$43,2)","v":1},{"$f":"VLOOKUP(A6,ORÇAMENTO!$A$10:$L$43,5)","v":"SERVIÇOS PRELIMINARES "},"FISICO ",{"$f":"ROUND(E7/$G$2,4)","v":0.1021},0.25,0.2,0.2,0.2,0.15,null,{"$f":"SUM(F6:K6)","v":1}]
[null,null,null,"FINANCEIRO",{"$f":"ORÇAMENTO!L10","v":229084.22000000003},{"$f":"ROUND($E$7*F6,2)","v":57271.06},{"$f":"ROUND($E$7*G6,2)","v":45816.84},{"$f":"ROUND($E$7*H6,2)","v":45816.84},{"$f":"ROUND($E$7*I6,2)","v":45816.84},34362.629999999997,null,{"$f":"SUM(F7:K7)","v":229084.21}]
["B",{"$f":"VLOOKUP(A8,ORÇAMENTO!$A$10:$L$43,2)","v":2},{"$f":"VLOOKUP(A8,ORÇAMENTO!$A$10:$L$43,5)","v":"TERRAPLANAGEM E PAVIMENTAÇÃO"},"FISICO ",{"$f":"ROUND(E9/$G$2,4)","v":0.27679999999999999},0.25,0.25,0.25,0.25,null,null,{"$f":"SUM(F8:K8)","v":1}]
[null,null,null,"FINANCEIRO",{"$f":"ORÇAMENTO!L17","v":621188},{"$f":"ROUND($E$9*F8,2)","v":155297},{"$f":"ROUND($E$9*G8,2)","v":155297},{"$f":"ROUND($E$9*H8,2)","v":155297},{"$f":"ROUND($E$9*I8,2)","v":155297},0,null,{"$f":"SUM(F9:K9)","v":621188}]
["C",{"$f":"VLOOKUP(A10,ORÇAMENTO!$A$10:$L$43,2)","v":3},{"$f":"VLOOKUP(A10,ORÇAMENTO!$A$10:$L$43,5)","v":"TRANSPORTE DE MATERIAIS"},"FISICO ",{"$f":"ROUND(E11/$G$2,4)","v":0.19389999999999999},0.25,0.25,0.25,0.25,null,null,{"$f":"SUM(F10:K10)","v":1}]
[null,null,null,"FINANCEIRO",{"$f":"ORÇAMENTO!L24","v":435242.2},{"$f":"ROUND($E$11*F10,2)","v":108810.55},{"$f":"ROUND($E$11*G10,2)","v":108810.55},{"$f":"ROUND($E$11*H10,2)","v":108810.55},{"$f":"ROUND($E$11*I10,2)","v":108810.55},0,null,{"$f":"SUM(F11:K11)-0.04","v":435242.16000000003}]
["E",{"$f":"VLOOKUP(A12,ORÇAMENTO!$A$10:$L$43,2)","v":4},{"$f":"VLOOKUP(A12,ORÇAMENTO!$A$10:$L$43,5)","v":"DRENAGEM E OBRAS COMPLEMENTARES"},"FISICO ",{"$f":"ROUND(E13/$G$2,4)","v":0.17829999999999999},null,0.25,0.25,0.25,0.25,null,{"$f":"SUM(F12:K12)","v":1}]
[null,null,null,"FINANCEIRO",{"$f":"ORÇAMENTO!L30","v":400224.87999999995},{"$f":"ROUND($E$13*F12,2)","v":0},{"$f":"ROUND($E$13*G12,2)","v":100056.22},{"$f":"ROUND($E$13*H12,2)","v":100056.22},{"$f":"ROUND($E$13*I12,2)","v":100056.22},100056.22,null,{"$f":"SUM(F13:K13)-0.02","v":400224.86}]
["F",{"$f":"VLOOKUP(A14,ORÇAMENTO!$A$10:$L$43,2)","v":5},{"$f":"VLOOKUP(A14,ORÇAMENTO!$A$10:$L$43,5)","v":"FORNECIMENTOS - MATERIAL ASFÁLTICO (BDI DIFERENCIADO)"},"FISICO ",{"$f":"ROUND(E15/$G$2,4)","v":0.24890000000000001},null,null,0.5,0.5,null,null,{"$f":"SUM(F14:K14)","v":1}]
[null,null,null,"FINANCEIRO",{"$f":"ORÇAMENTO!L36","v":558510.70000000007},{"$f":"ROUND($E$15*F14,2)","v":0},0,279255.34999999998,279255.34999999998,0,null,{"$f":"SUM(F15:K15)-0.02","v":558510.67999999993}]
{"$rows_left_out":4}