{"text_format":"2","workbook":"xlsx","n_sheets":7,"sheets":["ORÇAMENTO","CPU-SERV","CPU-FORNEC","AUX-VEIC.","BDI SERV","BDI FORN","CRONOGRAMA"],"not_rendered":{"charts":0,"images":4,"macros":0,"external_links":1,"defined_names":9,"comments":2,"pivot_tables":0},"unopened":[],"bounds":{"document_bytes":16777216,"sheet_cells":100000,"run_cost":"one","rows_first":2000,"rows_last":500,"rows_between":2000,"halvings":0,"cell_chars":16384,"cell_head_chars":4096},"cells_cut":0,"cells_raw":0,"read":"whole","date_system":"1900"}

{"sheet":"ORÇAMENTO","index":0,"n_rows":43,"n_cols":12,"rows_kept":43,"cut":false,"hidden":false,"merged":[[42,1,42,4],[0,0,9,0],[0,4,0,11],[1,4,1,11],[2,4,2,11],[7,1,7,4],[8,1,8,11],[6,2,6,8],[6,9,6,10],[7,9,7,10],[4,1,5,1],[4,2,5,8],[5,9,5,10]]}
["<---- NUMERAR SERVIÇOS PARA CPU",null,null,null,"Ministério do Desenvolvimento Regional"]
[{"$nulls":4},"Companhia de Desenvolvimento dos Vales do São Francisco e do Parnaíba"]
[{"$nulls":4},"1ª Superintendência Regional"]
[]
[null,"OBRA: ","PAVIMENTAÇÃO ASFÁLTICA EM CBUQ DE VIAS EM COMUNIDADES RURAIS (COMUNIDADE MARIA PRETA, COMUNIDADE TIRIRICAL E DISTRITO DE SÃO NORBERTO - ENGENHEIRO NAVARRO / MG)"]
[{"$nulls":9},"BDI Serviços % :",null,{"$f":"'BDI SERV'!E26","v":24.67}]
[null,"DATA:"," SETEMBRO / 2025",{"$nulls":6},"BDI Diferenc. Serviços % :",null,{"$f":"'BDI FORN'!D31","v":15}]
[null,"PRAZO DE EXECUÇÃO:     180 DIAS",{"$nulls":7},"BDI Fornecimentos % :",null,{"$f":"'BDI FORN'!D31","v":15}]
[null,"PLANILHA DE ORÇAMENTAÇÃO"]
[null,"ITEM","CÓDIGO","FONTE","DISCRIMINAÇÃO","TIPO","UNID.","QUANT.","VR.UNIT.S/BDI","PR. UNIT.C/BDI","C. TOT.S/BDI","P. TOT.C/BDI"]
["A",1,null,null,"SERVIÇOS PRELIMINARES ",{"$nulls":5},{"$f":"SUM(K12:K17)","v":177013.11},{"$f":"SUM(L12:L17)","v":220664.00000000003}]
[1,"1.1","CPU.1","CODEVASF","MOBILIZAÇÃO E DESMOBILIZAÇÃO","SERV","GL",1,{"$f":"VLOOKUP(A12,'CPU-SERV'!A:K,11,0)","v":12629.18},{"$f":"TRUNC(IF(F12=\"SERV\",I12*(1+$L$6/100),IF(F12=\"SERV DIF\",I12*(1+$L$7/100),IF(F12=\"FORN\",I12*(1+$L$8/100),))),2)","v":15744.79},{"$f":"TRUNC(H12*I12,2)","v":12629.18},{"$f":"TRUNC(H12*J12,2)","v":15744.79}]
[2,"1.2","CPU.2","CODEVASF","ADMINISTRAÇÃO LOCAL ","SERV","GL",1,{"$f":"VLOOKUP(A13,'CPU-SERV'!A:K,11,0)","v":78327.67},{"$f":"TRUNC(IF(F13=\"SERV\",I13*(1+$L$6/100),IF(F13=\"SERV DIF\",I13*(1+$L$7/100),IF(F13=\"FORN\",I13*(1+$L$8/100),))),2)","v":97651.1},{"$f":"TRUNC(H13*I13,2)","v":78327.67},{"$f":"TRUNC(H13*J13,2)","v":97651.1}]
[3,"1.3","CPU.3","CODEVASF","CANTEIRO DE OBRAS ","SERV","GL",3,{"$f":"VLOOKUP(A14,'CPU-SERV'!A:K,11,0)","v":14467.74},{"$f":"TRUNC(IF(F14=\"SERV\",I14*(1+$L$6/100),IF(F14=\"SERV DIF\",I14*(1+$L$7/100),IF(F14=\"FORN\",I14*(1+$L$8/100),))),2)","v":18036.93},43403.22,54110.79]
[4,"1.4",103689,"SINAPI","PLACA DE OBRA EM CHAPA DE AÇO GALVANIZADO","SERV","M2",6,{"$f":"VLOOKUP(A15,'CPU-SERV'!A:K,11,0)","v":547.64},{"$f":"TRUNC(IF(F15=\"SERV\",I15*(1+$L$6/100),IF(F15=\"SERV DIF\",I15*(1+$L$7/100),IF(F15=\"FORN\",I15*(1+$L$8/100),))),2)","v":682.74},3285.84,4096.4399999999996]
{"$rows_left_out":29}
{"sheet":"CPU-SERV","index":1,"n_rows":1036,"n_cols":13,"rows_kept":1036,"cut":false,"hidden":false,"merged":[[865,0,904,0],[866,2,866,9],[867,1,868,3],[867,4,867,5],[868,4,868,5],[869,2,869,7],[869,8,869,9],[870,1,871,2],[870,3,871,3],[870,4,870,5],[870,6,870,7],[875,7,875,9],[878,3,878,7],[879,3,879,7],[880,3,880,7],[883,7,883,9],[886,3,886,7],[887,7,887,9],[892,3,892,7],[894,8,894,9],[897,3,897,7],[898,1,899,2],[898,3,899,3],[898,4,899,4],[42,0,84,0],[43,2,43,9],[499,1,500,3],[499,4,499,5],[500,4,500,5],[501,2,501,7],[501,8,501,9],[502,1,503,2],[502,3,503,3],[502,4,502,5],[502,6,502,7],[497,0,549,0],[498,2,498,9],[46,2,46,7],[46,8,46,9],[47,1,48,2],[60,3,60,7],[63,7,63,9],[66,3,66,7],[67,7,67,9],[44,1,45,3],[44,4,44,5],[45,4,45,5],[72,3,72,7],[582,1,583,2],[582,3,583,3],[582,4,583,4],[582,5,582,7],[582,9,583,9],[529,3,529,7],[531,8,531,9],[538,3,538,7],[564,3,564,7],[548,5,548,7],[576,3,576,7],[539,1,540,2],[556,1,557,2],[556,4,556,5],[556,6,556,7],[561,7,561,9],[555,2,555,7],[547,3,547,7],[621,4,622,4],[621,5,621,7],[621,9,622,9],[625,3,625,7],[510,7,510,9],[512,3,512,7],[513,3,513,7],[514,3,514,7],[517,7,517,9],[522,7,522,8],[578,8,578,9],[581,3,581,7],[527,7,527,9],[526,3,526,7],[539,3,540,3],[539,4,540,4],[539,5,539,7],[539,9,540,9],[566,3,566,7],[569,7,569,9],[572,3,572,7],[573,7,573,9],[555,8,555,9],[556,3,557,3],[590,0,627,0],[591,2,591,9],[592,1,593,3],[592,4,592,5],[593,4,593,5],[594,2,594,7],[594,8,594,9],[595,1,596,2],[595,3,596,3],[595,4,595,5],[595,6,595,7],[600,7,600,9],[603,3,603,7],[604,3,604,7],[605,3,605,7],[608,7,608,9],[611,3,611,7],[612,7,612,9],[615,3,615,7],[617,8,617,9],[626,5,626,7],[620,3,620,7],[621,1,622,2],[621,3,622,3],[7,13,7,15],[18,11,18,13],[24,3,24,7],[4,2,4,7],[4,8,4,9],[5,1,6,2],[5,3,6,3],[5,4,5,5],[5,6,5,7],[0,0,40,0],[3,4,3,5],[0,11,0,12],[1,11,1,12],[2,4,2,5],[1,2,1,9],[2,1,3,3],[34,3,35,3],[34,4,35,4],[34,5,34,7],[34,9,35,9],[38,3,38,7],[39,5,39,7],[13,7,13,9],[16,3,16,7],[17,3,17,7],[18,3,18,7],[21,7,21,9],[33,3,33,7],[34,1,35,2],[25,7,25,9],[28,3,28,7],[2,10,2,11],[30,8,30,9],[74,8,74,9],[47,3,48,3],[47,4,47,5],[47,6,47,7],[52,7,52,9],[58,3,58,7],[59,3,59,7],[82,3,82,7],[83,5,83,7],[88,4,88,5],[77,3,77,7],[78,1,79,2],[78,3,79,3],[78,4,79,4],[78,5,78,7],[78,9,79,9],[117,1,118,2],[117,3,118,3],[117,4,118,4],[117,5,117,7],[117,9,118,9],[121,3,121,7],[96,7,96,9],[101,3,101,7],[104,7,104,9],[107,3,107,7],[108,7,108,9],[111,3,111,7],[113,8,113,9],[116,3,116,7],[99,3,99,7],[100,3,100,7],[122,5,122,7],[125,0,164,0],[126,2,126,9],[127,1,128,3],[127,4,127,5],[128,4,128,5],[129,2,129,7],[129,8,129,9],[162,3,162,7],[163,5,163,7],[86,0,123,0],[87,2,87,9],[88,1,89,3],[89,4,89,5],[90,2,90,7],[90,8,90,9],[91,1,92,2],[91,3,92,3],[91,4,91,5],[91,6,91,7],[139,3,139,7],[140,3,140,7],[143,7,143,9],[148,3,148,7],[149,7,149,9],[152,3,152,7],[130,1,131,2],[130,3,131,3],[130,4,130,5],[130,6,130,7],[135,7,135,9],[138,3,138,7],[154,8,154,9],[157,3,157,7],[158,1,159,2],[158,3,159,3],[158,4,159,4],[158,5,158,7],[158,9,159,9],[199,3,199,7],[201,8,201,9],[179,3,179,7],[180,3,180,7],[181,3,181,7],[170,8,170,9],[171,1,172,2],[171,3,172,3],[171,4,171,5],[171,6,171,7],[213,0,252,0],[214,2,214,9],[215,1,216,3],[215,4,215,5],[216,4,216,5],[217,2,217,7],[250,3,250,7],[251,5,251,7],[166,0,211,0],[167,2,167,9],[168,1,169,3],[168,4,168,5],[169,4,169,5],[170,2,170,7],[204,3,204,7],[205,1,206,2],[205,3,206,3],[205,4,206,4],[205,5,205,7],[205,9,206,9],[258,8,258,9],[259,1,260,2],[259,3,260,3],[259,4,259,5],[176,7,176,9],[228,3,228,7],[229,3,229,7],[230,3,230,7],[233,7,233,9],[236,3,236,7],[237,7,237,9],[217,8,217,9],[218,1,219,2],[218,3,219,3],[218,4,218,5],[218,6,218,7],[223,7,223,9],[209,3,209,7],[210,5,210,7],[184,7,184,9],[187,3,187,7],[188,7,188,9],[259,6,259,7],[254,0,291,0],[255,2,255,9],[256,1,257,3],[256,4,256,5],[257,4,257,5],[258,2,258,7],[240,3,240,7],[242,8,242,9],[245,3,245,7],[246,1,247,2],[246,3,247,3],[246,4,247,4],[246,5,246,7],[246,9,247,9],[279,3,279,7],[281,8,281,9],[284,3,284,7],[285,1,286,2],[285,3,286,3],[285,4,286,4],[285,5,285,7],[285,9,286,9],[267,3,267,7],[268,3,268,7],[336,0,377,0],[337,2,337,9],[338,1,339,3],[338,4,338,5],[339,4,339,5],[340,2,340,7],[375,3,375,7],[376,5,376,7],[293,0,334,0],[294,2,294,9],[295,1,296,3],[295,4,295,5],[296,4,296,5],[297,2,297,7],[322,3,322,7],[324,8,324,9],[327,3,327,7],[328,1,329,2],[328,3,329,3],[328,4,329,4],[297,8,297,9],[298,1,299,2],[298,3,299,3],[298,4,298,5],[264,7,264,9],[289,3,289,7],[290,5,290,7],[269,3,269,7],[272,7,272,9],[275,3,275,7],[276,7,276,9],[310,3,310,7],[311,3,311,7],[298,6,298,7],[307,7,307,9],[312,3,312,7],[315,7,315,9],[318,3,318,7],[319,7,319,9],[365,3,365,7],[367,8,367,9],[370,3,370,7],[353,3,353,7],[354,3,354,7],[355,3,355,7],[358,7,358,9],[361,3,361,7],[340,8,340,9],[341,3,342,3],[341,4,341,5],[341,6,341,7],[350,7,350,9],[371,1,372,2],[371,3,372,3],[371,4,372,4],[371,5,371,7],[371,9,372,9],[328,5,328,7],[328,9,329,9],[362,7,362,9],[341,1,342,2],[332,3,332,7],[333,5,333,7],[397,7,397,9],[400,3,400,7],[401,7,401,9],[404,3,404,7],[406,8,406,9],[409,3,409,7],[379,0,416,0],[380,2,380,9],[381,1,382,3],[381,4,381,5],[382,4,382,5],[383,2,383,7],[414,3,414,7],[415,5,415,7],[398,7,398,8],[410,1,411,2],[410,3,411,3],[410,4,411,4],[410,5,410,7],[410,9,411,9],[383,8,383,9],[384,1,385,2],[384,3,385,3],[384,4,384,5],[384,6,384,7],[389,7,389,9],[392,3,392,7],[393,3,393,7],[394,3,394,7],[483,3,483,7],[457,0,495,0],[458,2,458,9],[459,1,460,3],[459,4,459,5],[460,4,460,5],[461,2,461,7],[493,3,493,7],[494,5,494,7],[485,8,485,9],[488,3,488,7],[489,1,490,2],[489,3,490,3],[489,4,490,4],[489,5,489,7],[489,9,490,9],[471,3,471,7],[472,3,472,7],[473,3,473,7],[476,7,476,9],[479,3,479,7],[480,7,480,9],[461,8,461,9],[462,1,463,2],[418,0,455,0],[419,2,419,9],[420,1,421,3],[420,4,420,5],[421,4,421,5],[422,2,422,7],[445,8,445,9],[448,3,448,7],[449,1,450,2],[449,3,450,3],[439,3,439,7],[440,7,440,9],[449,4,450,4],[449,5,449,7],[449,9,450,9],[431,3,431,7],[422,8,422,9],[423,1,424,2],[423,3,424,3],[423,4,423,5],[423,6,423,7],[428,7,428,9],[443,3,443,7],[436,7,436,9],[462,3,463,3],[462,4,462,5],[462,6,462,7],[468,7,468,9],[453,3,453,7],[454,5,454,7],[432,3,432,7],[433,3,433,7],[437,7,437,8],[586,3,586,7],[587,5,587,7],[629,0,666,0],[630,2,630,9],[631,1,632,3],[631,4,631,5],[632,4,632,5],[633,2,633,7],[664,3,664,7],[665,5,665,7],[551,0,588,0],[552,2,552,9],[553,1,554,3],[553,4,553,5],[554,4,554,5],[654,3,654,7],[656,8,656,9],[659,3,659,7],[660,1,661,2],[660,3,661,3],[660,4,661,4],[660,5,660,7],[660,9,661,9],[565,3,565,7],[672,8,672,9],[673,1,674,2],[673,3,674,3],[673,4,673,5],[673,6,673,7],[678,7,678,9],[651,7,651,9],[633,8,633,9],[634,1,635,2],[634,3,635,3],[634,4,634,5],[634,6,634,7],[639,7,639,9],[642,3,642,7],[643,3,643,7],[644,3,644,7],[647,7,647,9],[650,3,650,7],[699,3,700,3],[699,4,700,4],[699,5,699,7],[699,9,700,9],[681,3,681,7],[682,3,682,7],[683,3,683,7],[686,7,686,9],[689,3,689,7],[690,7,690,9],[703,3,703,7],[704,5,704,7],[746,0,783,0],[747,2,747,9],[748,1,749,3],[748,4,748,5],[749,4,749,5],[750,2,750,7],[781,3,781,7],[782,5,782,7],[668,0,705,0],[669,2,669,9],[670,1,671,3],[670,4,670,5],[671,4,671,5],[672,2,672,7],[771,3,771,7],[773,8,773,9],[776,3,776,7],[777,1,778,2],[693,3,693,7],[695,8,695,9],[698,3,698,7],[699,1,700,2],[759,3,759,7],[760,3,760,7],[761,3,761,7],[764,7,764,9],[767,3,767,7],[768,7,768,9],[750,8,750,9],[751,1,752,2],[751,3,752,3],[751,4,751,5],[751,6,751,7],[756,7,756,9],[777,3,778,3],[777,4,778,4],[777,5,777,7],[777,9,778,9],[810,3,810,7],[812,8,812,9],[815,3,815,7],[816,1,817,2],[816,3,817,3],[816,4,817,4],[816,5,816,7],[816,9,817,9],[798,3,798,7],[799,3,799,7],[800,3,800,7],[803,7,803,9],[806,3,806,7],[807,7,807,9],[789,8,789,9],[790,1,791,2],[790,3,791,3],[790,4,790,5],[790,6,790,7],[795,7,795,9],[785,0,822,0],[786,2,786,9],[787,1,788,3],[787,4,787,5],[788,4,788,5],[789,2,789,7],[837,3,837,7],[824,0,863,0],[825,2,825,9],[826,1,827,3],[826,4,826,5],[827,4,827,5],[861,3,861,7],[862,5,862,7],[851,3,851,7],[853,8,853,9],[856,3,856,7],[857,1,858,2],[857,3,858,3],[857,4,858,4],[857,5,857,7],[857,9,858,9],[838,3,838,7],[839,3,839,7],[937,9,938,9],[950,6,950,7],[955,7,955,9],[949,2,949,7],[958,3,958,7],[820,3,820,7],[821,5,821,7],[842,7,842,9],[847,3,847,7],[848,7,848,9],[828,8,828,9],[829,1,830,2],[829,3,830,3],[829,4,829,5],[829,6,829,7],[834,7,834,9],[828,2,828,7],[924,7,924,9],[927,3,927,7],[928,7,928,9],[898,5,898,7],[898,9,899,9],[902,3,902,7],[903,5,903,7],[906,0,943,0],[907,2,907,9],[908,1,909,3],[908,4,908,5],[909,4,909,5],[910,2,910,7],[910,8,910,9],[911,1,912,2],[911,3,912,3],[911,4,911,5],[911,6,911,7],[916,7,916,9],[919,3,919,7],[920,3,920,7],[921,3,921,7],[941,3,941,7],[942,5,942,7],[931,3,931,7],[933,8,933,9],[936,3,936,7],[937,1,938,2],[937,3,938,3],[937,4,938,4],[937,5,937,7],[945,0,989,0],[946,2,946,9],[947,1,948,3],[947,4,947,5],[948,4,948,5],[987,3,987,7],[988,5,988,7],[973,3,973,7],[975,8,975,9],[980,3,980,7],[981,1,982,2],[969,3,969,7],[970,7,970,9],[949,8,949,9],[950,1,951,2],[950,3,951,3],[950,4,950,5],[959,3,959,7],[960,3,960,7],[963,7,963,9],[996,3,997,3],[996,4,996,5],[996,6,996,7],[1001,7,1001,9],[991,0,1035,0],[992,2,992,9],[993,1,994,3],[993,4,993,5],[994,4,994,5],[995,2,995,7],[1033,3,1033,7],[1034,5,1034,7],[738,4,739,4],[738,5,738,7],[738,9,739,9],[742,3,742,7],[1019,3,1019,7],[1021,8,1021,9],[1026,3,1026,7],[1027,1,1028,2],[1027,3,1028,3],[1027,4,1028,4],[1027,5,1027,7],[1027,9,1028,9],[981,3,982,3],[981,4,982,4],[981,5,981,7],[981,9,982,9],[1004,3,1004,7],[1005,3,1005,7],[1006,3,1006,7],[1009,7,1009,9],[1015,3,1015,7],[1016,7,1016,9],[995,8,995,9],[996,1,997,2],[743,5,743,7],[707,0,744,0],[708,2,708,9],[709,1,710,3],[709,4,709,5],[710,4,710,5],[711,2,711,7],[711,8,711,9],[712,1,713,2],[712,3,713,3],[712,4,712,5],[712,6,712,7],[717,7,717,9],[720,3,720,7],[721,3,721,7],[722,3,722,7],[725,7,725,9],[728,3,728,7],[729,7,729,9],[732,3,732,7],[734,8,734,9],[737,3,737,7],[738,1,739,2],[738,3,739,3]]}
[1,"1ª/GRD",{"$nulls":8},{"$f":"J40","v":12629.18},"Minas Gerais"]
[null,"OBRA:","PAVIMENTAÇÃO ASFÁLTICA EM CBUQ DE VIAS EM COMUNIDADES RURAIS (COMUNIDADE MARIA PRETA, COMUNIDADE TIRIRICAL E DISTRITO DE SÃO NORBERTO - ENGENHEIRO NAVARRO / MG)",{"$nulls":8}," Abril/2025 "]
[null,"Custo Unitário de Referência",null,null,"Minas Gerais"]
[{"$nulls":4}," Abril/2025 ",null,null,"Produção da equipe ",0.5,{"$f":"VLOOKUP(A1,ORÇAMENTO!$A$11:$L$43,7,1)","v":"GL"}]
[null,"CPU.1","MOBILIZAÇÃO E DESMOBILIZAÇÃO",{"$nulls":5},"Valores em reais (R$)"]
[null,"A - EQUIPAMENTOS",null,"Quantidade","Utilização",null,"Custo Horário",null,null,"Custo"]
[{"$nulls":4},"Operativa","Improdutiva","Produtivo","Improdutivo",null,"Horário Total"]
[null,"E9687","Caminhão carroceria com capacidade de 5 t - 120 kW",8,0.6,0.4,154.82689999999999,59.719900000000003,null,{"$f":"D8*(E8*G8+F8*H8)","v":934.27279999999996}]
[null,"E9571","Caminhão tanque com capacidade de 10.000 l - 188 kW",2,1,0,332.8408,83.189300000000003,null,{"$f":"D9*(E9*G9+F9*H9)","v":665.6816}]
[null,"E9509","Caminhão tanque distribuidor de asfalto com capacidade de 6.000 l - 7 kW/136 kW",2,1,0,267.51929999999999,74.644499999999994,null,535.03859999999997]
[null,"E9514","Distribuidor de agregados sobre pneus autopropelido - 130 kW",2,1,0,293.41419999999999,107.0603,null,586.82839999999999]
[null,"E9575","Caminhão basculante com caçamba estanque com capacidade de 14 m³ - 210 kW",4,1,0,314.16070000000002,91.266099999999994,null,{"$f":"D12*(E12*G12+F12*H12)","v":1256.6428000000001}]
[{"$nulls":7},"Custo horário total de equipamentos",null,{"$f":"SUM(J8:J12)","v":3978.4641999999999}]
[null,"B - MÃO DE OBRA",null,"Quantidade","Unidade",null,"Custo Horário","Custo Horário Total"]
[null,"P9824","Servente",8,"h",null,21.435400000000001,null,null,{"$f":"D15*G15","v":171.48320000000001}]
{"$rows_left_out":1022}
{"sheet":"CPU-FORNEC","index":2,"n_rows":92,"n_cols":14,"rows_kept":92,"cut":false,"hidden":false,"merged":[[28,8,33,10],[71,0,80,0],[71,1,71,3],[71,4,71,7],[72,2,72,5],[73,2,73,3],[74,1,74,7],[77,1,77,3],[77,5,77,6],[78,1,78,6],[79,1,79,6],[80,1,80,6],[38,0,47,0],[38,1,38,3],[38,4,38,7],[39,2,39,5],[0,0,26,0],[0,1,0,3],[0,4,0,7],[22,1,22,3],[49,0,58,0],[49,1,49,3],[49,4,49,7],[50,2,50,5],[51,2,51,3],[52,1,52,7],[55,1,55,3],[55,5,55,6],[56,1,56,6],[57,1,57,6],[58,1,58,6],[27,1,27,3],[27,4,27,7],[28,2,28,5],[27,0,36,0],[29,2,29,3],[30,1,30,7],[33,1,33,3],[33,5,33,6],[34,1,34,6],[35,1,35,6],[36,1,36,6],[0,10,0,11],[1,2,1,5],[1,10,1,11],[2,2,2,3],[3,1,3,7],[22,5,22,6],[23,1,23,6],[24,1,24,6],[25,1,25,6],[5,1,5,7],[9,1,9,7],[13,1,13,7],[17,1,17,7],[40,2,40,3],[41,1,41,7],[44,1,44,3],[44,5,44,6],[45,1,45,6],[46,1,46,6],[47,1,47,6],[60,0,69,0],[60,1,60,3],[60,4,60,7],[61,2,61,5],[62,2,62,3],[63,1,63,7],[66,1,66,3],[66,5,66,6],[67,1,67,6],[68,1,68,6],[69,1,69,6],[81,1,81,7],[82,0,91,0],[82,1,82,3],[82,4,82,7],[83,2,83,5],[84,2,84,3],[85,1,85,7],[88,1,88,3],[88,5,88,6],[89,1,89,6],[90,1,90,6],[91,1,91,6]]}
[1,"CODEVASF",null,null," COMPOSIÇÃO DE PREÇO UNITÁRIO",null,null,null,{"$f":"H24","v":0},{"$f":"H26","v":0},"BDI CALCULADO:",null,{"$f":"ORÇAMENTO!L7","v":15}]
[null,"OBRA:  ","PAVIMENTAÇÃO ASFÁLTICA EM CBUQ DE VIAS EM COMUNIDADES RURAIS (COMUNIDADE MARIA PRETA, COMUNIDADE TIRIRICAL E DISTRITO DE SÃO NORBERTO - ENGENHEIRO NAVARRO / MG)",null,null,null,"DATA: ",{"$f":"ORÇAMENTO!C7","v":" SETEMBRO / 2025"},null,null,"BDI DIFERENCIADO:",null,{"$f":"'BDI FORN'!D31/100","v":0.15}]
[null,"SERVIÇO:  ","CPU.1",null,"Referência:","CODEVASF","UNIDADE: ",{"$f":"VLOOKUP(A1,ORÇAMENTO!A12:L32,5)","v":"MOBILIZAÇÃO E DESMOBILIZAÇÃO"}]
[]
[null,"TIPO ITEM","CODIGO ITEM","DESCRIÇÃO ITEM","UNIDADE ITEM","COEFICIENTE","PRECO UNITARIO","CUSTO TOTAL",null,"distancia =",90,"B.DESPACHO"]
[null,"EQUIPAMENTOS",{"$nulls":7},"Pá carregadeira ",null,null,10.1," ton"]
[null,null,"E9001","E9001","E9001",null,"E9001"]
[]
[]
[null,"MÃO DE OBRA"]
[]
[]
[]
[null,"MATERIAIS"]
[]
{"$rows_left_out":78}
{"sheet":"AUX-VEIC.","index":3,"n_rows":31,"n_cols":6,"rows_kept":31,"cut":false,"hidden":false,"merged":[[25,2,25,3],[1,1,1,4],[2,1,2,2],[3,1,3,4],[17,1,17,4],[18,2,18,3],[19,2,19,3],[20,2,20,3],[21,2,21,3],[22,2,22,3],[23,2,23,3],[24,2,24,3],[26,2,26,3],[27,2,27,3],[28,2,28,3],[29,1,30,1],[29,2,29,3],[30,2,30,3]]}
[]
[null,"CÁLCULO DO CUSTO POR MÊS DE VEÍCULOS"]
[null,"Veículo: Polo TSI, Onix Turbo, Argo 1.3, HB-20 Turbo",null,"Data:","2025-07-28"]
[null,"DADOS ELEMENTARES DO VEÍCULO"]
[null,"Dados Básicos","Preço (R$)","Quantidade","Vida Útil"]
[null,"Quilometragem média mensal",null,3000]
[null,"Valor de Aquisição (VA)",103900]
[null,"Taxa de Juros (i)%",null,14.75]
[null,"IPVA e Seguro Obrigatório (4%)",{"$f":"0.04*C7","v":4156}]
[null,"Lavagem",50,2]
[null,"Pneus",479.9,4,50000]
[null,"Combustível",6.01,14]
[null,"Óleo Lubrificante + Filtros (revisão)",{"$f":"4*(188.59+213.69+186.16+283.83+186.16)/5","v":846.74400000000003},1,10000]
[null,"Seguro Total Anual",3378.94]
[null,"Jogo de Amortecedores",1287,null,50000]
{"$rows_left_out":17}
{"sheet":"BDI SERV","index":4,"n_rows":60,"n_cols":5,"rows_kept":60,"cut":false,"hidden":false,"merged":[[35,0,35,5],[36,0,36,5],[38,1,38,4],[39,2,39,3],[0,1,2,4],[25,1,25,3],[26,1,26,2],[26,3,26,4],[27,3,27,4]]}
[null,"DETALHAMENTO DO BDI - SERVIÇOS"]
[]
[]
[null,"Item","Descrição dos Serviços","% - PV","% - CD"]
[]
[null,1,"ADMINISTRAÇÃO CENTRAL"," ",{"$f":"SUM(E7:E9)","v":4.01}]
[null,"1.1","ESCRITÓRIO CENTRAL",null,4.01]
[null,"1.2","VIAGENS"]
[null,"1.3","OUTROS"]
[null," "," "," "," "]
[null,2,"IMPOSTOS E TAXAS",{"$f":"SUM(D12:D15)","v":8.65},{"$f":"SUM(E12:E15)","v":0}]
[null,"2.1","ISS - Proposta",{"$f":"D34*100","v":5}]
[null,"2.2","PIS",0.65]
[null,"2.3","Cofins",3]
[null,"2.4","Contribuição Previdenciaria (CPRB)"]
{"$rows_left_out":46}
{"sheet":"BDI FORN","index":5,"n_rows":37,"n_cols":5,"rows_kept":37,"cut":false,"hidden":false,"merged":[[31,1,31,2],[32,0,34,5],[36,0,36,5],[0,1,2,4],[3,1,4,1],[3,2,4,2],[28,0,28,5],[30,1,30,2]]}
[null,"DETALHAMENTO DO BDI - FORNECIMENTO \n(MATERIAL ASFÁLTICO)"]
[]
[]
[null,"Item","Descrição dos Serviços","%","%"]
[null,null,null,"PV","CD"]
[]
[null,1,"ADMINISTRAÇÃO CENTRAL"," ",3.45]
[null,"1.1","ESCRITÓRIO CENTRAL"," "," "]
[null,"1.2","VIAGENS"," "," "]
[null,"1.3","OUTROS"," "," "]
[null," "," "," "," "]
[null,2,"IMPOSTOS E TAXAS",{"$f":"SUM(D13:D16)","v":3.65},{"$f":"SUM(E13:E16)","v":4.5600000000000005}]
[null,"2.1","ISS (*)",null,{"$f":"ROUND(D13*1.2515,2)","v":0}]
[null,"2.2","PIS",0.65,{"$f":"ROUND(D14*1.2515,2)","v":0.81}]
[null,"2.3","Cofins",3,{"$f":"ROUND(D15*1.2515,2)","v":3.75}]
{"$rows_left_out":23}
{"sheet":"CRONOGRAMA","index":6,"n_rows":19,"n_cols":12,"rows_kept":19,"cut":false,"hidden":false,"merged":[[15,1,16,2],[18,1,22,11],[11,0,12,0],[11,1,12,1],[11,2,12,2],[13,0,14,0],[13,1,14,1],[13,2,14,2],[9,0,10,0],[9,1,10,1],[9,2,10,2],[3,1,3,10],[5,0,6,0],[5,1,6,1],[5,2,6,2],[7,0,8,0],[7,1,8,1],[7,2,8,2],[0,1,0,11],[1,1,2,1],[1,2,2,4],[1,6,1,11],[2,6,2,11]]}
[null,"CRONOGRAMA FÍSICO-FINANCEIRO"]
[null,"OBRA: ",{"$f":"ORÇAMENTO!C5","v":"PAVIMENTAÇÃO ASFÁLTICA EM CBUQ DE VIAS EM COMUNIDADES RURAIS (COMUNIDADE MARIA PRETA, COMUNIDADE TIRIRICAL E DISTRITO DE SÃO NORBERTO - ENGENHEIRO NAVARRO / MG)"},null,null,"VALOR:",{"$f":"ORÇAMENTO!L43","v":1428594.29}]
[{"$nulls":5},"PRAZO: ","180 DIAS "]
[]
[null,"ITEM","ETAPAS/DESCRIÇAO","FISICO/  FINANCEIRO","TOTAL  ETAPAS","MÊS 1","MÊS 2","MÊS 3","MÊS 4","MÊS 5","MÊS 6","TOTAL"]
["A",{"$f":"VLOOKUP(A6,ORÇAMENTO!$A$11:$L$43,2)","v":1},{"$f":"VLOOKUP(A6,ORÇAMENTO!$A$11:$L$43,5)","v":"SERVIÇOS PRELIMINARES "},"FISICO ",{"$f":"ROUND(E7/$G$2,4)","v":0.1545},0.25,0.15,0.15,0.15,0.15,0.15,{"$f":"SUM(F6:K6)","v":1}]
[null,null,null,"FINANCEIRO",{"$f":"ORÇAMENTO!L11","v":220664.00000000003},{"$f":"ROUND($E$7*F6,2)","v":55166},{"$f":"ROUND($E$7*G6,2)","v":33099.599999999999},{"$f":"ROUND($E$7*H6,2)","v":33099.599999999999},{"$f":"ROUND($E$7*I6,2)","v":33099.599999999999},33099.599999999999,33099.599999999999,{"$f":"SUM(F7:K7)","v":220664.00000000003}]
["B",{"$f":"VLOOKUP(A8,ORÇAMENTO!$A$11:$L$43,2)","v":2},{"$f":"VLOOKUP(A8,ORÇAMENTO!$A$11:$L$43,5)","v":"TERRAPLANAGEM E PAVIMENTAÇÃO"},"FISICO ",{"$f":"ROUND(E9/$G$2,4)","v":0.21840000000000001},0.15,0.25,0.25,0.25,0.1,null,{"$f":"SUM(F8:K8)","v":1}]
[null,null,null,"FINANCEIRO",{"$f":"ORÇAMENTO!L18","v":311973.90000000002},{"$f":"ROUND($E$9*F8,2)","v":46796.09},{"$f":"ROUND($E$9*G8,2)","v":77993.48},{"$f":"ROUND($E$9*H8,2)","v":77993.48},{"$f":"ROUND($E$9*I8,2)","v":77993.48},31197.39,0,{"$f":"SUM(F9:K9)","v":311973.92}]
["C",{"$f":"VLOOKUP(A10,ORÇAMENTO!$A$11:$L$43,2)","v":3},{"$f":"VLOOKUP(A10,ORÇAMENTO!$A$11:$L$43,5)","v":"TRANSPORTE DE MATERIAIS"},"FISICO ",{"$f":"ROUND(E11/$G$2,4)","v":0.1464},0.15,0.25,0.25,0.25,0.1,null,{"$f":"SUM(F10:K10)","v":1}]
[null,null,null,"FINANCEIRO",{"$f":"ORÇAMENTO!L25","v":209160},{"$f":"ROUND($E$11*F10,2)","v":31374},{"$f":"ROUND($E$11*G10,2)","v":52290},{"$f":"ROUND($E$11*H10,2)","v":52290},{"$f":"ROUND($E$11*I10,2)","v":52290},20916,0,{"$f":"SUM(F11:K11)-0.04","v":209159.96}]
["E",{"$f":"VLOOKUP(A12,ORÇAMENTO!$A$11:$L$43,2)","v":4},{"$f":"VLOOKUP(A12,ORÇAMENTO!$A$11:$L$43,5)","v":"DRENAGEM E OBRAS COMPLEMENTARES"},"FISICO ",{"$f":"ROUND(E13/$G$2,4)","v":0.2162},null,0.2,0.2,0.2,0.2,0.2,{"$f":"SUM(F12:K12)","v":1}]
[null,null,null,"FINANCEIRO",{"$f":"ORÇAMENTO!L31","v":308821.45},{"$f":"ROUND($E$13*F12,2)","v":0},{"$f":"ROUND($E$13*G12,2)","v":61764.29},{"$f":"ROUND($E$13*H12,2)","v":61764.29},{"$f":"ROUND($E$13*I12,2)","v":61764.29},61764.29,61764.29,{"$f":"SUM(F13:K13)-0.02","v":308821.43}]
["F",{"$f":"VLOOKUP(A14,ORÇAMENTO!$A$11:$L$43,2)","v":5},{"$f":"VLOOKUP(A14,ORÇAMENTO!$A$11:$L$43,5)","v":"FORNECIMENTOS - MATERIAL ASFÁLTICO (BDI DIFERENCIADO)"},"FISICO ",{"$f":"ROUND(E15/$G$2,4)","v":0.2646},null,null,0.25,0.5,0.25,null,{"$f":"SUM(F14:K14)","v":1}]
[null,null,null,"FINANCEIRO",{"$f":"ORÇAMENTO!L36","v":377974.93999999994},{"$f":"ROUND($E$15*F14,2)","v":0},0,94493.74,188987.47,94493.74,0,{"$f":"SUM(F15:K15)-0.02","v":377974.93}]
{"$rows_left_out":4}