{"text_format":"2","workbook":"xlsx","n_sheets":7,"sheets":["ORÇAMENTO","CPU-SERV","CPU-FORNEC","AUX-VEIC.","BDI SERV","BDI FORN","CRONOGRAMA"],"not_rendered":{"charts":0,"images":4,"macros":0,"external_links":1,"defined_names":9,"comments":2,"pivot_tables":0},"unopened":[],"bounds":{"document_bytes":16777216,"sheet_cells":100000,"run_cost":"one","rows_first":2000,"rows_last":500,"rows_between":2000,"halvings":0,"cell_chars":16384,"cell_head_chars":4096},"cells_cut":0,"cells_raw":0,"read":"whole","date_system":"1900"}

{"sheet":"ORÇAMENTO","index":0,"n_rows":43,"n_cols":12,"rows_kept":43,"cut":false,"hidden":false,"merged":[[42,1,42,4],[0,0,9,0],[0,4,0,11],[1,4,1,11],[2,4,2,11],[7,1,7,4],[8,1,8,11],[6,2,6,8],[6,9,6,10],[7,9,7,10],[4,1,5,1],[4,2,5,8],[5,9,5,10]]}
["<---- NUMERAR SERVIÇOS PARA CPU",null,null,null,"Ministério do Desenvolvimento Regional"]
[{"$nulls":4},"Companhia de Desenvolvimento dos Vales do São Francisco e do Parnaíba"]
[{"$nulls":4},"1ª Superintendência Regional"]
[]
[null,"OBRA: ","PAVIMENTAÇÃO ASFÁLTICA EM CBUQ DE VIAS EM COMUNIDADES RURAIS (COMUNIDADE MARIA PRETA, COMUNIDADE TIRIRICAL E DISTRITO DE SÃO NORBERTO - ENGENHEIRO NAVARRO / MG)"]
[{"$nulls":9},"BDI Serviços % :",null,{"$f":"'BDI SERV'!E26","v":24.67}]
[null,"DATA:"," SETEMBRO / 2025",{"$nulls":6},"BDI Diferenc. Serviços % :",null,{"$f":"'BDI FORN'!D31","v":15}]
[null,"PRAZO DE EXECUÇÃO:     180 DIAS",{"$nulls":7},"BDI Fornecimentos % :",null,{"$f":"'BDI FORN'!D31","v":15}]
[null,"PLANILHA DE ORÇAMENTAÇÃO"]
[null,"ITEM","CÓDIGO","FONTE","DISCRIMINAÇÃO","TIPO","UNID.","QUANT.","VR.UNIT.S/BDI","PR. UNIT.C/BDI","C. TOT.S/BDI","P. TOT.C/BDI"]
["A",1,null,null,"SERVIÇOS PRELIMINARES ",{"$nulls":5},{"$f":"SUM(K12:K17)","v":177013.11},{"$f":"SUM(L12:L17)","v":220664.00000000003}]
[1,"1.1","CPU.1","CODEVASF","MOBILIZAÇÃO E DESMOBILIZAÇÃO","SERV","GL",1,{"$f":"VLOOKUP(A12,'CPU-SERV'!A:K,11,0)","v":12629.18},{"$f":"TRUNC(IF(F12=\"SERV\",I12*(1+$L$6/100),IF(F12=\"SERV DIF\",I12*(1+$L$7/100),IF(F12=\"FORN\",I12*(1+$L$8/100),))),2)","v":15744.79},{"$f":"TRUNC(H12*I12,2)","v":12629.18},{"$f":"TRUNC(H12*J12,2)","v":15744.79}]
[2,"1.2","CPU.2","CODEVASF","ADMINISTRAÇÃO LOCAL ","SERV","GL",1,{"$f":"VLOOKUP(A13,'CPU-SERV'!A:K,11,0)","v":78327.67},{"$f":"TRUNC(IF(F13=\"SERV\",I13*(1+$L$6/100),IF(F13=\"SERV DIF\",I13*(1+$L$7/100),IF(F13=\"FORN\",I13*(1+$L$8/100),))),2)","v":97651.1},{"$f":"TRUNC(H13*I13,2)","v":78327.67},{"$f":"TRUNC(H13*J13,2)","v":97651.1}]
[3,"1.3","CPU.3","CODEVASF","CANTEIRO DE OBRAS ","SERV","GL",3,{"$f":"VLOOKUP(A14,'CPU-SERV'!A:K,11,0)","v":14467.74},{"$f":"TRUNC(IF(F14=\"SERV\",I14*(1+$L$6/100),IF(F14=\"SERV DIF\",I14*(1+$L$7/100),IF(F14=\"FORN\",I14*(1+$L$8/100),))),2)","v":18036.93},43403.22,54110.79]
[4,"1.4",103689,"SINAPI","PLACA DE OBRA EM CHAPA DE AÇO GALVANIZADO","SERV","M2",6,{"$f":"VLOOKUP(A15,'CPU-SERV'!A:K,11,0)","v":547.64},{"$f":"TRUNC(IF(F15=\"SERV\",I15*(1+$L$6/100),IF(F15=\"SERV DIF\",I15*(1+$L$7/100),IF(F15=\"FORN\",I15*(1+$L$8/100),))),2)","v":682.74},3285.84,4096.4399999999996]
[5,"1.5","CPU.4","CODEVASF","VEÍCULO PARA A FISCALIZAÇÃO, MÁXIMO 02 ANOS DE USO OU 50.000KM, PREFERENCIALMENTE NA COR BRANCA, COM IDENTIFICAÇÃO CONFORME ESPECIFICAÇÕES DA CODEVASF, INCLUSIVE COMBUSTÍVEL, MANUTENÇÃO, SEGURO E IMPOSTOS - CONFORME ESPECIFICAÇÕES","SERV","MÊS",8,{"$f":"VLOOKUP(A16,'CPU-SERV'!A:K,11,0)","v":4264.1499999999996},{"$f":"TRUNC(IF(F16=\"SERV\",I16*(1+$L$6/100),IF(F16=\"SERV DIF\",I16*(1+$L$7/100),IF(F16=\"FORN\",I16*(1+$L$8/100),))),2)","v":5316.11},34113.199999999997,42528.88]
[6,"1.6",78472,"SINAPI","SERVIÇOS TOPOGRÁFICOS PARA PAVIMENTAÇÃO, INCLUSIVE LEVANTAMENTO PLANIALTIMÉTRICO CADASTRAL, GERAÇÃO DE NOTAS DE SERVIÇO, SEÇÕES TRANSVERSAIS E GREIDE, ESTAQUEAMENTO E ACOMPANHAMENTO EXECUTIVO","SERV","M2",14200,{"$f":"VLOOKUP(A17,'CPU-SERV'!A:K,11,0)","v":0.37},{"$f":"TRUNC(IF(F17=\"SERV\",I17*(1+$L$6/100),IF(F17=\"SERV DIF\",I17*(1+$L$7/100),IF(F17=\"FORN\",I17*(1+$L$8/100),))),2)","v":0.46},5254,6532]
["B",2,null,null,"TERRAPLANAGEM E PAVIMENTAÇÃO",{"$nulls":5},{"$f":"SUM(K19:K24)","v":250421.5},{"$f":"SUM(L19:L24)","v":311973.90000000002}]
[7,"2.1",5502140,"SICRO","ESCAVAÇÃO, CARGA E TRANSPORTE DE MATERIAL DE 1ª CATEGORIA - DMT 1.000 A 1.200M, CAMINHO DE SERVIÇO EM REVESTIMENTO PRIMÁRIO","SERV","M3",4260,{"$f":"VLOOKUP(A19,'CPU-SERV'!A:K,11,0)","v":6.89},{"$f":"TRUNC(IF(F19=\"SERV\",I19*(1+$L$6/100),IF(F19=\"SERV DIF\",I19*(1+$L$7/100),IF(F19=\"FORN\",I19*(1+$L$8/100),))),2)","v":8.58},{"$f":"TRUNC(H19*I19,2)","v":29351.4},{"$f":"TRUNC(H19*J19,2)","v":36550.800000000003}]
[9,"2.3",4011209,"SICRO","REGULARIZAÇÃO DO SUBLEITO - 100% PROCTOR INTERMEDIÁRIO","SERV","M2",14200,{"$f":"VLOOKUP(A20,'CPU-SERV'!A:K,11,0)","v":1.55},{"$f":"TRUNC(IF(F20=\"SERV\",I20*(1+$L$6/100),IF(F20=\"SERV DIF\",I20*(1+$L$7/100),IF(F20=\"FORN\",I20*(1+$L$8/100),))),2)","v":1.93},22010,{"$f":"TRUNC(H20*J20,2)","v":27406}]
[10,"2.4",4011219,"SICRO","EXECUÇÃO E COMPACTAÇÃO DE BASE E OU SUB BASE PARA PAVIMENTAÇÃO COM SOLO ESTABILIZADO GRANULOMETRICAMENTE SEM MISTURA COM MATERIAL DE JAZIDA - 100% PROCTOR MODIFICADO","SERV","M3",2130,{"$f":"VLOOKUP(A21,'CPU-SERV'!A:K,11,0)","v":14.79},{"$f":"TRUNC(IF(F21=\"SERV\",I21*(1+$L$6/100),IF(F21=\"SERV DIF\",I21*(1+$L$7/100),IF(F21=\"FORN\",I21*(1+$L$8/100),))),2)","v":18.43},31502.7,39255.9]
[12,"2.5",4011352,"SICRO","IMPRIMAÇÃO COM EMULSÃO ASFÁLTICA (EAI)","SERV","M2",14200,{"$f":"VLOOKUP(A22,'CPU-SERV'!A:K,11,0)","v":0.41},{"$f":"TRUNC(IF(F22=\"SERV\",I22*(1+$L$6/100),IF(F22=\"SERV DIF\",I22*(1+$L$7/100),IF(F22=\"FORN\",I22*(1+$L$8/100),))),2)","v":0.51},5822,7242]
[13,"2.6",4011353,"SICRO","PINTURA DE LIGAÇÃO COM EMULSÃO ASFÁLTICA RR-1C","SERV","M2",11900,{"$f":"VLOOKUP(A23,'CPU-SERV'!A:K,11,0)","v":0.28000000000000003},{"$f":"TRUNC(IF(F23=\"SERV\",I23*(1+$L$6/100),IF(F23=\"SERV DIF\",I23*(1+$L$7/100),IF(F23=\"FORN\",I23*(1+$L$8/100),))),2)","v":0.34},3332,4046]
[14,"2.7",4011463,"SICRO","EXECUÇÃO DE PAVIMENTO COM APLICAÇÃO DE CONCRETO ASFÁLTICO USINADO A QUENTE (CBUQ), CAMADA DE ROLAMENTO - EXCLUSIVE TRANSPORTE","SERV","T",860,{"$f":"VLOOKUP(A24,'CPU-SERV'!A:K,11,0)","v":184.19},{"$f":"TRUNC(IF(F24=\"SERV\",I24*(1+$L$6/100),IF(F24=\"SERV DIF\",I24*(1+$L$7/100),IF(F24=\"FORN\",I24*(1+$L$8/100),))),2)","v":229.62},158403.4,197473.2]
["C",3,null,null,"TRANSPORTE DE MATERIAIS",{"$nulls":5},{"$f":"SUM(K26:K30)","v":168700},{"$f":"SUM(L26:L30)","v":209160}]
[15,"3.1",5915321,"SICRO","TRANSPORTE COM CAMINHÃO BASCULANTE, EM RODOVIA PAVIMENTADA","SERV","TXKM",52000,{"$f":"VLOOKUP(A26,'CPU-SERV'!A:K,11,0)","v":0.66},{"$f":"TRUNC(IF(F26=\"SERV\",I26*(1+$L$6/100),IF(F26=\"SERV DIF\",I26*(1+$L$7/100),IF(F26=\"FORN\",I26*(1+$L$8/100),))),2)","v":0.82},{"$f":"TRUNC(H26*I26,2)","v":34320},{"$f":"TRUNC(H26*J26,2)","v":42640}]
[16,"3.2",5915320,"SICRO","TRANSPORTE COM CAMINHÃO BASCULANTE, RODOVIA EM REVESTIMENTO PRIMÁRIO","SERV","TXKM",90000,{"$f":"VLOOKUP(A27,'CPU-SERV'!A:K,11,0)","v":0.7},{"$f":"TRUNC(IF(F27=\"SERV\",I27*(1+$L$6/100),IF(F27=\"SERV DIF\",I27*(1+$L$7/100),IF(F27=\"FORN\",I27*(1+$L$8/100),))),2)","v":0.87},63000,78300]
[17,"3.3",5914434,"SICRO","TRANSPORTE COM CAMINHÃO CARROCERIA 9T, MATERIAIS DIVERSOS","SERV","TXKM",12000,{"$f":"VLOOKUP(A28,'CPU-SERV'!A:K,11,0)","v":0.79},{"$f":"TRUNC(IF(F28=\"SERV\",I28*(1+$L$6/100),IF(F28=\"SERV DIF\",I28*(1+$L$7/100),IF(F28=\"FORN\",I28*(1+$L$8/100),))),2)","v":0.98},9480,11760]
[18,"3.4",5914612,"SICRO","TRANSPORTE DE MASSA ASFÁLTICA COM CAMINHÃO BASCULANTE COM CAÇAMBA TÉRMICA","SERV","TXKM",72000,{"$f":"VLOOKUP(A29,'CPU-SERV'!A:K,11,0)","v":0.81},{"$f":"TRUNC(IF(F29=\"SERV\",I29*(1+$L$6/100),IF(F29=\"SERV DIF\",I29*(1+$L$7/100),IF(F29=\"FORN\",I29*(1+$L$8/100),))),2)","v":1},58320,72000]
[20,"3.5",5914622,"SICRO","TRANSPORTE COM CAMINHÃO TANQUE DE TRANSPORTE DE MATERIAL ASFÁLTICO DE 30000 L","SERV","TXKM",2000,{"$f":"VLOOKUP(A30,'CPU-SERV'!A:K,11,0)","v":1.79},{"$f":"TRUNC(IF(F30=\"SERV\",I30*(1+$L$6/100),IF(F30=\"SERV DIF\",I30*(1+$L$7/100),IF(F30=\"FORN\",I30*(1+$L$8/100),))),2)","v":2.23},3580,4460]
["E",4,null,null,"DRENAGEM E OBRAS COMPLEMENTARES",{"$nulls":5},{"$f":"SUM(K32:K35)","v":247743.19999999998},{"$f":"SUM(L32:L35)","v":308821.45}]
[21,"4.1",94273,"SINAPI","ASSENTAMENTO DE GUIA (MEIO-FIO) PRÉ-MOLDADO DE CONCRETO - 80X10X30 CM (COMPRIMENTO X BASE SUPERIOR X ALTURA) - USO VIÁRIO","SERV","M",3100,{"$f":"VLOOKUP(A32,'CPU-SERV'!A:K,11,0)","v":50.17},{"$f":"TRUNC(IF(F32=\"SERV\",I32*(1+$L$6/100),IF(F32=\"SERV DIF\",I32*(1+$L$7/100),IF(F32=\"FORN\",I32*(1+$L$8/100),))),2)","v":62.54},{"$f":"TRUNC(H32*I32,2)","v":155527},{"$f":"TRUNC(H32*J32,2)","v":193874}]
[23,"4.2","94287a","SINAPI","EXECUÇÃO DE SARJETA EM CONCRETO USINADO, MOLDADO IN LOCO - 30CM DE BASE X 5CM DE ALTURA","SERV","M",3000,{"$f":"VLOOKUP(A33,'CPU-SERV'!A:K,11,0)","v":23.9},{"$f":"TRUNC(IF(F33=\"SERV\",I33*(1+$L$6/100),IF(F33=\"SERV DIF\",I33*(1+$L$7/100),IF(F33=\"FORN\",I33*(1+$L$8/100),))),2)","v":29.79},71700,89370]
[24,"4.3",2003107,"SICRO","ENTRADA PARA DESCIDA D'ÁGUA, TIPO EDA 03 - AREIA E BRITA COMERCIAIS","SERV","UN.",5,{"$f":"VLOOKUP(A34,'CPU-SERV'!A:K,11,0)","v":180.68},{"$f":"TRUNC(IF(F34=\"SERV\",I34*(1+$L$6/100),IF(F34=\"SERV DIF\",I34*(1+$L$7/100),IF(F34=\"FORN\",I34*(1+$L$8/100),))),2)","v":225.25},{"$f":"TRUNC(H34*I34,2)","v":903.4},{"$f":"TRUNC(H34*J34,2)","v":1126.25}]
[49,"4.5",5213401,"SICRO","PINTURA DE EIXO VIÁRIO SOBRE ASFALTO COM TINTA RETRORREFLETIVA A BASE DE RESINA ACRÍLICA COM MICROESFERAS DE VIDRO, APLICAÇÃO MECÂNICA COM DEMARCADORA AUTOPROPELIDA","SERV","M2",720,{"$f":"VLOOKUP(A35,'CPU-SERV'!A:K,11,0)","v":27.24},{"$f":"TRUNC(IF(F35=\"SERV\",I35*(1+$L$6/100),IF(F35=\"SERV DIF\",I35*(1+$L$7/100),IF(F35=\"FORN\",I35*(1+$L$8/100),))),2)","v":33.96},19612.8,24451.200000000001]
["F",5,null,null,"FORNECIMENTOS - MATERIAL ASFÁLTICO (BDI DIFERENCIADO)",{"$nulls":5},{"$f":"SUM(K37:K42)","v":328674.02999999997},{"$f":"SUM(L37:L42)","v":377974.93999999994}]
["F1","5.1","CPU.5","CODEVASF","AQUISIÇÃO DE EMULSÃO ASFÁLTICA PARA IMPRIMAÇÃO (EAI) - EXCLUSIVE TRANSPORTE","FORN","T",19,{"$f":"VLOOKUP(A37,'CPU-FORNEC'!A:J,9,0)","v":2732.37},{"$f":"TRUNC(IF(F37=\"SERV\",I37*(1+$L$6/100),IF(F37=\"SERV DIF\",I37*(1+$L$7/100),IF(F37=\"FORN\",I37*(1+$L$8/100),))),2)","v":3142.22},{"$f":"TRUNC(H37*I37,2)","v":51915.03},{"$f":"TRUNC(H37*J37,2)","v":59702.18}]
["F2","5.2","CPU.6","CODEVASF","TRANSPORTE DE EMULSÃO ASFÁLTICA PARA IMPRIMAÇÃO (EAI)","SERV DIF","T",19,{"$f":"VLOOKUP(A38,'CPU-FORNEC'!A:J,9,0)","v":341.88},{"$f":"TRUNC(IF(F38=\"SERV\",I38*(1+$L$6/100),IF(F38=\"SERV DIF\",I38*(1+$L$7/100),IF(F38=\"FORN\",I38*(1+$L$8/100),))),2)","v":393.16},6495.72,7470.04]
["F3","5.3","CPU.7","CODEVASF","AQUISIÇÃO DE EMULSAO ASFALTICA CATIONICA RR-1C - EXCLUSIVE TRANSPORTE","FORN","T",5.4,{"$f":"VLOOKUP(A39,'CPU-FORNEC'!A:J,9,0)","v":3375.89},{"$f":"TRUNC(IF(F39=\"SERV\",I39*(1+$L$6/100),IF(F39=\"SERV DIF\",I39*(1+$L$7/100),IF(F39=\"FORN\",I39*(1+$L$8/100),))),2)","v":3882.27},18229.8,20964.25]
["F4","5.4","CPU.8","CODEVASF","TRANSPORTE DE EMULSÃO ASFÁLTICA CATIONICA RR-1C","SERV DIF","T",5.4,{"$f":"VLOOKUP(A40,'CPU-FORNEC'!A:J,9,0)","v":435.8},{"$f":"TRUNC(IF(F40=\"SERV\",I40*(1+$L$6/100),IF(F40=\"SERV DIF\",I40*(1+$L$7/100),IF(F40=\"FORN\",I40*(1+$L$8/100),))),2)","v":501.17},2353.3200000000002,2706.31]
["F5","5.5","CPU.9","CODEVASF","AQUISIÇÃO DE CONCRETO ASFÁLTICO DE PETRÓLEO - CAP 50/70 - EXCLUSIVE TRANSPORTE","FORN","T",48,{"$f":"VLOOKUP(A41,'CPU-FORNEC'!A:J,9,0)","v":4511.6000000000004},{"$f":"TRUNC(IF(F41=\"SERV\",I41*(1+$L$6/100),IF(F41=\"SERV DIF\",I41*(1+$L$7/100),IF(F41=\"FORN\",I41*(1+$L$8/100),))),2)","v":5188.34},216556.79999999999,249040.32]
["F6","5.6","CPU.10","CODEVASF","TRANSPORTE DE CONCRETO ASFÁLTICO DE PETRÓLEO - CAP 50/70","SERV DIF","T",48,{"$f":"VLOOKUP(A42,'CPU-FORNEC'!A:J,9,0)","v":690.07},{"$f":"TRUNC(IF(F42=\"SERV\",I42*(1+$L$6/100),IF(F42=\"SERV DIF\",I42*(1+$L$7/100),IF(F42=\"FORN\",I42*(1+$L$8/100),))),2)","v":793.58},33123.360000000001,38091.839999999997]
[null,"TOTAL GERAL DA OBRA COM BDI ",{"$nulls":8},{"$f":"SUM(K11,K18,K25,K31,K36)","v":1172551.8399999999},{"$f":"SUM(L11,L18,L25,L31,L36)","v":1428594.29}]

{"sheet":"CPU-SERV","index":1,"n_rows":1036,"n_cols":13,"rows_kept":1036,"cut":false,"hidden":false,"merged":[[865,0,904,0],[866,2,866,9],[867,1,868,3],[867,4,867,5],[868,4,868,5],[869,2,869,7],[869,8,869,9],[870,1,871,2],[870,3,871,3],[870,4,870,5],[870,6,870,7],[875,7,875,9],[878,3,878,7],[879,3,879,7],[880,3,880,7],[883,7,883,9],[886,3,886,7],[887,7,887,9],[892,3,892,7],[894,8,894,9],[897,3,897,7],[898,1,899,2],[898,3,899,3],[898,4,899,4],[42,0,84,0],[43,2,43,9],[499,1,500,3],[499,4,499,5],[500,4,500,5],[501,2,501,7],[501,8,501,9],[502,1,503,2],[502,3,503,3],[502,4,502,5],[502,6,502,7],[497,0,549,0],[498,2,498,9],[46,2,46,7],[46,8,46,9],[47,1,48,2],[60,3,60,7],[63,7,63,9],[66,3,66,7],[67,7,67,9],[44,1,45,3],[44,4,44,5],[45,4,45,5],[72,3,72,7],[582,1,583,2],[582,3,583,3],[582,4,583,4],[582,5,582,7],[582,9,583,9],[529,3,529,7],[531,8,531,9],[538,3,538,7],[564,3,564,7],[548,5,548,7],[576,3,576,7],[539,1,540,2],[556,1,557,2],[556,4,556,5],[556,6,556,7],[561,7,561,9],[555,2,555,7],[547,3,547,7],[621,4,622,4],[621,5,621,7],[621,9,622,9],[625,3,625,7],[510,7,510,9],[512,3,512,7],[513,3,513,7],[514,3,514,7],[517,7,517,9],[522,7,522,8],[578,8,578,9],[581,3,581,7],[527,7,527,9],[526,3,526,7],[539,3,540,3],[539,4,540,4],[539,5,539,7],[539,9,540,9],[566,3,566,7],[569,7,569,9],[572,3,572,7],[573,7,573,9],[555,8,555,9],[556,3,557,3],[590,0,627,0],[591,2,591,9],[592,1,593,3],[592,4,592,5],[593,4,593,5],[594,2,594,7],[594,8,594,9],[595,1,596,2],[595,3,596,3],[595,4,595,5],[595,6,595,7],[600,7,600,9],[603,3,603,7],[604,3,604,7],[605,3,605,7],[608,7,608,9],[611,3,611,7],[612,7,612,9],[615,3,615,7],[617,8,617,9],[626,5,626,7],[620,3,620,7],[621,1,622,2],[621,3,622,3],[7,13,7,15],[18,11,18,13],[24,3,24,7],[4,2,4,7],[4,8,4,9],[5,1,6,2],[5,3,6,3],[5,4,5,5],[5,6,5,7],[0,0,40,0],[3,4,3,5],[0,11,0,12],[1,11,1,12],[2,4,2,5],[1,2,1,9],[2,1,3,3],[34,3,35,3],[34,4,35,4],[34,5,34,7],[34,9,35,9],[38,3,38,7],[39,5,39,7],[13,7,13,9],[16,3,16,7],[17,3,17,7],[18,3,18,7],[21,7,21,9],[33,3,33,7],[34,1,35,2],[25,7,25,9],[28,3,28,7],[2,10,2,11],[30,8,30,9],[74,8,74,9],[47,3,48,3],[47,4,47,5],[47,6,47,7],[52,7,52,9],[58,3,58,7],[59,3,59,7],[82,3,82,7],[83,5,83,7],[88,4,88,5],[77,3,77,7],[78,1,79,2],[78,3,79,3],[78,4,79,4],[78,5,78,7],[78,9,79,9],[117,1,118,2],[117,3,118,3],[117,4,118,4],[117,5,117,7],[117,9,118,9],[121,3,121,7],[96,7,96,9],[101,3,101,7],[104,7,104,9],[107,3,107,7],[108,7,108,9],[111,3,111,7],[113,8,113,9],[116,3,116,7],[99,3,99,7],[100,3,100,7],[122,5,122,7],[125,0,164,0],[126,2,126,9],[127,1,128,3],[127,4,127,5],[128,4,128,5],[129,2,129,7],[129,8,129,9],[162,3,162,7],[163,5,163,7],[86,0,123,0],[87,2,87,9],[88,1,89,3],[89,4,89,5],[90,2,90,7],[90,8,90,9],[91,1,92,2],[91,3,92,3],[91,4,91,5],[91,6,91,7],[139,3,139,7],[140,3,140,7],[143,7,143,9],[148,3,148,7],[149,7,149,9],[152,3,152,7],[130,1,131,2],[130,3,131,3],[130,4,130,5],[130,6,130,7],[135,7,135,9],[138,3,138,7],[154,8,154,9],[157,3,157,7],[158,1,159,2],[158,3,159,3],[158,4,159,4],[158,5,158,7],[158,9,159,9],[199,3,199,7],[201,8,201,9],[179,3,179,7],[180,3,180,7],[181,3,181,7],[170,8,170,9],[171,1,172,2],[171,3,172,3],[171,4,171,5],[171,6,171,7],[213,0,252,0],[214,2,214,9],[215,1,216,3],[215,4,215,5],[216,4,216,5],[217,2,217,7],[250,3,250,7],[251,5,251,7],[166,0,211,0],[167,2,167,9],[168,1,169,3],[168,4,168,5],[169,4,169,5],[170,2,170,7],[204,3,204,7],[205,1,206,2],[205,3,206,3],[205,4,206,4],[205,5,205,7],[205,9,206,9],[258,8,258,9],[259,1,260,2],[259,3,260,3],[259,4,259,5],[176,7,176,9],[228,3,228,7],[229,3,229,7],[230,3,230,7],[233,7,233,9],[236,3,236,7],[237,7,237,9],[217,8,217,9],[218,1,219,2],[218,3,219,3],[218,4,218,5],[218,6,218,7],[223,7,223,9],[209,3,209,7],[210,5,210,7],[184,7,184,9],[187,3,187,7],[188,7,188,9],[259,6,259,7],[254,0,291,0],[255,2,255,9],[256,1,257,3],[256,4,256,5],[257,4,257,5],[258,2,258,7],[240,3,240,7],[242,8,242,9],[245,3,245,7],[246,1,247,2],[246,3,247,3],[246,4,247,4],[246,5,246,7],[246,9,247,9],[279,3,279,7],[281,8,281,9],[284,3,284,7],[285,1,286,2],[285,3,286,3],[285,4,286,4],[285,5,285,7],[285,9,286,9],[267,3,267,7],[268,3,268,7],[336,0,377,0],[337,2,337,9],[338,1,339,3],[338,4,338,5],[339,4,339,5],[340,2,340,7],[375,3,375,7],[376,5,376,7],[293,0,334,0],[294,2,294,9],[295,1,296,3],[295,4,295,5],[296,4,296,5],[297,2,297,7],[322,3,322,7],[324,8,324,9],[327,3,327,7],[328,1,329,2],[328,3,329,3],[328,4,329,4],[297,8,297,9],[298,1,299,2],[298,3,299,3],[298,4,298,5],[264,7,264,9],[289,3,289,7],[290,5,290,7],[269,3,269,7],[272,7,272,9],[275,3,275,7],[276,7,276,9],[310,3,310,7],[311,3,311,7],[298,6,298,7],[307,7,307,9],[312,3,312,7],[315,7,315,9],[318,3,318,7],[319,7,319,9],[365,3,365,7],[367,8,367,9],[370,3,370,7],[353,3,353,7],[354,3,354,7],[355,3,355,7],[358,7,358,9],[361,3,361,7],[340,8,340,9],[341,3,342,3],[341,4,341,5],[341,6,341,7],[350,7,350,9],[371,1,372,2],[371,3,372,3],[371,4,372,4],[371,5,371,7],[371,9,372,9],[328,5,328,7],[328,9,329,9],[362,7,362,9],[341,1,342,2],[332,3,332,7],[333,5,333,7],[397,7,397,9],[400,3,400,7],[401,7,401,9],[404,3,404,7],[406,8,406,9],[409,3,409,7],[379,0,416,0],[380,2,380,9],[381,1,382,3],[381,4,381,5],[382,4,382,5],[383,2,383,7],[414,3,414,7],[415,5,415,7],[398,7,398,8],[410,1,411,2],[410,3,411,3],[410,4,411,4],[410,5,410,7],[410,9,411,9],[383,8,383,9],[384,1,385,2],[384,3,385,3],[384,4,384,5],[384,6,384,7],[389,7,389,9],[392,3,392,7],[393,3,393,7],[394,3,394,7],[483,3,483,7],[457,0,495,0],[458,2,458,9],[459,1,460,3],[459,4,459,5],[460,4,460,5],[461,2,461,7],[493,3,493,7],[494,5,494,7],[485,8,485,9],[488,3,488,7],[489,1,490,2],[489,3,490,3],[489,4,490,4],[489,5,489,7],[489,9,490,9],[471,3,471,7],[472,3,472,7],[473,3,473,7],[476,7,476,9],[479,3,479,7],[480,7,480,9],[461,8,461,9],[462,1,463,2],[418,0,455,0],[419,2,419,9],[420,1,421,3],[420,4,420,5],[421,4,421,5],[422,2,422,7],[445,8,445,9],[448,3,448,7],[449,1,450,2],[449,3,450,3],[439,3,439,7],[440,7,440,9],[449,4,450,4],[449,5,449,7],[449,9,450,9],[431,3,431,7],[422,8,422,9],[423,1,424,2],[423,3,424,3],[423,4,423,5],[423,6,423,7],[428,7,428,9],[443,3,443,7],[436,7,436,9],[462,3,463,3],[462,4,462,5],[462,6,462,7],[468,7,468,9],[453,3,453,7],[454,5,454,7],[432,3,432,7],[433,3,433,7],[437,7,437,8],[586,3,586,7],[587,5,587,7],[629,0,666,0],[630,2,630,9],[631,1,632,3],[631,4,631,5],[632,4,632,5],[633,2,633,7],[664,3,664,7],[665,5,665,7],[551,0,588,0],[552,2,552,9],[553,1,554,3],[553,4,553,5],[554,4,554,5],[654,3,654,7],[656,8,656,9],[659,3,659,7],[660,1,661,2],[660,3,661,3],[660,4,661,4],[660,5,660,7],[660,9,661,9],[565,3,565,7],[672,8,672,9],[673,1,674,2],[673,3,674,3],[673,4,673,5],[673,6,673,7],[678,7,678,9],[651,7,651,9],[633,8,633,9],[634,1,635,2],[634,3,635,3],[634,4,634,5],[634,6,634,7],[639,7,639,9],[642,3,642,7],[643,3,643,7],[644,3,644,7],[647,7,647,9],[650,3,650,7],[699,3,700,3],[699,4,700,4],[699,5,699,7],[699,9,700,9],[681,3,681,7],[682,3,682,7],[683,3,683,7],[686,7,686,9],[689,3,689,7],[690,7,690,9],[703,3,703,7],[704,5,704,7],[746,0,783,0],[747,2,747,9],[748,1,749,3],[748,4,748,5],[749,4,749,5],[750,2,750,7],[781,3,781,7],[782,5,782,7],[668,0,705,0],[669,2,669,9],[670,1,671,3],[670,4,670,5],[671,4,671,5],[672,2,672,7],[771,3,771,7],[773,8,773,9],[776,3,776,7],[777,1,778,2],[693,3,693,7],[695,8,695,9],[698,3,698,7],[699,1,700,2],[759,3,759,7],[760,3,760,7],[761,3,761,7],[764,7,764,9],[767,3,767,7],[768,7,768,9],[750,8,750,9],[751,1,752,2],[751,3,752,3],[751,4,751,5],[751,6,751,7],[756,7,756,9],[777,3,778,3],[777,4,778,4],[777,5,777,7],[777,9,778,9],[810,3,810,7],[812,8,812,9],[815,3,815,7],[816,1,817,2],[816,3,817,3],[816,4,817,4],[816,5,816,7],[816,9,817,9],[798,3,798,7],[799,3,799,7],[800,3,800,7],[803,7,803,9],[806,3,806,7],[807,7,807,9],[789,8,789,9],[790,1,791,2],[790,3,791,3],[790,4,790,5],[790,6,790,7],[795,7,795,9],[785,0,822,0],[786,2,786,9],[787,1,788,3],[787,4,787,5],[788,4,788,5],[789,2,789,7],[837,3,837,7],[824,0,863,0],[825,2,825,9],[826,1,827,3],[826,4,826,5],[827,4,827,5],[861,3,861,7],[862,5,862,7],[851,3,851,7],[853,8,853,9],[856,3,856,7],[857,1,858,2],[857,3,858,3],[857,4,858,4],[857,5,857,7],[857,9,858,9],[838,3,838,7],[839,3,839,7],[937,9,938,9],[950,6,950,7],[955,7,955,9],[949,2,949,7],[958,3,958,7],[820,3,820,7],[821,5,821,7],[842,7,842,9],[847,3,847,7],[848,7,848,9],[828,8,828,9],[829,1,830,2],[829,3,830,3],[829,4,829,5],[829,6,829,7],[834,7,834,9],[828,2,828,7],[924,7,924,9],[927,3,927,7],[928,7,928,9],[898,5,898,7],[898,9,899,9],[902,3,902,7],[903,5,903,7],[906,0,943,0],[907,2,907,9],[908,1,909,3],[908,4,908,5],[909,4,909,5],[910,2,910,7],[910,8,910,9],[911,1,912,2],[911,3,912,3],[911,4,911,5],[911,6,911,7],[916,7,916,9],[919,3,919,7],[920,3,920,7],[921,3,921,7],[941,3,941,7],[942,5,942,7],[931,3,931,7],[933,8,933,9],[936,3,936,7],[937,1,938,2],[937,3,938,3],[937,4,938,4],[937,5,937,7],[945,0,989,0],[946,2,946,9],[947,1,948,3],[947,4,947,5],[948,4,948,5],[987,3,987,7],[988,5,988,7],[973,3,973,7],[975,8,975,9],[980,3,980,7],[981,1,982,2],[969,3,969,7],[970,7,970,9],[949,8,949,9],[950,1,951,2],[950,3,951,3],[950,4,950,5],[959,3,959,7],[960,3,960,7],[963,7,963,9],[996,3,997,3],[996,4,996,5],[996,6,996,7],[1001,7,1001,9],[991,0,1035,0],[992,2,992,9],[993,1,994,3],[993,4,993,5],[994,4,994,5],[995,2,995,7],[1033,3,1033,7],[1034,5,1034,7],[738,4,739,4],[738,5,738,7],[738,9,739,9],[742,3,742,7],[1019,3,1019,7],[1021,8,1021,9],[1026,3,1026,7],[1027,1,1028,2],[1027,3,1028,3],[1027,4,1028,4],[1027,5,1027,7],[1027,9,1028,9],[981,3,982,3],[981,4,982,4],[981,5,981,7],[981,9,982,9],[1004,3,1004,7],[1005,3,1005,7],[1006,3,1006,7],[1009,7,1009,9],[1015,3,1015,7],[1016,7,1016,9],[995,8,995,9],[996,1,997,2],[743,5,743,7],[707,0,744,0],[708,2,708,9],[709,1,710,3],[709,4,709,5],[710,4,710,5],[711,2,711,7],[711,8,711,9],[712,1,713,2],[712,3,713,3],[712,4,712,5],[712,6,712,7],[717,7,717,9],[720,3,720,7],[721,3,721,7],[722,3,722,7],[725,7,725,9],[728,3,728,7],[729,7,729,9],[732,3,732,7],[734,8,734,9],[737,3,737,7],[738,1,739,2],[738,3,739,3]]}
[1,"1ª/GRD",{"$nulls":8},{"$f":"J40","v":12629.18},"Minas Gerais"]
[null,"OBRA:","PAVIMENTAÇÃO ASFÁLTICA EM CBUQ DE VIAS EM COMUNIDADES RURAIS (COMUNIDADE MARIA PRETA, COMUNIDADE TIRIRICAL E DISTRITO DE SÃO NORBERTO - ENGENHEIRO NAVARRO / MG)",{"$nulls":8}," Abril/2025 "]
[null,"Custo Unitário de Referência",null,null,"Minas Gerais"]
[{"$nulls":4}," Abril/2025 ",null,null,"Produção da equipe ",0.5,{"$f":"VLOOKUP(A1,ORÇAMENTO!$A$11:$L$43,7,1)","v":"GL"}]
[null,"CPU.1","MOBILIZAÇÃO E DESMOBILIZAÇÃO",{"$nulls":5},"Valores em reais (R$)"]
[null,"A - EQUIPAMENTOS",null,"Quantidade","Utilização",null,"Custo Horário",null,null,"Custo"]
[{"$nulls":4},"Operativa","Improdutiva","Produtivo","Improdutivo",null,"Horário Total"]
[null,"E9687","Caminhão carroceria com capacidade de 5 t - 120 kW",8,0.6,0.4,154.82689999999999,59.719900000000003,null,{"$f":"D8*(E8*G8+F8*H8)","v":934.27279999999996}]
[null,"E9571","Caminhão tanque com capacidade de 10.000 l - 188 kW",2,1,0,332.8408,83.189300000000003,null,{"$f":"D9*(E9*G9+F9*H9)","v":665.6816}]
[null,"E9509","Caminhão tanque distribuidor de asfalto com capacidade de 6.000 l - 7 kW/136 kW",2,1,0,267.51929999999999,74.644499999999994,null,535.03859999999997]
[null,"E9514","Distribuidor de agregados sobre pneus autopropelido - 130 kW",2,1,0,293.41419999999999,107.0603,null,586.82839999999999]
[null,"E9575","Caminhão basculante com caçamba estanque com capacidade de 14 m³ - 210 kW",4,1,0,314.16070000000002,91.266099999999994,null,{"$f":"D12*(E12*G12+F12*H12)","v":1256.6428000000001}]
[{"$nulls":7},"Custo horário total de equipamentos",null,{"$f":"SUM(J8:J12)","v":3978.4641999999999}]
[null,"B - MÃO DE OBRA",null,"Quantidade","Unidade",null,"Custo Horário","Custo Horário Total"]
[null,"P9824","Servente",8,"h",null,21.435400000000001,null,null,{"$f":"D15*G15","v":171.48320000000001}]
[{"$nulls":9},{"$f":"D16*G16","v":0}]
[null,null,null,"Custo horário total de mão de obra",{"$nulls":5},{"$f":"SUM(J15:J16)","v":171.48320000000001}]
[null,null,null,"Custo horário total de execução",{"$nulls":5},{"$f":"J13+J17","v":4149.9474}]
[null,null,null,"Custo unitário de execução",{"$nulls":5},{"$f":"J18/I4","v":8299.8948}]
[{"$nulls":7},"Custo do FIC",null,0]
[{"$nulls":7},"Custo do FIT",null,0]
[null,"C - MATERIAL",null,"Quantidade","Unidade",null,"Preço Unitário","Custo Unitário"]
[null,"-",0,null," - ",null,0,null,null,{"$f":"D23*G23","v":0},null,{"$f":"VLOOKUP(A1,ORÇAMENTO!A$12:L$43,8,FALSE)","v":1},{"$f":"J23*L23","v":0}]
[null,"-",0,null," - ",null,0,null,null,{"$f":"D24*G24","v":0},null,{"$f":"VLOOKUP(A1,ORÇAMENTO!A$12:L$43,8,FALSE)","v":1},{"$f":"J24*L24","v":0}]
[null,null,null,"Custo unitário total de material",{"$nulls":5},{"$f":"SUM(J23:J24)","v":0}]
[null,"D - ATIVIDADES AUXILIARES",null,"Quantidade","Unidade",null,"Custo Unitário","Custo Unitário"]
[null,5914640,"Transporte com cavalo mecânico com semirreboque com capacidade de 32 t - rodovia pavimentada",7595.25,"tkm",null,0.56999999999999995,null,null,{"$f":"D27*G27","v":4329.2924999999996}]
[null,"-",0,0,0,null,0,null,null,{"$f":"D28*G28","v":0}]
[null,null,null,"Custo total de atividades auxiliares",{"$nulls":5},{"$f":"SUM(J27:J28)","v":4329.2924999999996}]
[{"$nulls":7},"Subtotal",null,{"$f":"J19+J25+J29+J20+J21","v":12629.1873}]
[null,"E - TEMPO FIXO",null,"Código","Quantidade","Unidade",null,"Custo Unitário","Custo Unitário"]
[null,"-",0,"-",null,0,null,0,null,{"$f":"ROUNDDOWN(E32*H32,4)","v":0}]
[null,"-",0,"-",null,0,null,0,null,{"$f":"ROUNDDOWN(E33*H33,4)","v":0}]
[null,null,null,"Custo unitário total de tempo fixo",{"$nulls":5},{"$f":"SUM(J32:J33)","v":0}]
[null,"F - MOMENTO DE TRANSPORTE",null,"Quantidade","Unidade","DMT",null,null,null,"Custo Unitário"]
[{"$nulls":5},"LN","RP","P"]
[null,"-",0,null,"tkm"]
[null,"-",0,null,"tkm"]
[null,null,null,"Custo unitário total de transporte"]
[{"$nulls":5},"Custo unitário direto total",null,null,null,{"$f":"TRUNC(J30+J34,2)","v":12629.18}]
[null,"Obs."]
[]
[{"$f":"A1+1","v":2},"1ª/GRD",{"$nulls":8},{"$f":"J84","v":78327.67}]
[null,"OBRA:","PAVIMENTAÇÃO ASFÁLTICA EM CBUQ DE VIAS EM COMUNIDADES RURAIS (COMUNIDADE MARIA PRETA, COMUNIDADE TIRIRICAL E DISTRITO DE SÃO NORBERTO - ENGENHEIRO NAVARRO / MG)"]
[null,"Custo Unitário de Referência",null,null,"Minas Gerais"]
[{"$nulls":4}," Abril/2025 ",null,null,"Produção da equipe ",0.2,{"$f":"VLOOKUP(A43,ORÇAMENTO!$A$11:$L$43,7,1)","v":"GL"}]
[null,"CPU.2","ADMINISTRAÇÃO LOCAL ",{"$nulls":5},"Valores em reais (R$)"]
[null,"A - EQUIPAMENTOS",null,"Quantidade","Utilização",null,"Custo Horário",null,null,"Custo"]
[{"$nulls":4},"Operativa","Improdutiva","Produtivo","Improdutivo",null,"Horário Total"]
[null,"-",0,null,null,null,0,0,null,{"$f":"D50*(E50*G50+F50*H50)","v":0}]
[null,"-",0,null,null,null,0,0,null,{"$f":"D51*(E51*G51+F51*H51)","v":0}]
[{"$nulls":7},"Custo horário total de equipamentos",null,{"$f":"SUM(J50:J51)","v":0}]
[null,"B - MÃO DE OBRA",null,"Quantidade","Unidade",null,"Custo Horário","Custo Horário Total"]
[null,"P9812","Engenheiro",0.19837787996108011,"mês",null,26402.7353,null,null,{"$f":"D54*G54","v":5237.7186539875729}]
[null,"P9875","Encarregado de turma",1,"mês",null,6186.1723000000002,null,null,{"$f":"D55*G55","v":6186.1723000000002}]
[null,"P9876","Técnico de segurança do trabalho",0.25,"mês",null,5978.5158000000001,null,null,1494.62895]
[null,"P9858","Laboratorista",0.25,"mês",null,4843.3442249999998,null,null,1210.83605625]
[null,"P9806","Auxiliar administrativo",0.25,"mês",null,3423.5984249999997,null,null,855.89960624999992]
[null,null,null,"Custo horário total de mão de obra",{"$nulls":5},{"$f":"SUM(J54:J58)","v":14985.255566487573}]
[null,null,null,"Custo horário total de execução",{"$nulls":5},{"$f":"J52+J59","v":14985.255566487573}]
[null,null,null,"Custo unitário de execução",{"$nulls":5},{"$f":"J60/I46","v":74926.27783243786}]
[{"$nulls":7},"Custo do FIC",null,0]
[{"$nulls":7},"Custo do FIT",null,"-"]
[null,"C - MATERIAL",null,"Quantidade","Unidade",null,"Preço Unitário","Custo Unitário"]
[null,"-",0,0," - ",null,0,null,null,{"$f":"D65*G65","v":0}]
[null,"-",0,0," - ",null,0,null,null,0]
[null,null,null,"Custo unitário total de material",{"$nulls":5},{"$f":"SUM(J65:J66)","v":0}]
[null,"D - ATIVIDADES AUXILIARES",null,"Quantidade","Unidade",null,"Custo Unitário","Custo Unitário"]
[null,14250,"Energia Elétrica",360,"kwh",null,1.1399999999999999,null,null,{"$f":"D69*G69","v":410.4}]
[null,44480,"Tarifa A - Água e Esgoto",24,"m³",null,21.57,null,null,{"$f":"D70*G70","v":517.68000000000006}]
[null,5212560,"Placa de advertência para sinalização de obras montada em suporte metálico móvel, lado 1,00 m - utilização de 600 ciclos - fornecimento, 01 implantação e 01 retirada diária",528,"un.dia",null,3.89,null,null,{"$f":"D71*G71","v":2053.92}]
[null,"Cotação","Telefone",6,"mês",null,69.900000000000006,null,null,{"$f":"D72*G72","v":419.40000000000003}]
[null,null,null,"Custo total de atividades auxiliares",{"$nulls":5},{"$f":"SUM(J69:J72)","v":3401.4}]
[{"$nulls":7},"Subtotal",null,{"$f":"J61+J67+J73","v":78327.677832437854}]
[null,"E - TEMPO FIXO",null,"Código","Quantidade","Unidade",null,"Custo Unitário","Custo Unitário"]
[null,"-",0,"-",0,"t",null,0,null,{"$f":"ROUNDDOWN(E76*H76,4)","v":0}]
[null,"-",0,"-",0,"t",null,0,null,{"$f":"ROUNDDOWN(E77*H77,4)","v":0}]
[null,null,null,"Custo unitário total de tempo fixo",{"$nulls":5},{"$f":"SUM(J76:J77)","v":0}]
[null,"F - MOMENTO DE TRANSPORTE",null,"Quantidade","Unidade","DMT",null,null,null,"Custo Unitário"]
[{"$nulls":5},"LN","RP","P"]
[null,"-",0,null,"tkm"]
[null,"-",0,null,"tkm"]
[null,null,null,"Custo unitário total de transporte"]
[{"$nulls":5},"Custo unitário direto total",null,null,null,{"$f":"TRUNC(J74+J78,2)","v":78327.67}]
[null,"Obs."]
[]
[{"$f":"A43+1","v":3},"1ª/GRD",{"$nulls":8},{"$f":"J123","v":14467.74}]
[null,"OBRA:","PAVIMENTAÇÃO ASFÁLTICA EM CBUQ DE VIAS EM COMUNIDADES RURAIS (COMUNIDADE MARIA PRETA, COMUNIDADE TIRIRICAL E DISTRITO DE SÃO NORBERTO - ENGENHEIRO NAVARRO / MG)"]
[null,"Custo Unitário de Referência",null,null,"Minas Gerais"]
[{"$nulls":4}," Abril/2025 ",null,null,"Produção da equipe ",1,{"$f":"VLOOKUP(A87,ORÇAMENTO!$A$11:$L$43,7,1)","v":"GL"}]
[null,"CPU.3","CANTEIRO DE OBRAS ",{"$nulls":5},"Valores em reais (R$)"]
[null,"A - EQUIPAMENTOS",null,"Quantidade","Utilização",null,"Custo Horário",null,null,"Custo"]
[{"$nulls":4},"Operativa","Improdutiva","Produtivo","Improdutivo",null,"Horário Total"]
[null,"-",0,null,null,null,0,0,null,{"$f":"D94*(E94*G94+F94*H94)","v":0}]
[null,"-",0,null,null,null,0,0,null,{"$f":"D95*(E95*G95+F95*H95)","v":0}]
[{"$nulls":7},"Custo horário total de equipamentos",null,{"$f":"SUM(J94:J95)","v":0}]
[null,"B - MÃO DE OBRA",null,"Quantidade","Unidade",null,"Custo Horário","Custo Horário Total"]
[null,"P9824","Servente",8,"h",null,21.435400000000001,null,null,{"$f":"D98*G98","v":171.48320000000001}]
[null,"P9808","Carpinteiro",8,"h",null,26.881399999999999,null,null,{"$f":"D99*G99","v":215.05119999999999}]
[null,null,null,"Custo horário total de mão de obra",{"$nulls":5},{"$f":"SUM(J98:J99)","v":386.53440000000001}]
[null,null,null,"Custo horário total de execução",{"$nulls":5},{"$f":"J96+J100","v":386.53440000000001}]
[null,null,null,"Custo unitário de execução",{"$nulls":5},{"$f":"J101/I90","v":386.53440000000001}]
[{"$nulls":7},"Custo do FIC",null,"-"]
[{"$nulls":7},"Custo do FIT",null,"-"]
[null,"C - MATERIAL",null,"Quantidade","Unidade",null,"Preço Unitário","Custo Unitário"]
[null,"M0053","Tela plástica em polipropileno na cor laranja para tapume - L = 1,2 m",100,"m",null,1.7621,null,null,{"$f":"D106*G106","v":176.21}]
[null,"-",0,0," - ",null,0,null,null,{"$f":"D107*G107","v":0}]
[null,null,null,"Custo unitário total de material",{"$nulls":5},{"$f":"SUM(J106:J107)","v":176.21}]
[null,"D - ATIVIDADES AUXILIARES",null,"Quantidade","Unidade",null,"Custo Unitário","Custo Unitário"]
[null,10775,"Locação de container 2,30 X 6,00 m, alt. 2,50 m, com 1 sanitário, para escritório, completo, sem divisórias internas",6,"mês",null,1030,null,null,{"$f":"D110*G110","v":6180}]
[null,10779,"Locação de container 2,30 X 4,30 m, alt. 2,50 M, p/ sanitário, c/ 5 bacias, 1 lavatório e 4 mictórios",6,"mês",null,1287.5,null,null,{"$f":"D111*G111","v":7725}]
[null,null,null,"Custo total de atividades auxiliares",{"$nulls":5},{"$f":"SUM(J110:J111)","v":13905}]
[{"$nulls":7},"Subtotal",null,{"$f":"J102+J108+J112","v":14467.7444}]
[null,"E - TEMPO FIXO",null,"Código","Quantidade","Unidade",null,"Custo Unitário","Custo Unitário"]
[null,"-",0,"-",0,"t",null,0,null,{"$f":"ROUNDDOWN(E115*H115,4)","v":0}]
[null,"-",0,"-",0,"t",null,0,null,{"$f":"ROUNDDOWN(E116*H116,4)","v":0}]
[null,null,null,"Custo unitário total de tempo fixo",{"$nulls":5},{"$f":"SUM(J115:J116)","v":0}]
[null,"F - MOMENTO DE TRANSPORTE",null,"Quantidade","Unidade","DMT",null,null,null,"Custo Unitário"]
[{"$nulls":5},"LN","RP","P"]
[null,"-",0,0,"tkm"]
[null,"-",0,0,"tkm"]
[null,null,null,"Custo unitário total de transporte"]
[{"$nulls":5},"Custo unitário direto total",null,null,null,{"$f":"TRUNC(J113+J117,2)","v":14467.74}]
[null,"Obs."]
[]
[{"$f":"A87+1","v":4},"1ª/GRD",{"$nulls":8},{"$f":"J164","v":547.64}]
[null,"OBRA:","PAVIMENTAÇÃO ASFÁLTICA EM CBUQ DE VIAS EM COMUNIDADES RURAIS (COMUNIDADE MARIA PRETA, COMUNIDADE TIRIRICAL E DISTRITO DE SÃO NORBERTO - ENGENHEIRO NAVARRO / MG)"]
[null,"Custo Unitário de Referência",null,null,"Minas Gerais"]
[{"$nulls":4}," Abril/2025 ",null,null,"Produção da equipe ",1,{"$f":"VLOOKUP(A126,ORÇAMENTO!$A$11:$L$43,7,1)","v":"M2"}]
[null,103689,"PLACA DE OBRA EM CHAPA DE AÇO GALVANIZADO",{"$nulls":5},"Valores em reais (R$)"]
[null,"A - EQUIPAMENTOS",null,"Quantidade","Utilização",null,"Custo Horário",null,null,"Custo"]
[{"$nulls":4},"Operativa","Improdutiva","Produtivo","Improdutivo",null,"Horário Total"]
[null,"-",0,null,null,null,0,0,null,{"$f":"D133*(E133*G133+F133*H133)","v":0}]
[null,"-",0,null,null,null,0,0,null,{"$f":"D134*(E134*G134+F134*H134)","v":0}]
[{"$nulls":7},"Custo horário total de equipamentos",null,{"$f":"SUM(J133:J134)","v":0}]
[null,"B - MÃO DE OBRA",null,"Quantidade","Unidade",null,"Custo Horário","Custo Horário Total"]
[null,"P9824","Servente",1.1186,"h",null,21.435400000000001,null,null,{"$f":"D137*G137","v":23.977638440000003}]
[null,"P9808","Carpinteiro",0.37290000000000001,"h",null,26.881399999999999,null,null,{"$f":"D138*G138","v":10.02407406}]
[null,null,null,"Custo horário total de mão de obra",{"$nulls":5},{"$f":"SUM(J137:J138)","v":34.001712500000004}]
[null,null,null,"Custo horário total de execução",{"$nulls":5},{"$f":"J135+J139","v":34.001712500000004}]
[null,null,null,"Custo unitário de execução",{"$nulls":5},{"$f":"J140/I129","v":34.001712500000004}]
[{"$nulls":7},"Custo do FIC",null,"-"]
[{"$nulls":7},"Custo do FIT",null,"-"]
[null,"C - MATERIAL",null,"Quantidade","Unidade",null,"Preço Unitário","Custo Unitário"]
[null,"M1358","Sarrafo em madeira de terceira - E = 2,5 cm e L = 5 cm",6.4165999999999999,"m",null,2.0291000000000001,null,null,{"$f":"D145*G145","v":13.01992306}]
[null,"M1205","Prego de ferro",2.4500000000000001E-2,"kg",null,16.771799999999999,null,null,{"$f":"D146*G146","v":0.41090909999999997}]
[null,"M0998","Madeira estrutural de eucalipto",2.2608E-2,"m³",null,2685.3184000000001,null,null,{"$f":"D147*G147","v":60.7096783872}]
[null,4813,"Placa de obra (para construção civil) em chapa galvanizada *N. 22*, adesivada, de *2,4 X 1,2* m (sem postes para fixação)",1,"m²",null,439.5,"(SINAPI)",null,439.5]
[null,null,null,"Custo unitário total de material",{"$nulls":5},{"$f":"SUM(J145:J148)","v":513.64051054719994}]
[null,"D - ATIVIDADES AUXILIARES",null,"Quantidade","Unidade",null,"Custo Unitário","Custo Unitário"]
[null,"-",0,0,0,null,0,null,null,{"$f":"D151*G151","v":0}]
[null,"-",0,0,0,null,0,null,null,{"$f":"D152*G152","v":0}]
[null,null,null,"Custo total de atividades auxiliares",{"$nulls":5},{"$f":"SUM(J151:J152)","v":0}]
[{"$nulls":7},"Subtotal",null,{"$f":"J141+J149+J153","v":547.64222304719999}]
[null,"E - TEMPO FIXO",null,"Código","Quantidade","Unidade",null,"Custo Unitário","Custo Unitário"]
[null,"-",0,"-",0,"t",null,0,null,{"$f":"ROUNDDOWN(E156*H156,4)","v":0}]
[null,"-",0,"-",0,"t",null,0,null,{"$f":"ROUNDDOWN(E157*H157,4)","v":0}]
[null,null,null,"Custo unitário total de tempo fixo",{"$nulls":5},{"$f":"SUM(J156:J157)","v":0}]
[null,"F - MOMENTO DE TRANSPORTE",null,"Quantidade","Unidade","DMT",null,null,null,"Custo Unitário"]
[{"$nulls":5},"LN","RP","P"]
[null,"-",0,0,"tkm"]
[null,"-",0,0,"tkm"]
[null,null,null,"Custo unitário total de transporte"]
[{"$nulls":5},"Custo unitário direto total",null,null,null,{"$f":"TRUNC(J154+J158,2)","v":547.64}]
[null,"Obs."]
[]
[{"$f":"A126+1","v":5},"1ª/GRD",{"$nulls":8},{"$f":"J211","v":4264.1499999999996}]
[null,"OBRA:","PAVIMENTAÇÃO ASFÁLTICA EM CBUQ DE VIAS EM COMUNIDADES RURAIS (COMUNIDADE MARIA PRETA, COMUNIDADE TIRIRICAL E DISTRITO DE SÃO NORBERTO - ENGENHEIRO NAVARRO / MG)"]
[null,"Custo Unitário de Referência",null,null,"Minas Gerais"]
[{"$nulls":4}," Abril/2025 ",null,null,"Produção da equipe ",1,{"$f":"VLOOKUP(A167,ORÇAMENTO!$A$11:$L$43,7,1)","v":"MÊS"}]
[null,"CPU.4","VEÍCULO PARA A FISCALIZAÇÃO, MÁXIMO 02 ANOS DE USO OU 50.000KM, PREFERENCIALMENTE NA COR BRANCA, COM IDENTIFICAÇÃO CONFORME ESPECIFICAÇÕES DA CODEVASF, INCLUSIVE COMBUSTÍVEL, MANUTENÇÃO, SEGURO E IMPOSTOS - CONFORME ESPECIFICAÇÕES",{"$nulls":5},"Valores em reais (R$)"]
[null,"A - EQUIPAMENTOS",null,"Quantidade","Utilização",null,"Custo Horário",null,null,"Custo"]
[{"$nulls":4},"Operativa","Improdutiva","Produtivo","Improdutivo",null,"Horário Total"]
[null,"-",0,null,null,null,0,0,null,{"$f":"D174*(E174*G174+F174*H174)","v":0}]
[null,"-",0,null,null,null,0,0,null,{"$f":"D175*(E175*G175+F175*H175)","v":0}]
[{"$nulls":7},"Custo horário total de equipamentos",null,{"$f":"SUM(J174:J175)","v":0}]
[null,"B - MÃO DE OBRA",null,"Quantidade","Unidade",null,"Custo Horário","Custo Horário Total"]
[null,"-",0,null,0,null,0,null,null,{"$f":"D178*G178","v":0}]
[null,"-",0,null,0,null,0,null,null,{"$f":"D179*G179","v":0}]
[null,null,null,"Custo horário total de mão de obra",{"$nulls":5},{"$f":"SUM(J178:J179)","v":0}]
[null,null,null,"Custo horário total de execução",{"$nulls":5},{"$f":"J176+J180","v":0}]
[null,null,null,"Custo unitário de execução",{"$nulls":5},{"$f":"J181/I170","v":0}]
[{"$nulls":7},"Custo do FIC",null,"-"]
[{"$nulls":7},"Custo do FIT",null,"-"]
[null,"C - MATERIAL",null,"Quantidade","Unidade",null,"Preço Unitário","Custo Unitário"]
[null,"-",0,null," - ",null,0,null,null,{"$f":"D186*G186","v":0}]
[null,"-",0,null," - ",null,0,null,null,{"$f":"D187*G187","v":0}]
[null,null,null,"Custo unitário total de material",{"$nulls":5},{"$f":"SUM(J186:J187)","v":0}]
[null,"D - ATIVIDADES AUXILIARES",null,"Quantidade","Unidade",null,"Custo Unitário","Custo Unitário"]
[null,"-","Depreciação",1,"vb",null,692.66666666666663,null,null,{"$f":"D190*G190","v":692.66666666666663}]
[null,"-","Oportunidade de Capital",1,"vb",null,510.84,null,null,{"$f":"D191*G191","v":510.84}]
[null,"-","Impostos e Licenciamento",1,"vb",null,346.33,null,null,346.33]
[null,"-","Seguro Total",1,"vb",null,281.58,null,null,281.58]
[null,"-","Combustível",1,"vb",null,1287.8599999999999,null,null,1287.8599999999999]
[null,"-","Manutenções Preventivas",1,"vb",null,254.02,null,null,254.02]
[null,"-","Limpeza",1,"vb",null,100,null,null,100]
[null,"-","Pneus",1,"vb",null,115.18,null,null,115.18]
[null,"-","Peças",1,"vb",null,77.22,null,null,77.22]
[null,"-","Manutenção Corretiva (%)",1,"vb",null,598.46,null,null,598.46]
[null,null,null,"Custo total de atividades auxiliares",{"$nulls":5},{"$f":"SUM(J190:J199)","v":4264.1566666666658}]
[{"$nulls":7},"Subtotal",null,{"$f":"J182+J188+J200","v":4264.1566666666658}]
[null,"E - TEMPO FIXO",null,"Código","Quantidade","Unidade",null,"Custo Unitário","Custo Unitário"]
[null,"-",0,"-",0,"t",null,0,null,{"$f":"ROUNDDOWN(E203*H203,4)","v":0}]
[null,"-",0,"-",0,"t",null,0,null,{"$f":"ROUNDDOWN(E204*H204,4)","v":0}]
[null,null,null,"Custo unitário total de tempo fixo",{"$nulls":5},{"$f":"SUM(J203:J204)","v":0}]
[null,"F - MOMENTO DE TRANSPORTE",null,"Quantidade","Unidade","DMT",null,null,null,"Custo Unitário"]
[{"$nulls":5},"LN","RP","P"]
[null,"-",0]
[null,"-",0]
[null,null,null,"Custo unitário total de transporte"]
[{"$nulls":5},"Custo unitário direto total",null,null,null,{"$f":"TRUNC(J201+J205,2)","v":4264.1499999999996}]
[null,"Obs."]
[]
[{"$f":"A167+1","v":6},"1ª/GRD",{"$nulls":8},{"$f":"J252","v":0.37}]
[null,"OBRA:","PAVIMENTAÇÃO ASFÁLTICA EM CBUQ DE VIAS EM COMUNIDADES RURAIS (COMUNIDADE MARIA PRETA, COMUNIDADE TIRIRICAL E DISTRITO DE SÃO NORBERTO - ENGENHEIRO NAVARRO / MG)"]
[null,"Custo Unitário de Referência",null,null,"Minas Gerais"]
[{"$nulls":4}," Abril/2025 ",null,null,"Produção da equipe ",2000,{"$f":"VLOOKUP(A214,ORÇAMENTO!$A$11:$L$43,7,1)","v":"M2"}]
[null,78472,"SERVIÇOS TOPOGRÁFICOS PARA PAVIMENTAÇÃO, INCLUSIVE LEVANTAMENTO PLANIALTIMÉTRICO CADASTRAL, GERAÇÃO DE NOTAS DE SERVIÇO, SEÇÕES TRANSVERSAIS E GREIDE, ESTAQUEAMENTO E ACOMPANHAMENTO EXECUTIVO",{"$nulls":5},"Valores em reais (R$)"]
[null,"A - EQUIPAMENTOS",null,"Quantidade","Utilização",null,"Custo Horário",null,null,"Custo"]
[{"$nulls":4},"Operativa","Improdutiva","Produtivo","Improdutivo",null,"Horário Total"]
[null,92145,"Caminhonete cabine simples com motor 1.6 flex, câmbio manual, potência 101/104 cv, 2 portas",1,0.2,0.8,83.97,0,null,{"$f":"D221*(E221*G221+F221*H221)","v":16.794}]
[null,"-",0,null,null,null,0,0,null,{"$f":"D222*(E222*G222+F222*H222)","v":0}]
[{"$nulls":7},"Custo horário total de equipamentos",null,{"$f":"SUM(J221:J222)","v":16.794}]
[null,"B - MÃO DE OBRA",null,"Quantidade","Unidade",null,"Custo Horário","Custo Horário Total"]
[null,"P9949","Topógrafo",3.5000000000000003E-2,"mês",null,6936.5330000000004,28.902220833333335,null,{"$f":"D225*G225","v":242.77865500000004}]
[null,"P9950","Auxiliar de topografia",3.5000000000000003E-2,"mês",null,6476.4769999999999,23.986951851851853,null,{"$f":"D226*G226","v":226.67669500000002}]
[null,"P9824","Servente",4,"h",null,21.435400000000001,8.9314166666666667E-2,null,{"$f":"D227*G227","v":85.741600000000005}]
[null,"P9848","Desenhista",1.7500000000000002E-2,"mês",null,10596.234399999999,39.24531259259259,null,{"$f":"D228*G228","v":185.434102}]
[null,null,null,"Custo horário total de mão de obra",{"$nulls":5},{"$f":"SUM(J225:J228)","v":740.63105199999995}]
[null,null,null,"Custo horário total de execução",{"$nulls":5},{"$f":"J223+J229","v":757.42505199999994}]
[null,null,null,"Custo unitário de execução",{"$nulls":5},{"$f":"J230/I217","v":0.37871252599999999}]
[{"$nulls":7},"Custo do FIC",null,"-"]
[{"$nulls":7},"Custo do FIT",null,"-"]
[null,"C - MATERIAL",null,"Quantidade","Unidade",null,"Preço Unitário","Custo Unitário"]
[null,"-",0,0," - ",null,0,null,null,{"$f":"D235*G235","v":0}]
[null,"-",0,0," - ",null,0,null,null,0]
[null,null,null,"Custo unitário total de material",{"$nulls":5},{"$f":"SUM(J235:J236)","v":0}]
[null,"D - ATIVIDADES AUXILIARES",null,"Quantidade","Unidade",null,"Custo Unitário","Custo Unitário"]
[null,"-",0,0,0,null,0,null,null,{"$f":"D239*G239","v":0}]
[null,"-",0,0,0,null,0,null,null,{"$f":"D240*G240","v":0}]
[null,null,null,"Custo total de atividades auxiliares",{"$nulls":5},{"$f":"SUM(J239:J240)","v":0}]
[{"$nulls":7},"Subtotal",null,{"$f":"J231+J237+J241","v":0.37871252599999999}]
[null,"E - TEMPO FIXO",null,"Código","Quantidade","Unidade",null,"Custo Unitário","Custo Unitário"]
[null,"-",0,"-",0,"t",null,0,null,{"$f":"ROUNDDOWN(E244*H244,4)","v":0}]
[null,"-",0,"-",0,"t",null,0,null,{"$f":"ROUNDDOWN(E245*H245,4)","v":0}]
[null,null,null,"Custo unitário total de tempo fixo",{"$nulls":5},{"$f":"SUM(J244:J245)","v":0}]
[null,"F - MOMENTO DE TRANSPORTE",null,"Quantidade","Unidade","DMT",null,null,null,"Custo Unitário"]
[{"$nulls":5},"LN","RP","P"]
[null,"-",0,0,"tkm"]
[null,"-",0,0,"tkm"]
[null,null,null,"Custo unitário total de transporte"]
[{"$nulls":5},"Custo unitário direto total",null,null,null,{"$f":"TRUNC(J242+J246,2)","v":0.37}]
[null,"Obs."]
[]
[{"$f":"A214+1","v":7},"1ª/GRD",{"$nulls":8},{"$f":"J291","v":6.89}]
[null,"OBRA:","PAVIMENTAÇÃO ASFÁLTICA EM CBUQ DE VIAS EM COMUNIDADES RURAIS (COMUNIDADE MARIA PRETA, COMUNIDADE TIRIRICAL E DISTRITO DE SÃO NORBERTO - ENGENHEIRO NAVARRO / MG)"]
[null,"Custo Unitário de Referência",null,null,"Minas Gerais"]
[{"$nulls":4}," Abril/2025 ",null,null,"Produção da equipe ",230.19,{"$f":"VLOOKUP(A255,ORÇAMENTO!$A$11:$L$43,7,1)","v":"M3"}]
[null,5502140,"ESCAVAÇÃO, CARGA E TRANSPORTE DE MATERIAL DE 1ª CATEGORIA - DMT 1.000 A 1.200M, CAMINHO DE SERVIÇO EM REVESTIMENTO PRIMÁRIO",{"$nulls":5},"Valores em reais (R$)"]
[null,"A - EQUIPAMENTOS",null,"Quantidade","Utilização",null,"Custo Horário",null,null,"Custo"]
[{"$nulls":4},"Operativa","Improdutiva","Produtivo","Improdutivo",null,"Horário Total"]
[null,"E9667","Caminhão basculante com capacidade de 14 m³ - 210 kW",4,0.97,0.03,313.74529999999999,91.048100000000005,null,{"$f":"D262*(E262*G262+F262*H262)","v":1228.2575360000001}]
[null,"E9515","Escavadeira hidráulica sobre esteiras com caçamba com capacidade de 1,56 m³ - 118 kW",1,1,0,307.78859999999997,139.61009999999999,null,{"$f":"D263*(E263*G263+F263*H263)","v":307.78859999999997}]
[{"$nulls":7},"Custo horário total de equipamentos",null,{"$f":"SUM(J262:J263)","v":1536.0461359999999}]
[null,"B - MÃO DE OBRA",null,"Quantidade","Unidade",null,"Custo Horário","Custo Horário Total"]
[null,"P9824","Servente",1,"h",null,21.435400000000001,null,null,{"$f":"D266*G266","v":21.435400000000001}]
[{"$nulls":9},{"$f":"D267*G267","v":0}]
[null,null,null,"Custo horário total de mão de obra",{"$nulls":5},{"$f":"SUM(J266:J267)","v":21.435400000000001}]
[null,null,null,"Custo horário total de execução",{"$nulls":5},{"$f":"J264+J268","v":1557.481536}]
[null,null,null,"Custo unitário de execução",{"$nulls":5},{"$f":"J269/I258","v":6.7660694904209571}]
[{"$nulls":7},"Custo do FIC",null,0.1313]
[{"$nulls":7},"Custo do FIT",null,0]
[null,"C - MATERIAL",null,"Quantidade","Unidade",null,"Preço Unitário","Custo Unitário"]
[null,"-",0,null," - ",null,0,null,null,{"$f":"D274*G274","v":0}]
[null,"-",0,null," - ",null,0,null,null,{"$f":"D275*G275","v":0}]
[null,null,null,"Custo unitário total de material",{"$nulls":5},{"$f":"SUM(J274:J275)","v":0}]
[null,"D - ATIVIDADES AUXILIARES",null,"Quantidade","Unidade",null,"Custo Unitário","Custo Unitário"]
[null,"-",0,0,0,null,0,null,null,{"$f":"D278*G278","v":0}]
[null,"-",0,0,0,null,0,null,null,{"$f":"D279*G279","v":0}]
[null,null,null,"Custo total de atividades auxiliares",{"$nulls":5},{"$f":"SUM(J278:J279)","v":0}]
[{"$nulls":7},"Subtotal",null,{"$f":"J270+J276+J280+J271+J272","v":6.8973694904209575}]
[null,"E - TEMPO FIXO",null,"Código","Quantidade","Unidade",null,"Custo Unitário","Custo Unitário"]
[null,"-",0,"-",0,"t",null,0,null,{"$f":"ROUNDDOWN(E283*H283,4)","v":0}]
[null,"-",0,"-",0,"t",null,0,null,{"$f":"ROUNDDOWN(E284*H284,4)","v":0}]
[null,null,null,"Custo unitário total de tempo fixo",{"$nulls":5},{"$f":"SUM(J283:J284)","v":0}]
[null,"F - MOMENTO DE TRANSPORTE",null,"Quantidade","Unidade","DMT",null,null,null,"Custo Unitário"]
[{"$nulls":5},"LN","RP","P"]
[null,"-",0,null,"tkm","5914449","5914464","5914479"]
[null,"-",0,null,"tkm","5914449","5914464","5914479"]
[null,null,null,"Custo unitário total de transporte"]
[{"$nulls":5},"Custo unitário direto total",null,null,null,{"$f":"TRUNC(J281+J285,2)","v":6.89}]
[null,"Obs."]
[]
[9,"1ª/GRD",{"$nulls":8},{"$f":"J334","v":1.55}]
[null,"OBRA:","PAVIMENTAÇÃO ASFÁLTICA EM CBUQ DE VIAS EM COMUNIDADES RURAIS (COMUNIDADE MARIA PRETA, COMUNIDADE TIRIRICAL E DISTRITO DE SÃO NORBERTO - ENGENHEIRO NAVARRO / MG)"]
[null,"Custo Unitário de Referência",null,null,"Minas Gerais"]
[{"$nulls":4}," Abril/2025 ",null,null,"Produção da equipe ",672.8,{"$f":"VLOOKUP(A294,ORÇAMENTO!$A$11:$L$43,7,1)","v":"M2"}]
[null,4011209,"REGULARIZAÇÃO DO SUBLEITO - 100% PROCTOR INTERMEDIÁRIO",{"$nulls":5},"Valores em reais (R$)"]
[null,"A - EQUIPAMENTOS",null,"Quantidade","Utilização",null,"Custo Horário",null,null,"Custo"]
[{"$nulls":4},"Operativa","Improdutiva","Produtivo","Improdutivo",null,"Horário Total"]
[null,"E9571","Caminhão tanque com capacidade de 10.000 l - 188 kW",1,0.61,0.39,332.8408,83.189300000000003,null,{"$f":"D301*(E301*G301+F301*H301)","v":235.47671499999998}]
[null,"E9518","Grade de 24 discos rebocável de D = 60 cm (24\")",1,0.41,0.59,4.9446000000000003,3.4432999999999998,null,{"$f":"D302*(E302*G302+F302*H302)","v":4.0588329999999999}]
[null,"E9524","Motoniveladora - 93 kW",1,0.43,0.56999999999999995,283.71199999999999,122.7861,null,191.98423699999998]
[null,"E9762","Rolo compactador de pneus autopropelido de 27 t - 85 kW",1,0.96,0.04,257.48289999999997,125.15349999999999,null,252.18972399999996]
[null,"E9685","Rolo compactador pé de carneiro vibratório autopropelido por pneus de 11,6 t - 82 kW",1,1,0,228.8742,102.6397,null,228.8742]
[null,"E9577","Trator agrícola sobre pneus - 77 kW",1,0.41,0.59,154.65969999999999,55.817599999999999,null,96.342860999999999]
[{"$nulls":7},"Custo horário total de equipamentos",null,{"$f":"SUM(J301:J306)","v":1008.9265699999999}]
[null,"B - MÃO DE OBRA",null,"Quantidade","Unidade",null,"Custo Horário","Custo Horário Total"]
[null,"P9824","Servente",1,"h",null,21.435400000000001,null,null,{"$f":"D309*G309","v":21.435400000000001}]
[null,"-",null,0,0,null,0,null,null,{"$f":"D310*G310","v":0}]
[null,null,null,"Custo horário total de mão de obra",{"$nulls":5},{"$f":"SUM(J309:J310)","v":21.435400000000001}]
[null,null,null,"Custo horário total de execução",{"$nulls":5},{"$f":"J307+J311","v":1030.3619699999999}]
[null,null,null,"Custo unitário de execução",{"$nulls":5},{"$f":"J312/I297","v":1.5314535820451842}]
[{"$nulls":7},"Custo do FIC",null,2.043E-2]
[{"$nulls":7},"Custo do FIT",null,0]
[null,"C - MATERIAL",null,"Quantidade","Unidade",null,"Preço Unitário","Custo Unitário"]
[null,"-",0,null," - ",null,0,null,null,{"$f":"D317*G317","v":0}]
[null,"-",0,null," - ",null,0,null,null,{"$f":"D318*G318","v":0}]
[null,null,null,"Custo unitário total de material",{"$nulls":5},{"$f":"SUM(J317:J318)","v":0}]
[null,"D - ATIVIDADES AUXILIARES",null,"Quantidade","Unidade",null,"Custo Unitário","Custo Unitário"]
[null,"-",0,0,0,null,0,null,null,{"$f":"D321*G321","v":0}]
[null,"-",0,0,0,null,0,null,null,{"$f":"D322*G322","v":0}]
[null,null,null,"Custo total de atividades auxiliares",{"$nulls":5},{"$f":"SUM(J321:J322)","v":0}]
[{"$nulls":7},"Subtotal",null,{"$f":"J313+J319+J323+J314+J315","v":1.5518835820451842}]
[null,"E - TEMPO FIXO",null,"Código","Quantidade","Unidade",null,"Custo Unitário","Custo Unitário"]
[null,"-",0,"-",0,"t",null,0,null,{"$f":"ROUNDDOWN(E326*H326,4)","v":0}]
[null,"-",0,"-",0,"t",null,0,null,{"$f":"ROUNDDOWN(E327*H327,4)","v":0}]
[null,null,null,"Custo unitário total de tempo fixo",{"$nulls":5},{"$f":"SUM(J326:J327)","v":0}]
[null,"F - MOMENTO DE TRANSPORTE",null,"Quantidade","Unidade","DMT",null,null,null,"Custo Unitário"]
[{"$nulls":5},"LN","RP","P"]
[null,"-",0,null,"tkm","5914449","5914464","5914479"]
[null,"-",0,null,"tkm","5914449","5914464","5914479"]
[null,null,null,"Custo unitário total de transporte"]
[{"$nulls":5},"Custo unitário direto total",null,null,null,{"$f":"TRUNC(J324+J328,2)","v":1.55}]
[null,"Obs."]
[]
[{"$f":"A294+1","v":10},"1ª/GRD",{"$nulls":8},{"$f":"J377","v":14.79}]
[null,"OBRA:","PAVIMENTAÇÃO ASFÁLTICA EM CBUQ DE VIAS EM COMUNIDADES RURAIS (COMUNIDADE MARIA PRETA, COMUNIDADE TIRIRICAL E DISTRITO DE SÃO NORBERTO - ENGENHEIRO NAVARRO / MG)"]
[null,"Custo Unitário de Referência",null,null,"Minas Gerais"]
[{"$nulls":4}," Abril/2025 ",null,null,"Produção da equipe ",112.13,{"$f":"VLOOKUP(A337,ORÇAMENTO!$A$11:$L$43,7,1)","v":"M3"}]
[null,4011219,"EXECUÇÃO E COMPACTAÇÃO DE BASE E OU SUB BASE PARA PAVIMENTAÇÃO COM SOLO ESTABILIZADO GRANULOMETRICAMENTE SEM MISTURA COM MATERIAL DE JAZIDA - 100% PROCTOR MODIFICADO",{"$nulls":5},"Valores em reais (R$)"]
[null,"A - EQUIPAMENTOS",null,"Quantidade","Utilização",null,"Custo Horário",null,null,"Custo"]
[{"$nulls":4},"Operativa","Improdutiva","Produtivo","Improdutivo",null,"Horário Total"]
[null,"E9571","Caminhão tanque com capacidade de 10.000 l - 188 kW",1,0.62,0.38,332.8408,83.189300000000003,null,{"$f":"D344*(E344*G344+F344*H344)","v":237.97323}]
[null,"E9518","Grade de 24 discos rebocável de D = 60 cm (24\")",1,0.34,0.65999999999999992,4.9446000000000003,3.4432999999999998,null,{"$f":"D345*(E345*G345+F345*H345)","v":3.9537420000000001}]
[null,"E9524","Motoniveladora - 93 kW",1,0.5,0.5,283.71199999999999,122.7861,null,203.24905000000001]
[null,"E9762","Rolo compactador de pneus autopropelido de 27 t - 85 kW",1,0.96,4.0000000000000036E-2,257.48289999999997,125.15349999999999,null,252.18972399999998]
[null,"E9685","Rolo compactador pé de carneiro vibratório autopropelido por pneus de 11,6 t - 82 kW",1,1,0,228.8742,102.6397,null,228.8742]
[null,"E9577","Trator agrícola sobre pneus - 77 kW",1,0.34,0.65999999999999992,154.65969999999999,55.817599999999999,null,{"$f":"D349*(E349*G349+F349*H349)","v":89.423913999999996}]
[{"$nulls":7},"Custo horário total de equipamentos",null,{"$f":"SUM(J344:J349)","v":1015.6638599999999}]
[null,"B - MÃO DE OBRA",null,"Quantidade","Unidade",null,"Custo Horário","Custo Horário Total"]
[null,"P9824","Servente",1,"h",null,21.435400000000001,null,null,{"$f":"D352*G352","v":21.435400000000001}]
[null,"-",0,0,0,null,0,null,null,{"$f":"D353*G353","v":0}]
[null,null,null,"Custo horário total de mão de obra",{"$nulls":5},{"$f":"SUM(J352:J353)","v":21.435400000000001}]
[null,null,null,"Custo horário total de execução",{"$nulls":5},{"$f":"J350+J354","v":1037.09926}]
[null,null,null,"Custo unitário de execução",{"$nulls":5},{"$f":"J355/I340","v":9.2490792829751189}]
[{"$nulls":7},"Custo do FIC",null,0.189]
[{"$nulls":7},"Custo do FIT",null,0]
[null,"C - MATERIAL",null,"Quantidade","Unidade",null,"Preço Unitário","Custo Unitário"]
[null,"-",0,0.41260000000000002," - ",null,0,null,null,{"$f":"D360*G360","v":0}]
[null,"-",0,null," - ",null,0,null,null,{"$f":"D361*G361","v":0}]
[null,null,null,"Custo unitário total de material",{"$nulls":5},{"$f":"SUM(J360:J361)","v":0}]
[null,"D - ATIVIDADES AUXILIARES",null,"Quantidade","Unidade",null,"Custo Unitário","Custo Unitário"]
[null,4016096,"Escavação e carga de material de jazida com escavadeira hidráulica de 1,56 m³",1.1002700000000001,"m³",null,1.46,null,null,{"$f":"D364*G364","v":1.6063942}]
[null,"-",0,0,0,null,0,null,null,{"$f":"D365*G365","v":0}]
[null,null,null,"Custo total de atividades auxiliares",{"$nulls":5},{"$f":"SUM(J364:J365)","v":1.6063942}]
[{"$nulls":7},"Subtotal",null,{"$f":"J356+J362+J366+J357+J358","v":11.044473482975119}]
[null,"E - TEMPO FIXO",null,"Código","Quantidade","Unidade",null,"Custo Unitário","Custo Unitário"]
[null,4016096,"Escavação e carga de material de jazida com escavadeira hidráulica de 1,56 m³",5914354,2.0630099999999998,"t",null,1.82,null,{"$f":"ROUNDDOWN(E369*H369,4)","v":3.7545999999999999}]
[null,"-",0,"-",null,"t",null,0,null,{"$f":"ROUNDDOWN(E370*H370,4)","v":0}]
[null,null,null,".",{"$nulls":5},{"$f":"SUM(J369:J370)","v":3.7545999999999999}]
[null,"F - MOMENTO DE TRANSPORTE",null,"Quantidade","Unidade","DMT",null,null,null,"Custo Unitário"]
[{"$nulls":5},"LN","RP","P"]
[null,4016096,"Escavação e carga de material de jazida com escavadeira hidráulica de 1,56 m³",2.0630099999999998,"tkm"]
[null,"-",0,0,"tkm"]
[null,null,null,"Custo unitário total de transporte"]
[{"$nulls":5},"Custo unitário direto total",null,null,null,{"$f":"TRUNC(J367+J371,2)","v":14.79}]
[null,"Obs."]
[]
[12,"1ª/GRD",{"$nulls":8},{"$f":"J416","v":0.41}]
[null,"OBRA:","PAVIMENTAÇÃO ASFÁLTICA EM CBUQ DE VIAS EM COMUNIDADES RURAIS (COMUNIDADE MARIA PRETA, COMUNIDADE TIRIRICAL E DISTRITO DE SÃO NORBERTO - ENGENHEIRO NAVARRO / MG)"]
[null,"Custo Unitário de Referência",null,null,"Minas Gerais"]
[{"$nulls":4}," Abril/2025 ",null,null,"Produção da equipe ",1038.46,{"$f":"VLOOKUP(A380,ORÇAMENTO!$A$11:$L$43,7,1)","v":"M2"}]
[null,4011352,"IMPRIMAÇÃO COM EMULSÃO ASFÁLTICA (EAI)",{"$nulls":5},"Valores em reais (R$)"]
[null,"A - EQUIPAMENTOS",null,"Quantidade","Utilização",null,"Custo Horário",null,null,"Custo"]
[{"$nulls":4},"Operativa","Improdutiva","Produtivo","Improdutivo",null,"Horário Total"]
[null,"E9509","Caminhão tanque distribuidor de asfalto com capacidade de 6.000 l - 7 kW/136 kW",1,1,0,267.51929999999999,74.644499999999994,null,{"$f":"D387*(E387*G387+F387*H387)","v":267.51929999999999}]
[null,"E9558","Tanque de estocagem de asfalto com capacidade de 30.000 l",2,1,0,57.98,39.604599999999998,null,{"$f":"D388*(E388*G388+F388*H388)","v":115.96}]
[{"$nulls":7},"Custo horário total de equipamentos",null,{"$f":"SUM(J387:J388)","v":383.47929999999997}]
[null,"B - MÃO DE OBRA",null,"Quantidade","Unidade",null,"Custo Horário","Custo Horário Total"]
[null,"P9824","Servente",2,"h",null,21.435400000000001,null,null,{"$f":"D391*G391","v":42.870800000000003}]
[null,"-",{"$nulls":7},{"$f":"D392*G392","v":0}]
[null,null,null,"Custo horário total de mão de obra",{"$nulls":5},{"$f":"SUM(J391:J392)","v":42.870800000000003}]
[null,null,null,"Custo horário total de execução",{"$nulls":5},{"$f":"J389+J393","v":426.3501}]
[null,null,null,"Custo unitário de execução",{"$nulls":5},{"$f":"J394/I383","v":0.41055996379253895}]
[{"$nulls":7},"Custo do FIC",null,1.4E-3]
[{"$nulls":7},"Custo do FIT",null,0]
[null,"C - MATERIAL",null,"Quantidade","Unidade",null,"Preço Unitário","Custo Unitário"]
[null,"M2092","Emulsão asfáltica para imprimação",1.2999999999999999E-3,"t",null,0,"FORNECIMENTO COM BDI DIFERENCIADO",null,{"$f":"D399*G399","v":0}]
[null,"-",0,0," - ",null,0,null,null,{"$f":"D400*G400","v":0}]
[null,null,null,"Custo unitário total de material",{"$nulls":5},{"$f":"SUM(J399:J400)","v":0}]
[null,"D - ATIVIDADES AUXILIARES",null,"Quantidade","Unidade",null,"Custo Unitário","Custo Unitário"]
[null,"-",0,0,0,null,0,null,null,{"$f":"D403*G403","v":0}]
[null,"-",0,0,0,null,0,null,null,{"$f":"D404*G404","v":0}]
[null,null,null,"Custo total de atividades auxiliares",{"$nulls":5},{"$f":"SUM(J403:J404)","v":0}]
[{"$nulls":7},"Subtotal",null,{"$f":"J395+J401+J405+J396+J397","v":0.41195996379253896}]
[null,"E - TEMPO FIXO",null,"Código","Quantidade","Unidade",null,"Custo Unitário","Custo Unitário"]
[null,"-",0,"-",0,"t",null,0,null,{"$f":"ROUNDDOWN(E408*H408,4)","v":0}]
[null,"-",0,"-",0,"t",null,0,null,{"$f":"ROUNDDOWN(E409*H409,4)","v":0}]
[null,null,null,"Custo unitário total de tempo fixo",{"$nulls":5},{"$f":"SUM(J408:J409)","v":0}]
[null,"F - MOMENTO DE TRANSPORTE",null,"Quantidade","Unidade","DMT",null,null,null,"Custo Unitário"]
[{"$nulls":5},"LN","RP","P"]
[null,"-",0,null,"tkm"]
[null,"-",0,null,"tkm"]
[null,null,null,"Custo unitário total de transporte"]
[{"$nulls":5},"Custo unitário direto total",null,null,null,{"$f":"TRUNC(J406+J410,2)","v":0.41}]
[null,"Obs."]
[]
[{"$f":"A380+1","v":13},"1ª/GRD",{"$nulls":8},{"$f":"J455","v":0.28000000000000003}]
[null,"OBRA:","PAVIMENTAÇÃO ASFÁLTICA EM CBUQ DE VIAS EM COMUNIDADES RURAIS (COMUNIDADE MARIA PRETA, COMUNIDADE TIRIRICAL E DISTRITO DE SÃO NORBERTO - ENGENHEIRO NAVARRO / MG)"]
[null,"Custo Unitário de Referência",null,null,"Minas Gerais"]
[{"$nulls":4}," Abril/2025 ",null,null,"Produção da equipe ",1500,{"$f":"VLOOKUP(A419,ORÇAMENTO!$A$11:$L$43,7,1)","v":"M2"}]
[null,4011353,"PINTURA DE LIGAÇÃO COM EMULSÃO ASFÁLTICA RR-1C",{"$nulls":5},"Valores em reais (R$)"]
[null,"A - EQUIPAMENTOS",null,"Quantidade","Utilização",null,"Custo Horário",null,null,"Custo"]
[{"$nulls":4},"Operativa","Improdutiva","Produtivo","Improdutivo",null,"Horário Total"]
[null,"E9509","Caminhão tanque distribuidor de asfalto com capacidade de 6.000 l - 7 kW/136 kW",1,1,0,267.51929999999999,74.644499999999994,null,{"$f":"D426*(E426*G426+F426*H426)","v":267.51929999999999}]
[null,"E9558","Tanque de estocagem de asfalto com capacidade de 30.000 l",2,1,0,57.98,39.604599999999998,null,{"$f":"D427*(E427*G427+F427*H427)","v":115.96}]
[{"$nulls":7},"Custo horário total de equipamentos",null,{"$f":"SUM(J426:J427)","v":383.47929999999997}]
[null,"B - MÃO DE OBRA",null,"Quantidade","Unidade",null,"Custo Horário","Custo Horário Total"]
[null,"P9824","Servente",2,"h",null,21.435400000000001,null,null,{"$f":"D430*G430","v":42.870800000000003}]
[null,"-",{"$nulls":7},{"$f":"D431*G431","v":0}]
[null,null,null,"Custo horário total de mão de obra",{"$nulls":5},{"$f":"SUM(J430:J431)","v":42.870800000000003}]
[null,null,null,"Custo horário total de execução",{"$nulls":5},{"$f":"J428+J432","v":426.3501}]
[null,null,null,"Custo unitário de execução",{"$nulls":5},{"$f":"J433/I422","v":0.28423340000000002}]
[{"$nulls":7},"Custo do FIC",null,8.9999999999999998E-4]
[{"$nulls":7},"Custo do FIT",null,0]
[null,"C - MATERIAL",null,"Quantidade","Unidade",null,"Preço Unitário","Custo Unitário"]
[null,"M1946","Emulsão asfáltica - RR-1C",4.4999999999999999E-4,"t",null,0,"FORNECIMENTO COM BDI DIFERENCIADO",null,{"$f":"D438*G438","v":0}]
[null,"-",0,null," - ",null,0,null,null,{"$f":"D439*G439","v":0}]
[null,null,null,"Custo unitário total de material",{"$nulls":5},{"$f":"SUM(J438:J439)","v":0}]
[null,"D - ATIVIDADES AUXILIARES",null,"Quantidade","Unidade",null,"Custo Unitário","Custo Unitário"]
[null,"-",0,0,0,null,0,null,null,{"$f":"D442*G442","v":0}]
[null,"-",0,0,0,null,0,null,null,{"$f":"D443*G443","v":0}]
[null,null,null,"Custo total de atividades auxiliares",{"$nulls":5},{"$f":"SUM(J442:J443)","v":0}]
[{"$nulls":7},"Subtotal",null,{"$f":"J434+J440+J444+J435+J436","v":0.28513340000000004}]
[null,"E - TEMPO FIXO",null,"Código","Quantidade","Unidade",null,"Custo Unitário","Custo Unitário"]
[null,"-",0,"-",0,"t",null,0,null,{"$f":"ROUNDDOWN(E447*H447,4)","v":0}]
[null,"-",0,"-",0,"t",null,0,null,{"$f":"ROUNDDOWN(E448*H448,4)","v":0}]
[null,null,null,"Custo unitário total de tempo fixo",{"$nulls":5},{"$f":"SUM(J447:J448)","v":0}]
[null,"F - MOMENTO DE TRANSPORTE",null,"Quantidade","Unidade","DMT",null,null,null,"Custo Unitário"]
[{"$nulls":5},"LN","RP","P"]
[null,"-",0,null,"tkm"]
[null,"-",0,null,"tkm"]
[null,null,null,"Custo unitário total de transporte"]
[{"$nulls":5},"Custo unitário direto total",null,null,null,{"$f":"TRUNC(J445+J449,2)","v":0.28000000000000003}]
[null,"Obs."]
[]
[{"$f":"A419+1","v":14},"1ª/GRD",{"$nulls":8},{"$f":"J495","v":184.19}]
[null,"OBRA:","PAVIMENTAÇÃO ASFÁLTICA EM CBUQ DE VIAS EM COMUNIDADES RURAIS (COMUNIDADE MARIA PRETA, COMUNIDADE TIRIRICAL E DISTRITO DE SÃO NORBERTO - ENGENHEIRO NAVARRO / MG)"]
[null,"Custo Unitário de Referência",null,null,"Minas Gerais"]
[{"$nulls":4}," Abril/2025 ",null,null,"Produção da equipe ",99.6,{"$f":"VLOOKUP(A458,ORÇAMENTO!$A$11:$L$43,7,1)","v":"T"}]
[null,4011463,"EXECUÇÃO DE PAVIMENTO COM APLICAÇÃO DE CONCRETO ASFÁLTICO USINADO A QUENTE (CBUQ), CAMADA DE ROLAMENTO - EXCLUSIVE TRANSPORTE",{"$nulls":5},"Valores em reais (R$)"]
[null,"A - EQUIPAMENTOS",null,"Quantidade","Utilização",null,"Custo Horário",null,null,"Custo"]
[{"$nulls":4},"Operativa","Improdutiva","Produtivo","Improdutivo",null,"Horário Total"]
[null,"E9762","Rolo compactador de pneus autopropelido de 27 t - 85 kW",1,0.71,0.28999999999999998,257.48289999999997,125.15349999999999,null,{"$f":"D465*(E465*G465+F465*H465)","v":219.10737399999996}]
[null,"E9681","Rolo compactador liso tandem vibratório autopropelido de 10,4 t - 82 kW",1,0.82,0.18,299.81799999999998,113.9695,null,{"$f":"D466*(E466*G466+F466*H466)","v":266.36526999999995}]
[null,"E9545","Vibroacabadora de asfalto sobre esteiras - 97 kW",1,1,0,365.24360000000001,156.6223,null,{"$f":"D467*(E467*G467+F467*H467)","v":365.24360000000001}]
[{"$nulls":7},"Custo horário total de equipamentos",null,{"$f":"SUM(J465:J467)","v":850.71624399999996}]
[null,"B - MÃO DE OBRA",null,"Quantidade","Unidade",null,"Custo Horário","Custo Horário Total"]
[null,"P9824","Servente",8,"h",null,21.435400000000001,null,null,{"$f":"D470*G470","v":171.48320000000001}]
[null,"-",0,null,0,null,0,null,null,{"$f":"D471*G471","v":0}]
[null,null,null,"Custo horário total de mão de obra",{"$nulls":5},{"$f":"SUM(J470:J471)","v":171.48320000000001}]
[null,null,null,"Custo horário total de execução",{"$nulls":5},{"$f":"J468+J472","v":1022.199444}]
[null,null,null,"Custo unitário de execução",{"$nulls":5},{"$f":"J473/I461","v":10.263046626506025}]
[{"$nulls":7},"Custo do FIC",null,3.3999999999999998E-3]
[{"$nulls":7},"Custo do FIT",null,0]
[null,"C - MATERIAL",null,"Quantidade","Unidade",null,"Preço Unitário","Custo Unitário"]
[null,"-",0,null," - ",null,0,null,null,{"$f":"D478*G478","v":0}]
[null,"-",0,null," - ",null,0,null,null,{"$f":"D479*G479","v":0}]
[null,null,null,"Custo unitário total de material",{"$nulls":5},{"$f":"SUM(J478:J479)","v":0}]
[null,"D - ATIVIDADES AUXILIARES",null,"Quantidade","Unidade",null,"Custo Unitário","Custo Unitário"]
[null,6416078,"Usinagem de concreto asfáltico - faixa C-12,5 - areia e brita comerciais",1,"t",null,166.23513910216869,null,null,{"$f":"D482*G482","v":166.23513910216869}]
[null,"-",0,0,0,null,0,null,null,{"$f":"D483*G483","v":0}]
[null,null,null,"Custo total de atividades auxiliares",{"$nulls":5},{"$f":"SUM(J482:J483)","v":166.23513910216869}]
[{"$nulls":7},"Subtotal",null,{"$f":"J474+J480+J484+J475+J476","v":176.50158572867471}]
[null,"E - TEMPO FIXO",null,"Código","Quantidade","Unidade",null,"Custo Unitário","Custo Unitário"]
[null,6416078,"Usinagem de concreto asfáltico - faixa C-12,5 - areia e brita comerciais",5914649,1,"t",null,7.69,null,{"$f":"ROUNDDOWN(E487*H487,4)","v":7.69}]
[null,"-",0,"-",0,"t",null,0,null,{"$f":"ROUNDDOWN(E488*H488,4)","v":0}]
[null,null,null,"Custo unitário total de tempo fixo",{"$nulls":5},{"$f":"SUM(J487:J488)","v":7.69}]
[null,"F - MOMENTO DE TRANSPORTE",null,"Quantidade","Unidade","DMT",null,null,null,"Custo Unitário"]
[{"$nulls":5},"LN","RP","P"]
[null,6416078,"Usinagem de concreto asfáltico - faixa C-12,5 - areia e brita comerciais",1,"tkm"]
[null,"-",0,0,"tkm"]
[null,null,null,"Custo unitário total de transporte"]
[{"$nulls":5},"Custo unitário direto total",null,null,null,{"$f":"TRUNC(J485+J489,2)","v":184.19}]
[null,"Obs."]
[]
[null,"1ª/GRD",{"$nulls":8},{"$f":"J549","v":166.23513910216869}]
[null,"OBRA:","PAVIMENTAÇÃO ASFÁLTICA EM CBUQ DE VIAS EM COMUNIDADES RURAIS (COMUNIDADE MARIA PRETA, COMUNIDADE TIRIRICAL E DISTRITO DE SÃO NORBERTO - ENGENHEIRO NAVARRO / MG)"]
[null,"Custo Unitário de Referência - Auxiliar",null,null,"Minas Gerais"]
[{"$nulls":4}," Abril/2025 ",null,null,"Produção da equipe ",99.6,"t"]
[null,6416078,"Usinagem de concreto asfáltico - faixa C - areia e brita comerciais",{"$nulls":5},"Valores em reais (R$)"]
[null,"A - EQUIPAMENTOS",null,"Quantidade","Utilização",null,"Custo Horário",null,null,"Custo"]
[{"$nulls":4},"Operativa","Improdutiva","Produtivo","Improdutivo",null,"Horário Total"]
[null,"E9559","Aquecedor de fluido térmico - 12 kW",1,1,0,76.738399999999999,44.1357,null,{"$f":"D505*(E505*G505+F505*H505)","v":76.738399999999999}]
[null,"E9584","Carregadeira de pneus com capacidade de 1,72 m³ - 113 kW",1,0.86,0.14000000000000001,207.10550000000001,103.1602,null,{"$f":"D506*(E506*G506+F506*H506)","v":192.553158}]
[null,"E9021","Grupo gerador - 456 kVA",1,1,0,423.6705,22.1999,null,423.6705]
[null,"E9558","Tanque de estocagem de asfalto com capacidade de 30.000 l",2,1,0,57.98,39.604599999999998,null,115.96]
[null,"E9689","Usina de asfalto a quente gravimétrica com capacidade de 100/140 t/h - 260 kW",1,1,0,1240.8839,658.63800000000003,null,{"$f":"D509*(E509*G509+F509*H509)","v":1240.8839}]
[{"$nulls":7},"Custo horário total de equipamentos",null,{"$f":"SUM(J505:J509)","v":2049.8059579999999}]
[null,"B - MÃO DE OBRA",null,"Quantidade","Unidade",null,"Custo Horário","Custo Horário Total"]
[null,"P9824","Servente",4,"h",null,21.435400000000001,null,null,{"$f":"D512*G512","v":85.741600000000005}]
[null,null,null,"Custo horário total de mão de obra",{"$nulls":5},{"$f":"SUM(J512:J512)","v":85.741600000000005}]
[null,null,null,"Custo horário total de execução",{"$nulls":5},{"$f":"J510+J513","v":2135.5475579999998}]
[null,null,null,"Custo unitário de execução",{"$nulls":5},{"$f":"J514/I501","v":21.441240542168675}]
[{"$nulls":7},"Custo do FIC",null,0]
[{"$nulls":7},"Custo do FIT",null,0]
[null,"C - MATERIAL",null,"Quantidade","Unidade",null,"Preço Unitário","Custo Unitário"]
[null,"M0028","Areia média",2.7009999999999999E-2,"m³",null,145.6,null,null,{"$f":"D519*G519","v":3.9326559999999997}]
[null,"M0005","Brita 0",9.0029999999999999E-2,"m³",null,152.6,null,null,{"$f":"D520*G520","v":13.738577999999999}]
[null,"M0191","Brita 1",3.2149999999999998E-2,"m³",null,145.6,null,null,4.6810399999999994]
[null,"M0344","Cal hidratada - a granel",14.4636,"kg",null,0.64459999999999995,null,null,9.3232365599999998]
[null,"M1943","Cimento asfáltico de petróleo - CAP 50/70",5.5449999999999999E-2,"t",null,0,"FORNECIMENTO COM BDI DIFERENCIADO",null,0]
[null,"M1941","Óleo tipo A1",8,"l",null,5.1599000000000004,null,null,41.279200000000003]
[null,"M1103","Pedrisco",0.1479,"m³",null,152.6,null,null,22.56954]
[null,"M1135","Pó de pedra",0.33631,"m³",null,140.80000000000001,null,null,47.352448000000003]
[null,null,null,"Custo unitário total de material",{"$nulls":5},{"$f":"SUM(J519:J526)","v":142.87669855999999}]
[null,"D - ATIVIDADES AUXILIARES",null,"Quantidade","Unidade",null,"Custo Unitário","Custo Unitário"]
[null,"-",0,0,0,null,0,null,null,{"$f":"D529*G529","v":0}]
[null,null,null,"Custo total de atividades auxiliares",{"$nulls":5},{"$f":"SUM(J529:J529)","v":0}]
[{"$nulls":7},"Subtotal",null,{"$f":"J515+J527+J530+J516+J517","v":164.31793910216868}]
[null,"E - TEMPO FIXO",null,"Código","Quantidade","Unidade",null,"Custo Unitário","Custo Unitário"]
[null,"M0028","Areia média",5914647,4.052E-2,"t",null,1.75,null,{"$f":"ROUNDDOWN(E533*H533,4)","v":7.0900000000000005E-2}]
[null,"M0005","Brita 0",5914647,0.13505,"t",null,1.75,null,0.23630000000000001]
[null,"M0191","Brita 1",5914647,4.8230000000000002E-2,"t",null,1.75,null,8.4400000000000003E-2]
[null,"M0344","Cal hidratada - a granel",5914363,1.4460000000000001E-2,"t",null,17.61,null,0.25459999999999999]
[null,"M1103","Pedrisco",5914647,0.22184999999999999,"t",null,1.75,null,{"$f":"ROUNDDOWN(E537*H537,4)","v":0.38819999999999999}]
[null,"M1135","Pó de pedra",5914647,0.50446999999999997,"t",null,1.75,null,{"$f":"ROUNDDOWN(E538*H538,4)","v":0.88280000000000003}]
[null,null,null,"Custo unitário total de tempo fixo",{"$nulls":5},{"$f":"SUM(J533:J538)","v":1.9172000000000002}]
[null,"F - MOMENTO DE TRANSPORTE",null,"Quantidade","Unidade","DMT",null,null,null,"Custo Unitário"]
[{"$nulls":5},"LN","RP","P"]
[null,"M0028","Areia média",4.052E-2,"tkm"]
[null,"M0005","Brita 0",0.13505,"tkm"]
[null,"M0191","Brita 1",4.8230000000000002E-2,"tkm"]
[null,"M0344","Cal hidratada - a granel",1.4460000000000001E-2,"tkm"]
[null,"M1103","Pedrisco",0.22184999999999999,"tkm"]
[null,"M1135","Pó de pedra",0.50446999999999997,"tkm"]
[null,null,null,"Custo unitário total de transporte"]
[{"$nulls":5},"Custo unitário direto total",null,null,null,{"$f":"J531+J539","v":166.23513910216869}]
[null,"Obs."]
[]
[{"$f":"A458+1","v":15},"1ª/GRD",{"$nulls":8},{"$f":"J588","v":0.66}]
[null,"OBRA:","PAVIMENTAÇÃO ASFÁLTICA EM CBUQ DE VIAS EM COMUNIDADES RURAIS (COMUNIDADE MARIA PRETA, COMUNIDADE TIRIRICAL E DISTRITO DE SÃO NORBERTO - ENGENHEIRO NAVARRO / MG)"]
[null,"Custo Unitário de Referência",null,null,"Minas Gerais"]
[{"$nulls":4}," Abril/2025 ",null,null,"Produção da equipe ",470.61,{"$f":"VLOOKUP(A552,ORÇAMENTO!$A$11:$L$43,7,1)","v":"TXKM"}]
[null,5915321,"TRANSPORTE COM CAMINHÃO BASCULANTE, EM RODOVIA PAVIMENTADA",{"$nulls":5},"Valores em reais (R$)"]
[null,"A - EQUIPAMENTOS",null,"Quantidade","Utilização",null,"Custo Horário",null,null,"Custo"]
[{"$nulls":4},"Operativa","Improdutiva","Produtivo","Improdutivo",null,"Horário Total"]
[null,"E9667","Caminhão basculante com capacidade de 14 m³ - 210 kW",1,1,0,313.74529999999999,91.048100000000005,null,{"$f":"D559*(E559*G559+F559*H559)","v":313.74529999999999}]
[null,"-",0,null,null,null,0,0,null,{"$f":"D560*(E560*G560+F560*H560)","v":0}]
[{"$nulls":7},"Custo horário total de equipamentos",null,{"$f":"SUM(J559:J560)","v":313.74529999999999}]
[null,"B - MÃO DE OBRA",null,"Quantidade","Unidade",null,"Custo Horário","Custo Horário Total"]
[null,"-",0,null,0,null,0,null,null,{"$f":"D563*G563","v":0}]
[null,"-",0,null,0,null,0,null,null,{"$f":"D564*G564","v":0}]
[null,null,null,"Custo horário total de mão de obra",{"$nulls":5},{"$f":"SUM(J563:J564)","v":0}]
[null,null,null,"Custo horário total de execução",{"$nulls":5},{"$f":"J561+J565","v":313.74529999999999}]
[null,null,null,"Custo unitário de execução",{"$nulls":5},{"$f":"J566/I555","v":0.66667792864580011}]
[{"$nulls":7},"Custo do FIC",null,0]
[{"$nulls":7},"Custo do FIT",null,0]
[null,"C - MATERIAL",null,"Quantidade","Unidade",null,"Preço Unitário","Custo Unitário"]
[null,"-",0,0," - ",null,0,null,null,{"$f":"D571*G571","v":0}]
[null,"-",0,0," - ",null,0,null,null,{"$f":"D572*G572","v":0}]
[null,null,null,"Custo unitário total de material",{"$nulls":5},{"$f":"SUM(J571:J572)","v":0}]
[null,"D - ATIVIDADES AUXILIARES",null,"Quantidade","Unidade",null,"Custo Unitário","Custo Unitário"]
[null,"-",0,0,0,null,0,null,null,{"$f":"D575*G575","v":0}]
[null,"-",0,0,0,null,0,null,null,{"$f":"D576*G576","v":0}]
[null,null,null,"Custo total de atividades auxiliares",{"$nulls":5},{"$f":"SUM(J575:J576)","v":0}]
[{"$nulls":7},"Subtotal",null,{"$f":"J567+J573+J577+J568+J569","v":0.66667792864580011}]
[null,"E - TEMPO FIXO",null,"Código","Quantidade","Unidade",null,"Custo Unitário","Custo Unitário"]
[null,"-",0,"-",0,"t",null,0,null,{"$f":"ROUNDDOWN(E580*H580,4)","v":0}]
[null,"-",0,"-",0,"t",null,0,null,{"$f":"ROUNDDOWN(E581*H581,4)","v":0}]
[null,null,null,"Custo unitário total de tempo fixo",{"$nulls":5},{"$f":"SUM(J580:J581)","v":0}]
[null,"F - MOMENTO DE TRANSPORTE",null,"Quantidade","Unidade","DMT",null,null,null,"Custo Unitário"]
[{"$nulls":5},"LN","RP","P"]
[null,"-",0,0,"tkm"]
[null,"-",0,0,"tkm"]
[null,null,null,"Custo unitário total de transporte"]
[{"$nulls":5},"Custo unitário direto total",null,null,null,{"$f":"TRUNC(J578+J582,2)","v":0.66}]
[null,"Obs."]
[]
[16,"1ª/GRD",{"$nulls":8},{"$f":"J627","v":0.7}]
[null,"OBRA:","PAVIMENTAÇÃO ASFÁLTICA EM CBUQ DE VIAS EM COMUNIDADES RURAIS (COMUNIDADE MARIA PRETA, COMUNIDADE TIRIRICAL E DISTRITO DE SÃO NORBERTO - ENGENHEIRO NAVARRO / MG)"]
[null,"Custo Unitário de Referência",null,null,"Minas Gerais"]
[{"$nulls":4}," Abril/2025 ",null,null,"Produção da equipe ",453.75,{"$f":"VLOOKUP(A591,ORÇAMENTO!$A$11:$L$43,7,1)","v":"TXKM"}]
[null,5915320,"TRANSPORTE COM CAMINHÃO BASCULANTE, RODOVIA EM REVESTIMENTO PRIMÁRIO",{"$nulls":5},"Valores em reais (R$)"]
[null,"A - EQUIPAMENTOS",null,"Quantidade","Utilização",null,"Custo Horário",null,null,"Custo"]
[{"$nulls":4},"Operativa","Improdutiva","Produtivo","Improdutivo",null,"Horário Total"]
[null,"E9667","Caminhão basculante com capacidade de 14 m³ - 210 kW",1,1,0,313.74529999999999,91.048100000000005,null,{"$f":"D598*(E598*G598+F598*H598)","v":313.74529999999999}]
[null,"-",0,null,null,null,0,0,null,{"$f":"D599*(E599*G599+F599*H599)","v":0}]
[{"$nulls":7},"Custo horário total de equipamentos",null,{"$f":"SUM(J598:J599)","v":313.74529999999999}]
[null,"B - MÃO DE OBRA",null,"Quantidade","Unidade",null,"Custo Horário","Custo Horário Total"]
[null,"-",0,null,0,null,0,null,null,{"$f":"D602*G602","v":0}]
[null,"-",0,null,0,null,0,null,null,{"$f":"D603*G603","v":0}]
[null,null,null,"Custo horário total de mão de obra",{"$nulls":5},{"$f":"SUM(J602:J603)","v":0}]
[null,null,null,"Custo horário total de execução",{"$nulls":5},{"$f":"J600+J604","v":313.74529999999999}]
[null,null,null,"Custo unitário de execução",{"$nulls":5},{"$f":"J605/I594","v":0.69144969696969694}]
[{"$nulls":7},"Custo do FIC",null,1.4E-2]
[{"$nulls":7},"Custo do FIT",null,0]
[null,"C - MATERIAL",null,"Quantidade","Unidade",null,"Preço Unitário","Custo Unitário"]
[null,"-",0,0," - ",null,0,null,null,{"$f":"D610*G610","v":0}]
[null,"-",0,0," - ",null,0,null,null,{"$f":"D611*G611","v":0}]
[null,null,null,"Custo unitário total de material",{"$nulls":5},{"$f":"SUM(J610:J611)","v":0}]
[null,"D - ATIVIDADES AUXILIARES",null,"Quantidade","Unidade",null,"Custo Unitário","Custo Unitário"]
[null,"-",0,0,0,null,0,null,null,{"$f":"D614*G614","v":0}]
[null,"-",0,0,0,null,0,null,null,{"$f":"D615*G615","v":0}]
[null,null,null,"Custo total de atividades auxiliares",{"$nulls":5},{"$f":"SUM(J614:J615)","v":0}]
[{"$nulls":7},"Subtotal",null,{"$f":"J606+J612+J616+J607+J608","v":0.70544969696969695}]
[null,"E - TEMPO FIXO",null,"Código","Quantidade","Unidade",null,"Custo Unitário","Custo Unitário"]
[null,"-",0,"-",0,"t",null,0,null,{"$f":"ROUNDDOWN(E619*H619,4)","v":0}]
[null,"-",0,"-",0,"t",null,0,null,{"$f":"ROUNDDOWN(E620*H620,4)","v":0}]
[null,null,null,"Custo unitário total de tempo fixo",{"$nulls":5},{"$f":"SUM(J619:J620)","v":0}]
[null,"F - MOMENTO DE TRANSPORTE",null,"Quantidade","Unidade","DMT",null,null,null,"Custo Unitário"]
[{"$nulls":5},"LN","RP","P"]
[null,"-",0,0,"tkm"]
[null,"-",0,0,"tkm"]
[null,null,null,"Custo unitário total de transporte"]
[{"$nulls":5},"Custo unitário direto total",null,null,null,{"$f":"TRUNC(J617+J621,2)","v":0.7}]
[null,"Obs."]
[]
[{"$f":"A591+1","v":17},"1ª/GRD",{"$nulls":8},{"$f":"J666","v":0.79}]
[null,"OBRA:","PAVIMENTAÇÃO ASFÁLTICA EM CBUQ DE VIAS EM COMUNIDADES RURAIS (COMUNIDADE MARIA PRETA, COMUNIDADE TIRIRICAL E DISTRITO DE SÃO NORBERTO - ENGENHEIRO NAVARRO / MG)"]
[null,"Custo Unitário de Referência",null,null,"Minas Gerais"]
[{"$nulls":4}," Abril/2025 ",null,null,"Produção da equipe ",231.3,{"$f":"VLOOKUP(A630,ORÇAMENTO!$A$11:$L$43,7,1)","v":"TXKM"}]
[null,5914434,"TRANSPORTE COM CAMINHÃO CARROCERIA 9T, MATERIAIS DIVERSOS",{"$nulls":5},"Valores em reais (R$)"]
[null,"A - EQUIPAMENTOS",null,"Quantidade","Utilização",null,"Custo Horário",null,null,"Custo"]
[{"$nulls":4},"Operativa","Improdutiva","Produtivo","Improdutivo",null,"Horário Total"]
[null,"E9508","Caminhão carroceria com capacidade de 9 t - 136 kW",1,1,0,183.48670000000001,69.869600000000005,null,{"$f":"D637*(E637*G637+F637*H637)","v":183.48670000000001}]
[null,"-",0,null,null,null,0,0,null,{"$f":"D638*(E638*G638+F638*H638)","v":0}]
[{"$nulls":7},"Custo horário total de equipamentos",null,{"$f":"SUM(J637:J638)","v":183.48670000000001}]
[null,"B - MÃO DE OBRA",null,"Quantidade","Unidade",null,"Custo Horário","Custo Horário Total"]
[null,"-",0,0,0,null,0,null,null,{"$f":"D641*G641","v":0}]
[null,"-",0,0,0,null,0,null,null,{"$f":"D642*G642","v":0}]
[null,null,null,"Custo horário total de mão de obra",{"$nulls":5},{"$f":"SUM(J641:J642)","v":0}]
[null,null,null,"Custo horário total de execução",{"$nulls":5},{"$f":"J639+J643","v":183.48670000000001}]
[null,null,null,"Custo unitário de execução",{"$nulls":5},{"$f":"J644/I633","v":0.79328447903156074}]
[{"$nulls":7},"Custo do FIC",null,0]
[{"$nulls":7},"Custo do FIT",null,0]
[null,"C - MATERIAL",null,"Quantidade","Unidade",null,"Preço Unitário","Custo Unitário"]
[null,"-",0,0," - ",null,0,null,null,{"$f":"D649*G649","v":0}]
[null,"-",0,0," - ",null,0,null,null,{"$f":"D650*G650","v":0}]
[null,null,null,"Custo unitário total de material",{"$nulls":5},{"$f":"SUM(J649:J650)","v":0}]
[null,"D - ATIVIDADES AUXILIARES",null,"Quantidade","Unidade",null,"Custo Unitário","Custo Unitário"]
[null,"-",0,0,0,null,0,null,null,{"$f":"D653*G653","v":0}]
[null,"-",0,0,0,null,0,null,null,{"$f":"D654*G654","v":0}]
[null,null,null,"Custo total de atividades auxiliares",{"$nulls":5},{"$f":"SUM(J653:J654)","v":0}]
[{"$nulls":7},"Subtotal",null,{"$f":"J645+J651+J655+J646+J647","v":0.79328447903156074}]
[null,"E - TEMPO FIXO",null,"Código","Quantidade","Unidade",null,"Custo Unitário","Custo Unitário"]
[null,"-",0,"-",0,"t",null,0,null,{"$f":"ROUNDDOWN(E658*H658,4)","v":0}]
[null,"-",0,"-",0,"t",null,0,null,{"$f":"ROUNDDOWN(E659*H659,4)","v":0}]
[null,null,null,"Custo unitário total de tempo fixo",{"$nulls":5},{"$f":"SUM(J658:J659)","v":0}]
[null,"F - MOMENTO DE TRANSPORTE",null,"Quantidade","Unidade","DMT",null,null,null,"Custo Unitário"]
[{"$nulls":5},"LN","RP","P"]
[null,"-",0,0,"tkm"]
[null,"-",0,0,"tkm"]
[null,null,null,"Custo unitário total de transporte"]
[{"$nulls":5},"Custo unitário direto total",null,null,null,{"$f":"TRUNC(J656+J660,2)","v":0.79}]
[null,"Obs."]
[]
[{"$f":"A630+1","v":18},"1ª/GRD",{"$nulls":8},{"$f":"J705","v":0.81}]
[null,"OBRA:","PAVIMENTAÇÃO ASFÁLTICA EM CBUQ DE VIAS EM COMUNIDADES RURAIS (COMUNIDADE MARIA PRETA, COMUNIDADE TIRIRICAL E DISTRITO DE SÃO NORBERTO - ENGENHEIRO NAVARRO / MG)"]
[null,"Custo Unitário de Referência",null,null,"Minas Gerais"]
[{"$nulls":4}," Abril/2025 ",null,null,"Produção da equipe ",224.1,{"$f":"VLOOKUP(A669,ORÇAMENTO!$A$11:$L$43,7,1)","v":"TXKM"}]
[null,5914612,"TRANSPORTE DE MASSA ASFÁLTICA COM CAMINHÃO BASCULANTE COM CAÇAMBA TÉRMICA",{"$nulls":5},"Valores em reais (R$)"]
[null,"A - EQUIPAMENTOS",null,"Quantidade","Utilização",null,"Custo Horário",null,null,"Custo"]
[{"$nulls":4},"Operativa","Improdutiva","Produtivo","Improdutivo",null,"Horário Total"]
[null,"E9520","Caminhão com caçamba térmica com capacidade de 6 m³ - 136 kW",1,1,0,183.2457,69.798699999999997,null,{"$f":"D676*(E676*G676+F676*H676)","v":183.2457}]
[null,"-",0,null,null,null,0,0,null,{"$f":"D677*(E677*G677+F677*H677)","v":0}]
[{"$nulls":7},"Custo horário total de equipamentos",null,{"$f":"SUM(J676:J677)","v":183.2457}]
[null,"B - MÃO DE OBRA",null,"Quantidade","Unidade",null,"Custo Horário","Custo Horário Total"]
[null,"-",0,0,0,null,0,null,null,{"$f":"D680*G680","v":0}]
[null,"-",0,0,0,null,0,null,null,{"$f":"D681*G681","v":0}]
[null,null,null,"Custo horário total de mão de obra",{"$nulls":5},{"$f":"SUM(J680:J681)","v":0}]
[null,null,null,"Custo horário total de execução",{"$nulls":5},{"$f":"J678+J682","v":183.2457}]
[null,null,null,"Custo unitário de execução",{"$nulls":5},{"$f":"J683/I672","v":0.81769611780455154}]
[{"$nulls":7},"Custo do FIC",null,0]
[{"$nulls":7},"Custo do FIT",null,0]
[null,"C - MATERIAL",null,"Quantidade","Unidade",null,"Preço Unitário","Custo Unitário"]
[null,"-",0,0," - ",null,0,null,null,{"$f":"D688*G688","v":0}]
[null,"-",0,0," - ",null,0,null,null,{"$f":"D689*G689","v":0}]
[null,null,null,"Custo unitário total de material",{"$nulls":5},{"$f":"SUM(J688:J689)","v":0}]
[null,"D - ATIVIDADES AUXILIARES",null,"Quantidade","Unidade",null,"Custo Unitário","Custo Unitário"]
[null,"-",0,0,0,null,0,null,null,{"$f":"D692*G692","v":0}]
[null,"-",0,0,0,null,0,null,null,{"$f":"D693*G693","v":0}]
[null,null,null,"Custo total de atividades auxiliares",{"$nulls":5},{"$f":"SUM(J692:J693)","v":0}]
[{"$nulls":7},"Subtotal",null,{"$f":"J684+J690+J694+J685+J686","v":0.81769611780455154}]
[null,"E - TEMPO FIXO",null,"Código","Quantidade","Unidade",null,"Custo Unitário","Custo Unitário"]
[null,"-",0,"-",0,"t",null,0,null,{"$f":"ROUNDDOWN(E697*H697,4)","v":0}]
[null,"-",0,"-",0,"t",null,0,null,{"$f":"ROUNDDOWN(E698*H698,4)","v":0}]
[null,null,null,"Custo unitário total de tempo fixo",{"$nulls":5},{"$f":"SUM(J697:J698)","v":0}]
[null,"F - MOMENTO DE TRANSPORTE",null,"Quantidade","Unidade","DMT",null,null,null,"Custo Unitário"]
[{"$nulls":5},"LN","RP","P"]
[null,"-",0,0,"tkm"]
[null,"-",0,0,"tkm"]
[null,null,null,"Custo unitário total de transporte"]
[{"$nulls":5},"Custo unitário direto total",null,null,null,{"$f":"TRUNC(J695+J699,2)","v":0.81}]
[null,"Obs."]
[]
[{"$f":"A669+1","v":19},"1ª/GRD",{"$nulls":8},{"$f":"J744","v":1}]
[null,"OBRA:","PAVIMENTAÇÃO ASFÁLTICA EM CBUQ DE VIAS EM COMUNIDADES RURAIS (COMUNIDADE MARIA PRETA, COMUNIDADE TIRIRICAL E DISTRITO DE SÃO NORBERTO - ENGENHEIRO NAVARRO / MG)"]
[null,"Custo Unitário de Referência",null,null,"Minas Gerais"]
[{"$nulls":4}," Abril/2025 ",null,null,"Produção da equipe ",186.75,{"$f":"VLOOKUP(A708,ORÇAMENTO!$A$11:$L$43,7,1)","v":"TXKM"}]
[null,5914612,"TRANSPORTE DE MASSA ASFÁLTICA COM CAMINHÃO BASCULANTE COM CAÇAMBA TÉRMICA",{"$nulls":5},"Valores em reais (R$)"]
[null,"A - EQUIPAMENTOS",null,"Quantidade","Utilização",null,"Custo Horário",null,null,"Custo"]
[{"$nulls":4},"Operativa","Improdutiva","Produtivo","Improdutivo",null,"Horário Total"]
[null,"E9520","Caminhão com caçamba térmica com capacidade de 6 m³ - 136 kW",1,1,0,183.2457,69.798699999999997,null,{"$f":"D715*(E715*G715+F715*H715)","v":183.2457}]
[null,"-",0,null,null,null,0,0,null,{"$f":"D716*(E716*G716+F716*H716)","v":0}]
[{"$nulls":7},"Custo horário total de equipamentos",null,{"$f":"SUM(J715:J716)","v":183.2457}]
[null,"B - MÃO DE OBRA",null,"Quantidade","Unidade",null,"Custo Horário","Custo Horário Total"]
[null,"-",0,0,0,null,0,null,null,{"$f":"D719*G719","v":0}]
[null,"-",0,0,0,null,0,null,null,{"$f":"D720*G720","v":0}]
[null,null,null,"Custo horário total de mão de obra",{"$nulls":5},{"$f":"SUM(J719:J720)","v":0}]
[null,null,null,"Custo horário total de execução",{"$nulls":5},{"$f":"J717+J721","v":183.2457}]
[null,null,null,"Custo unitário de execução",{"$nulls":5},{"$f":"J722/I711","v":0.98123534136546187}]
[{"$nulls":7},"Custo do FIC",null,0.02]
[{"$nulls":7},"Custo do FIT",null,0]
[null,"C - MATERIAL",null,"Quantidade","Unidade",null,"Preço Unitário","Custo Unitário"]
[null,"-",0,0," - ",null,0,null,null,{"$f":"D727*G727","v":0}]
[null,"-",0,0," - ",null,0,null,null,{"$f":"D728*G728","v":0}]
[null,null,null,"Custo unitário total de material",{"$nulls":5},{"$f":"SUM(J727:J728)","v":0}]
[null,"D - ATIVIDADES AUXILIARES",null,"Quantidade","Unidade",null,"Custo Unitário","Custo Unitário"]
[null,"-",0,0,0,null,0,null,null,{"$f":"D731*G731","v":0}]
[null,"-",0,0,0,null,0,null,null,{"$f":"D732*G732","v":0}]
[null,null,null,"Custo total de atividades auxiliares",{"$nulls":5},{"$f":"SUM(J731:J732)","v":0}]
[{"$nulls":7},"Subtotal",null,{"$f":"J723+J729+J733+J724+J725","v":1.0012353413654618}]
[null,"E - TEMPO FIXO",null,"Código","Quantidade","Unidade",null,"Custo Unitário","Custo Unitário"]
[null,"-",0,"-",0,"t",null,0,null,{"$f":"ROUNDDOWN(E736*H736,4)","v":0}]
[null,"-",0,"-",0,"t",null,0,null,{"$f":"ROUNDDOWN(E737*H737,4)","v":0}]
[null,null,null,"Custo unitário total de tempo fixo",{"$nulls":5},{"$f":"SUM(J736:J737)","v":0}]
[null,"F - MOMENTO DE TRANSPORTE",null,"Quantidade","Unidade","DMT",null,null,null,"Custo Unitário"]
[{"$nulls":5},"LN","RP","P"]
[null,"-",0,0,"tkm"]
[null,"-",0,0,"tkm"]
[null,null,null,"Custo unitário total de transporte"]
[{"$nulls":5},"Custo unitário direto total",null,null,null,{"$f":"TRUNC(J734+J738,2)","v":1}]
[null,"Obs."]
[]
[20,"1ª/GRD",{"$nulls":8},{"$f":"J783","v":1.79}]
[null,"OBRA:","PAVIMENTAÇÃO ASFÁLTICA EM CBUQ DE VIAS EM COMUNIDADES RURAIS (COMUNIDADE MARIA PRETA, COMUNIDADE TIRIRICAL E DISTRITO DE SÃO NORBERTO - ENGENHEIRO NAVARRO / MG)"]
[null,"Custo Unitário de Referência",null,null,"Minas Gerais"]
[{"$nulls":4}," Abril/2025 ",null,null,"Produção da equipe ",149.4,{"$f":"VLOOKUP(A747,ORÇAMENTO!$A$11:$L$43,7,1)","v":"TXKM"}]
[null,5914622,"TRANSPORTE COM CAMINHÃO TANQUE DE TRANSPORTE DE MATERIAL ASFÁLTICO DE 30000 L",{"$nulls":5},"Valores em reais (R$)"]
[null,"A - EQUIPAMENTOS",null,"Quantidade","Utilização",null,"Custo Horário",null,null,"Custo"]
[{"$nulls":4},"Operativa","Improdutiva","Produtivo","Improdutivo",null,"Horário Total"]
[null,"E9509","Caminhão tanque distribuidor de asfalto com capacidade de 6.000 l - 7 kW/136 kW",1,1,0,267.51929999999999,74.644499999999994,null,{"$f":"D754*(E754*G754+F754*H754)","v":267.51929999999999}]
[null,"-",0,null,null,null,0,0,null,{"$f":"D755*(E755*G755+F755*H755)","v":0}]
[{"$nulls":7},"Custo horário total de equipamentos",null,{"$f":"SUM(J754:J755)","v":267.51929999999999}]
[null,"B - MÃO DE OBRA",null,"Quantidade","Unidade",null,"Custo Horário","Custo Horário Total"]
[null,"-",0,0,0,null,0,null,null,{"$f":"D758*G758","v":0}]
[null,"-",0,0,0,null,0,null,null,{"$f":"D759*G759","v":0}]
[null,null,null,"Custo horário total de mão de obra",{"$nulls":5},{"$f":"SUM(J758:J759)","v":0}]
[null,null,null,"Custo horário total de execução",{"$nulls":5},{"$f":"J756+J760","v":267.51929999999999}]
[null,null,null,"Custo unitário de execução",{"$nulls":5},{"$f":"J761/I750","v":1.7906244979919677}]
[{"$nulls":7},"Custo do FIC",null,0]
[{"$nulls":7},"Custo do FIT",null,0]
[null,"C - MATERIAL",null,"Quantidade","Unidade",null,"Preço Unitário","Custo Unitário"]
[null,"-",0,996," - ",null,0,null,null,{"$f":"D766*G766","v":0}]
[null,"-",0,89.28," - ",null,0,null,null,{"$f":"D767*G767","v":0}]
[null,null,null,"Custo unitário total de material",{"$nulls":5},{"$f":"SUM(J766:J767)","v":0}]
[null,"D - ATIVIDADES AUXILIARES",null,"Quantidade","Unidade",null,"Custo Unitário","Custo Unitário"]
[null,"-",0,0,0,null,0,null,null,{"$f":"D770*G770","v":0}]
[null,"-",0,0,0,null,0,null,null,{"$f":"D771*G771","v":0}]
[null,null,null,"Custo total de atividades auxiliares",{"$nulls":5},{"$f":"SUM(J770:J771)","v":0}]
[{"$nulls":7},"Subtotal",null,{"$f":"J762+J768+J772+J763+J764","v":1.7906244979919677}]
[null,"E - TEMPO FIXO",null,"Código","Quantidade","Unidade",null,"Custo Unitário","Custo Unitário"]
[null,"-",0,"-",0,"t",null,0,null,{"$f":"ROUNDDOWN(E775*H775,4)","v":0}]
[null,"-",0,"-",0,"t",null,0,null,{"$f":"ROUNDDOWN(E776*H776,4)","v":0}]
[null,null,null,"Custo unitário total de tempo fixo",{"$nulls":5},{"$f":"SUM(J775:J776)","v":0}]
[null,"F - MOMENTO DE TRANSPORTE",null,"Quantidade","Unidade","DMT",null,null,null,"Custo Unitário"]
[{"$nulls":5},"LN","RP","P"]
[null,"-",0,0,"tkm"]
[null,"-",0,0,"tkm"]
[null,null,null,"Custo unitário total de transporte"]
[{"$nulls":5},"Custo unitário direto total",null,null,null,{"$f":"TRUNC(J773+J777,2)","v":1.79}]
[null,"Obs."]
[]
[{"$f":"A747+1","v":21},"1ª/GRD",{"$nulls":8},{"$f":"J822","v":50.17}]
[null,"OBRA:","PAVIMENTAÇÃO ASFÁLTICA EM CBUQ DE VIAS EM COMUNIDADES RURAIS (COMUNIDADE MARIA PRETA, COMUNIDADE TIRIRICAL E DISTRITO DE SÃO NORBERTO - ENGENHEIRO NAVARRO / MG)"]
[null,"Custo Unitário de Referência",null,null,"Minas Gerais"]
[{"$nulls":4}," Abril/2025 ",null,null,"Produção da equipe ",1,{"$f":"VLOOKUP(A786,ORÇAMENTO!$A$11:$L$43,7,1)","v":"M"}]
[null,94273,"ASSENTAMENTO DE GUIA (MEIO-FIO) PRÉ-MOLDADO DE CONCRETO - 80X10X30 CM (COMPRIMENTO X BASE SUPERIOR X ALTURA) - USO VIÁRIO",{"$nulls":5},"Valores em reais (R$)"]
[null,"A - EQUIPAMENTOS",null,"Quantidade","Utilização",null,"Custo Horário",null,null,"Custo"]
[{"$nulls":4},"Operativa","Improdutiva","Produtivo","Improdutivo",null,"Horário Total"]
[null,"-",0,null,null,null,0,0,null,{"$f":"D793*(E793*G793+F793*H793)","v":0}]
[null,"-",0,null,null,null,0,0,null,{"$f":"D794*(E794*G794+F794*H794)","v":0}]
[{"$nulls":7},"Custo horário total de equipamentos",null,{"$f":"SUM(J793:J794)","v":0}]
[null,"B - MÃO DE OBRA",null,"Quantidade","Unidade",null,"Custo Horário","Custo Horário Total"]
[null,"P9824","Servente",0.2296,"h",null,21.435400000000001,null,null,{"$f":"D797*G797","v":4.9215678400000007}]
[null,"P9821","Pedreiro",0.2296,"h",null,27.132200000000001,null,null,{"$f":"D798*G798","v":6.2295531200000003}]
[null,null,null,"Custo horário total de mão de obra",{"$nulls":5},{"$f":"SUM(J797:J798)","v":11.15112096}]
[null,null,null,"Custo horário total de execução",{"$nulls":5},{"$f":"J795+J799","v":11.15112096}]
[null,null,null,"Custo unitário de execução",{"$nulls":5},{"$f":"J800/I789","v":11.15112096}]
[{"$nulls":7},"Custo do FIC",null,0]
[{"$nulls":7},"Custo do FIT",null,0]
[null,"C - MATERIAL",null,"Quantidade","Unidade",null,"Preço Unitário","Custo Unitário"]
[null,"M0082","Areia média lavada",6.6E-3,"m³",null,145.6,null,null,{"$f":"D805*G805","v":0.96095999999999993}]
[null,4059,"Meio-fio ou guia de concreto, pré-moldado, comp.1,0m x 30 x 12/15 cm (H X L1/L2)",1.0049999999999999,"m",null,37,"COTAÇÃO",null,37.184999999999995]
[null,null,null,"Custo unitário total de material",{"$nulls":5},{"$f":"SUM(J805:J806)","v":38.145959999999995}]
[null,"D - ATIVIDADES AUXILIARES",null,"Quantidade","Unidade",null,"Custo Unitário","Custo Unitário"]
[null,1109669,"Argamassa de cimento e areia 1:3 - confecção em betoneira e lançamento manual - areia comercial",1.8E-3,"m³",null,488.89,null,null,{"$f":"D809*G809","v":0.88000199999999995}]
[null,"-",0,0,0,null,0,null,null,{"$f":"D810*G810","v":0}]
[null,null,null,"Custo total de atividades auxiliares",{"$nulls":5},{"$f":"SUM(J809:J810)","v":0.88000199999999995}]
[{"$nulls":7},"Subtotal",null,{"$f":"J801+J807+J811+J802+J803","v":50.177082959999993}]
[null,"E - TEMPO FIXO",null,"Código","Quantidade","Unidade",null,"Custo Unitário","Custo Unitário"]
[null,"-",0,"-",0,"t",null,0,null,{"$f":"ROUNDDOWN(E814*H814,4)","v":0}]
[null,"-",0,"-",0,"t",null,0,null,{"$f":"ROUNDDOWN(E815*H815,4)","v":0}]
[null,null,null,"Custo unitário total de tempo fixo",{"$nulls":5},{"$f":"SUM(J814:J815)","v":0}]
[null,"F - MOMENTO DE TRANSPORTE",null,"Quantidade","Unidade","DMT",null,null,null,"Custo Unitário"]
[{"$nulls":5},"LN","RP","P"]
[null,"-",0,0,"tkm","5914449","5914464","5914479"]
[null,"-",0,0,"tkm","5914449","5914464","5914479"]
[null,null,null,"Custo unitário total de transporte"]
[{"$nulls":5},"Custo unitário direto total",null,null,null,{"$f":"TRUNC(J812+J816,2)","v":50.17}]
[null,"Obs."]
[]
[23,"1ª/GRD",{"$nulls":8},{"$f":"J863","v":23.9}]
[null,"OBRA:","PAVIMENTAÇÃO ASFÁLTICA EM CBUQ DE VIAS EM COMUNIDADES RURAIS (COMUNIDADE MARIA PRETA, COMUNIDADE TIRIRICAL E DISTRITO DE SÃO NORBERTO - ENGENHEIRO NAVARRO / MG)"]
[null,"Custo Unitário de Referência",null,null,"Minas Gerais"]
[{"$nulls":4}," Abril/2025 ",null,null,"Produção da equipe ",4.2992261392949267,{"$f":"VLOOKUP(A825,ORÇAMENTO!$A$11:$L$43,7,1)","v":"M"}]
[null,"94287a","EXECUÇÃO DE SARJETA EM CONCRETO USINADO, MOLDADO IN LOCO - 30CM DE BASE X 5CM DE ALTURA",{"$nulls":5},"Valores em reais (R$)"]
[null,"A - EQUIPAMENTOS",null,"Quantidade","Utilização",null,"Custo Horário",null,null,"Custo"]
[{"$nulls":4},"Operativa","Improdutiva","Produtivo","Improdutivo",null,"Horário Total"]
[null,"-",0,null,null,null,0,0,null,{"$f":"D832*(E832*G832+F832*H832)","v":0}]
[null,"-",0,null,null,null,0,0,null,{"$f":"D833*(E833*G833+F833*H833)","v":0}]
[{"$nulls":7},"Custo horário total de equipamentos",null,{"$f":"SUM(J832:J833)","v":0}]
[null,"B - MÃO DE OBRA",null,"Quantidade","Unidade",null,"Custo Horário","Custo Horário Total"]
[null,"P9821","Pedreiro",1,"h",null,27.132200000000001,null,null,{"$f":"D836*G836","v":27.132200000000001}]
[null,"P9824","Servente",1,"h",null,21.435400000000001,null,null,{"$f":"D837*G837","v":21.435400000000001}]
[null,null,null,"Custo horário total de mão de obra",{"$nulls":5},{"$f":"SUM(J836:J837)","v":48.567599999999999}]
[null,null,null,"Custo horário total de execução",{"$nulls":5},{"$f":"J834+J838","v":48.567599999999999}]
[null,null,null,"Custo unitário de execução",{"$nulls":5},{"$f":"J839/I828","v":11.296823760000001}]
[{"$nulls":7},"Custo do FIC",null,0]
[{"$nulls":7},"Custo do FIT",null,0]
[null,"C - MATERIAL",null,"Quantidade","Unidade",null,"Preço Unitário","Custo Unitário"]
[null,"M0082","Areia média lavada",8.9999999999999993E-3,"m³",null,145.6,null,null,{"$f":"D844*G844","v":1.3103999999999998}]
[null,"M0286","Tábua - E = 2,5 cm e L = 30 cm",8.3299999999999999E-2,"m",null,15.813599999999999,null,null,{"$f":"D845*G845","v":1.31727288}]
[null,"M0451","Concreto usinado - fck = 20 MPa (comercial)",1.8800000000000001E-2,"m³",null,520,"SINAPI - 34492",null,9.7759999999999998]
[null,"M1358","Sarrafo em madeira de terceira - E = 2,5 cm e L = 5 cm",0.1,"m",null,2.0291000000000001,null,null,0.20291000000000003]
[null,null,null,"Custo unitário total de material",{"$nulls":5},{"$f":"SUM(J844:J847)","v":12.606582879999998}]
[null,"D - ATIVIDADES AUXILIARES",null,"Quantidade","Unidade",null,"Custo Unitário","Custo Unitário"]
[null,"-",0,null,0,null,0,null,null,{"$f":"D850*G850","v":0}]
[null,"-",0,null,0,null,0,null,null,{"$f":"D851*G851","v":0}]
[null,null,null,"Custo total de atividades auxiliares",{"$nulls":5},{"$f":"SUM(J850:J851)","v":0}]
[{"$nulls":7},"Subtotal",null,{"$f":"J840+J848+J852+J841+J842","v":23.90340664}]
[null,"E - TEMPO FIXO",null,"Código","Quantidade","Unidade",null,"Custo Unitário","Custo Unitário"]
[null,"-",0,"-",0,"t",null,0,null,{"$f":"ROUNDDOWN(E855*H855,4)","v":0}]
[null,"-",0,"-",0,"t",null,0,null,{"$f":"ROUNDDOWN(E856*H856,4)","v":0}]
[null,null,null,"Custo unitário total de tempo fixo",{"$nulls":5},{"$f":"SUM(J855:J856)","v":0}]
[null,"F - MOMENTO DE TRANSPORTE",null,"Quantidade","Unidade","DMT",null,null,null,"Custo Unitário"]
[{"$nulls":5},"LN","RP","P"]
[null,"-",0,0,"tkm"]
[null,"-",0,0,"tkm"]
[null,null,null,"Custo unitário total de transporte"]
[{"$nulls":5},"Custo unitário direto total",null,null,null,{"$f":"TRUNC(J853+J857,2)","v":23.9}]
[null,"Obs."]
[]
[24,"1ª/GRD",{"$nulls":8},{"$f":"J904","v":180.68}]
[null,"OBRA:","PAVIMENTAÇÃO ASFÁLTICA EM CBUQ DE VIAS EM COMUNIDADES RURAIS (COMUNIDADE MARIA PRETA, COMUNIDADE TIRIRICAL E DISTRITO DE SÃO NORBERTO - ENGENHEIRO NAVARRO / MG)"]
[null,"Custo Unitário de Referência",null,null,"Minas Gerais"]
[{"$nulls":4}," Abril/2025 ",null,null,"Produção da equipe ",1,{"$f":"VLOOKUP(A866,ORÇAMENTO!$A$11:$L$43,7,1)","v":"UN."}]
[null,2003107,"ENTRADA PARA DESCIDA D'ÁGUA, TIPO EDA 03 - AREIA E BRITA COMERCIAIS",{"$nulls":5},"Valores em reais (R$)"]
[null,"A - EQUIPAMENTOS",null,"Quantidade","Utilização",null,"Custo Horário",null,null,"Custo"]
[{"$nulls":4},"Operativa","Improdutiva","Produtivo","Improdutivo",null,"Horário Total"]
[null,"-",0,null,null,null,0,0,null,{"$f":"D873*(E873*G873+F873*H873)","v":0}]
[null,"-",0,null,null,null,0,0,null,{"$f":"D874*(E874*G874+F874*H874)","v":0}]
[{"$nulls":7},"Custo horário total de equipamentos",null,{"$f":"SUM(J873:J874)","v":0}]
[null,"B - MÃO DE OBRA",null,"Quantidade","Unidade",null,"Custo Horário","Custo Horário Total"]
[null,"-",0,null,0,null,0,null,null,{"$f":"D877*G877","v":0}]
[null,"-",0,null,0,null,0,null,null,{"$f":"D878*G878","v":0}]
[null,null,null,"Custo horário total de mão de obra",{"$nulls":5},{"$f":"SUM(J877:J878)","v":0}]
[null,null,null,"Custo horário total de execução",{"$nulls":5},{"$f":"J875+J879","v":0}]
[null,null,null,"Custo unitário de execução",{"$nulls":5},{"$f":"J880/I869","v":0}]
[{"$nulls":7},"Custo do FIC",null,0]
[{"$nulls":7},"Custo do FIT",null,0]
[null,"C - MATERIAL",null,"Quantidade","Unidade",null,"Preço Unitário","Custo Unitário"]
[null,"-",0,null," - ",null,0,null,null,{"$f":"D885*G885","v":0}]
[null,"-",0,null," - ",null,0,null,null,{"$f":"D886*G886","v":0}]
[null,null,null,"Custo unitário total de material",{"$nulls":5},{"$f":"SUM(J885:J886)","v":0}]
[null,"D - ATIVIDADES AUXILIARES",null,"Quantidade","Unidade",null,"Custo Unitário","Custo Unitário"]
[null,4805756,"Apiloamento manual de superfície com espessura de 15 cm",1.0807,"m²",null,4.82,null,null,{"$f":"D889*G889","v":5.2089740000000004}]
[null,1107892,"Concreto fck = 20 MPa - confecção em betoneira e lançamento manual - areia e brita comerciais",0.1593,"m³",null,474.33,null,null,{"$f":"D890*G890","v":75.560768999999993}]
[null,4805750,"Escavação manual em material de 1ª categoria na profundidade de até 1 m",0.1081,"m³",null,43.75,null,null,4.7293750000000001]
[null,3103302,"Fôrmas de tábuas de pinho para dispositivos de drenagem - utilização de 3 vezes - confecção, instalação e retirada",1.2596000000000001,"m²",null,75.569999999999993,null,null,95.187972000000002]
[null,null,null,"Custo total de atividades auxiliares",{"$nulls":5},{"$f":"SUM(J889:J892)","v":180.68709000000001}]
[{"$nulls":7},"Subtotal",null,{"$f":"J881+J887+J893+J882+J883","v":180.68709000000001}]
[null,"E - TEMPO FIXO",null,"Código","Quantidade","Unidade",null,"Custo Unitário","Custo Unitário"]
[null,"-",0,"-",null,"t",null,0,null,{"$f":"ROUNDDOWN(E896*H896,4)","v":0}]
[null,"-",0,"-",null,"t",null,0,null,{"$f":"ROUNDDOWN(E897*H897,4)","v":0}]
[null,null,null,"Custo unitário total de tempo fixo",{"$nulls":5},{"$f":"SUM(J896:J897)","v":0}]
[null,"F - MOMENTO DE TRANSPORTE",null,"Quantidade","Unidade","DMT",null,null,null,"Custo Unitário"]
[{"$nulls":5},"LN","RP","P"]
[null,"-",0,null,"tkm"]
[null,"-",0,null,"tkm"]
[null,null,null,"Custo unitário total de transporte"]
[{"$nulls":5},"Custo unitário direto total",null,null,null,{"$f":"TRUNC(J894+J898,2)","v":180.68}]
[null,"Obs."]
[]
[46,"1ª/GRD",{"$nulls":8},{"$f":"J943","v":271.87}]
[null,"OBRA:","PAVIMENTAÇÃO ASFÁLTICA EM CBUQ DE VIAS EM COMUNIDADES RURAIS (COMUNIDADE MARIA PRETA, COMUNIDADE TIRIRICAL E DISTRITO DE SÃO NORBERTO - ENGENHEIRO NAVARRO / MG)"]
[null,"Custo Unitário de Referência",null,null,"Minas Gerais"]
[{"$nulls":4}," Abril/2025 ",null,null,"Produção da equipe ",3,{"$f":"VLOOKUP(A907,ORÇAMENTO!$A$11:$L$43,7,1)","v":"UN."}]
[null,2003107,"ENTRADA PARA DESCIDA D'ÁGUA, TIPO EDA 03 - AREIA E BRITA COMERCIAIS",{"$nulls":5},"Valores em reais (R$)"]
[null,"A - EQUIPAMENTOS",null,"Quantidade","Utilização",null,"Custo Horário",null,null,"Custo"]
[{"$nulls":4},"Operativa","Improdutiva","Produtivo","Improdutivo",null,"Horário Total"]
[null,"E9687","Caminhão carroceria com capacidade de 5 t - 120 kW",1,0.3,0.7,154.82689999999999,59.719900000000003,null,{"$f":"D914*(E914*G914+F914*H914)","v":88.251999999999995}]
[null,"-",0,null,null,null,0,0,null,{"$f":"D915*(E915*G915+F915*H915)","v":0}]
[{"$nulls":7},"Custo horário total de equipamentos",null,{"$f":"SUM(J914:J915)","v":88.251999999999995}]
[null,"B - MÃO DE OBRA",null,"Quantidade","Unidade",null,"Custo Horário","Custo Horário Total"]
[null,"P9830","Montador",1,"h",null,38.260300000000001,null,null,{"$f":"D918*G918","v":38.260300000000001}]
[null,"P9824","Servente",2,"h",null,21.435400000000001,null,null,{"$f":"D919*G919","v":42.870800000000003}]
[null,null,null,"Custo horário total de mão de obra",{"$nulls":5},{"$f":"SUM(J918:J919)","v":81.131100000000004}]
[null,null,null,"Custo horário total de execução",{"$nulls":5},{"$f":"J916+J920","v":169.38310000000001}]
[null,null,null,"Custo unitário de execução",{"$nulls":5},{"$f":"J921/I910","v":56.46103333333334}]
[{"$nulls":7},"Custo do FIC",null,0]
[{"$nulls":7},"Custo do FIT",null,0]
[null,"C - MATERIAL",null,"Quantidade","Unidade",null,"Preço Unitário","Custo Unitário"]
[null,"-",0,null," - ",null,0,null,null,{"$f":"D926*G926","v":0}]
[null,"-",0,null," - ",null,0,null,null,{"$f":"D927*G927","v":0}]
[null,null,null,"Custo unitário total de material",{"$nulls":5},{"$f":"SUM(J926:J927)","v":0}]
[null,"D - ATIVIDADES AUXILIARES",null,"Quantidade","Unidade",null,"Custo Unitário","Custo Unitário"]
[null,5213414,"Placa em aço nº 16 galvanizado com película retrorrefletiva tipo I + SI - confecção",0.35993999999999998,"m²",null,598.48,null,null,{"$f":"D930*G930","v":215.41689120000001}]
[null,"-",0,null,0,null,0,null,null,{"$f":"D931*G931","v":0}]
[null,null,null,"Custo total de atividades auxiliares",{"$nulls":5},{"$f":"SUM(J930:J931)","v":215.41689120000001}]
[{"$nulls":7},"Subtotal",null,{"$f":"J922+J928+J932+J923+J924","v":271.87792453333333}]
[null,"E - TEMPO FIXO",null,"Código","Quantidade","Unidade",null,"Custo Unitário","Custo Unitário"]
[null,"-",0,"-",null,"t",null,0,null,{"$f":"ROUNDDOWN(E935*H935,4)","v":0}]
[null,"-",0,"-",null,"t",null,0,null,{"$f":"ROUNDDOWN(E936*H936,4)","v":0}]
[null,null,null,"Custo unitário total de tempo fixo",{"$nulls":5},{"$f":"SUM(J935:J936)","v":0}]
[null,"F - MOMENTO DE TRANSPORTE",null,"Quantidade","Unidade","DMT",null,null,null,"Custo Unitário"]
[{"$nulls":5},"LN","RP","P"]
[null,"-",0,null,"tkm"]
[null,"-",0,null,"tkm"]
[null,null,null,"Custo unitário total de transporte"]
[{"$nulls":5},"Custo unitário direto total",null,null,null,{"$f":"TRUNC(J933+J937,2)","v":271.87}]
[null,"Obs."]
[]
[49,"1ª/GRD",{"$nulls":8},{"$f":"J989","v":27.24}]
[null,"OBRA:","PAVIMENTAÇÃO ASFÁLTICA EM CBUQ DE VIAS EM COMUNIDADES RURAIS (COMUNIDADE MARIA PRETA, COMUNIDADE TIRIRICAL E DISTRITO DE SÃO NORBERTO - ENGENHEIRO NAVARRO / MG)"]
[null,"Custo Unitário de Referência",null,null,"Minas Gerais"]
[{"$nulls":4}," Abril/2025 ",null,null,"Produção da equipe ",149.4,{"$f":"VLOOKUP(A946,ORÇAMENTO!$A$11:$L$43,7,1)","v":"M2"}]
[null,5213401,"PINTURA DE EIXO VIÁRIO SOBRE ASFALTO COM TINTA RETRORREFLETIVA A BASE DE RESINA ACRÍLICA COM MICROESFERAS DE VIDRO, APLICAÇÃO MECÂNICA COM DEMARCADORA AUTOPROPELIDA",{"$nulls":5},"Valores em reais (R$)"]
[null,"A - EQUIPAMENTOS",null,"Quantidade","Utilização",null,"Custo Horário",null,null,"Custo"]
[{"$nulls":4},"Operativa","Improdutiva","Produtivo","Improdutivo",null,"Horário Total"]
[null,"E9644","Caminhão demarcador de faixas com sistema de pintura a frio - 28 kW/129 kW",1,1,0,403.09390000000002,159.4639,null,{"$f":"D953*(E953*G953+F953*H953)","v":403.09390000000002}]
[null,"-",0,null,null,null,0,0,null,{"$f":"D954*(E954*G954+F954*H954)","v":0}]
[{"$nulls":7},"Custo horário total de equipamentos",null,{"$f":"SUM(J953:J954)","v":403.09390000000002}]
[null,"B - MÃO DE OBRA",null,"Quantidade","Unidade",null,"Custo Horário","Custo Horário Total"]
[null,"P9853","Pré-marcador",1,"h",null,23.213999999999999,null,null,{"$f":"D957*G957","v":23.213999999999999}]
[null,"P9824","Servente",4,"h",null,21.435400000000001,null,null,{"$f":"D958*G958","v":85.741600000000005}]
[null,null,null,"Custo horário total de mão de obra",{"$nulls":5},{"$f":"SUM(J957:J958)","v":108.9556}]
[null,null,null,"Custo horário total de execução",{"$nulls":5},{"$f":"J955+J959","v":512.04950000000008}]
[null,null,null,"Custo unitário de execução",{"$nulls":5},{"$f":"J960/I949","v":3.4273728246318611}]
[{"$nulls":7},"Custo do FIC",null,0]
[{"$nulls":7},"Custo do FIT",null,0]
[null,"C - MATERIAL",null,"Quantidade","Unidade",null,"Preço Unitário","Custo Unitário"]
[null,"M2037","Microesferas refletivas de vidro tipo I-B",0.12,"kg",null,8.7142999999999997,null,null,{"$f":"D965*G965","v":1.0457159999999999}]
[null,"M2038","Microesferas refletivas de vidro tipo II-A",0.35,"kg",null,8.8077000000000005,null,null,{"$f":"D966*G966","v":3.0826950000000002}]
[null,"M2034","Solvente para tinta à base de resina acrílica",0.03,"l",null,16.6828,null,null,0.50048400000000004]
[null,"M2044","Tinta à base de resina acrílica emulsionada em água para pré-marcação viária",9.7000000000000005E-4,"l",null,19.888300000000001,null,null,1.9291651000000003E-2]
[null,"M2027","Tinta à base de resina acrílica estirenada para demarcação viária",0.6,"l",null,31.8858,null,null,19.13148]
[null,null,null,"Custo unitário total de material",{"$nulls":5},{"$f":"SUM(J965:J969)","v":23.779666650999999}]
[null,"D - ATIVIDADES AUXILIARES",null,"Quantidade","Unidade",null,"Custo Unitário","Custo Unitário"]
[null,"-",0,null,0,null,0,null,null,{"$f":"D972*G972","v":0}]
[null,"-",0,null,0,null,0,null,null,{"$f":"D973*G973","v":0}]
[null,null,null,"Custo total de atividades auxiliares",{"$nulls":5},{"$f":"SUM(J972:J973)","v":0}]
[{"$nulls":7},"Subtotal",null,{"$f":"J961+J970+J974+J962+J963","v":27.207039475631859}]
[null,"E - TEMPO FIXO",null,"Código","Quantidade","Unidade",null,"Custo Unitário","Custo Unitário"]
[null,"M2037","Microesferas refletivas de vidro tipo I-B",5914655,1.2E-4,"t",null,32.39,null,{"$f":"ROUNDDOWN(E977*H977,4)","v":3.8E-3}]
[null,"M2038","Microesferas refletivas de vidro tipo II-A",5914655,3.5E-4,"t",null,32.39,null,{"$f":"ROUNDDOWN(E978*H978,4)","v":1.1299999999999999E-2}]
[null,"M2034","Solvente para tinta à base de resina acrílica",5914655,3.0000000000000001E-5,"t",null,32.39,null,8.9999999999999998E-4]
[null,"M2027","Tinta à base de resina acrílica estirenada para demarcação viária",5914655,8.3000000000000001E-4,"t",null,32.39,null,2.6800000000000001E-2]
[null,null,null,"Custo unitário total de tempo fixo",{"$nulls":5},{"$f":"SUM(J977:J980)","v":4.2800000000000005E-2}]
[null,"F - MOMENTO DE TRANSPORTE",null,"Quantidade","Unidade","DMT",null,null,null,"Custo Unitário"]
[{"$nulls":5},"LN","RP","P"]
[null,"M2037","Microesferas refletivas de vidro tipo I-B",1.2E-4,"tkm"]
[null,"M2038","Microesferas refletivas de vidro tipo II-A",3.5E-4,"tkm"]
[null,"M2034","Solvente para tinta à base de resina acrílica",3.0000000000000001E-5,"tkm"]
[null,"M2027","Tinta à base de resina acrílica estirenada para demarcação viária",8.3000000000000001E-4,"tkm"]
[null,null,null,"Custo unitário total de transporte"]
[{"$nulls":5},"Custo unitário direto total",null,null,null,{"$f":"TRUNC(J975+J981,2)","v":27.24}]
[null,"Obs."]
[]
[51,"1ª/GRD",{"$nulls":8},{"$f":"J1035","v":40.78}]
[null,"OBRA:","PAVIMENTAÇÃO ASFÁLTICA EM CBUQ DE VIAS EM COMUNIDADES RURAIS (COMUNIDADE MARIA PRETA, COMUNIDADE TIRIRICAL E DISTRITO DE SÃO NORBERTO - ENGENHEIRO NAVARRO / MG)"]
[null,"Custo Unitário de Referência",null,null,"Minas Gerais"]
[{"$nulls":4}," Abril/2025 ",null,null,"Produção da equipe ",30.18,{"$f":"VLOOKUP(A992,ORÇAMENTO!$A$11:$L$43,7,1)","v":"M2"}]
[null,5213401,"PINTURA DE EIXO VIÁRIO SOBRE ASFALTO COM TINTA RETRORREFLETIVA A BASE DE RESINA ACRÍLICA COM MICROESFERAS DE VIDRO, APLICAÇÃO MECÂNICA COM DEMARCADORA AUTOPROPELIDA",{"$nulls":5},"Valores em reais (R$)"]
[null,"A - EQUIPAMENTOS",null,"Quantidade","Utilização",null,"Custo Horário",null,null,"Custo"]
[{"$nulls":4},"Operativa","Improdutiva","Produtivo","Improdutivo",null,"Horário Total"]
[null,"E9644","Caminhão demarcador de faixas com sistema de pintura a frio - 28 kW/129 kW",1,1,0,403.09390000000002,159.4639,null,{"$f":"D999*(E999*G999+F999*H999)","v":403.09390000000002}]
[null,"-",0,null,null,null,0,0,null,{"$f":"D1000*(E1000*G1000+F1000*H1000)","v":0}]
[{"$nulls":7},"Custo horário total de equipamentos",null,{"$f":"SUM(J999:J1000)","v":403.09390000000002}]
[null,"B - MÃO DE OBRA",null,"Quantidade","Unidade",null,"Custo Horário","Custo Horário Total"]
[null,"P9853","Pré-marcador",1,"h",null,23.213999999999999,null,null,{"$f":"D1003*G1003","v":23.213999999999999}]
[null,"P9824","Servente",4,"h",null,21.435400000000001,null,null,{"$f":"D1004*G1004","v":85.741600000000005}]
[null,null,null,"Custo horário total de mão de obra",{"$nulls":5},{"$f":"SUM(J1003:J1004)","v":108.9556}]
[null,null,null,"Custo horário total de execução",{"$nulls":5},{"$f":"J1001+J1005","v":512.04950000000008}]
[null,null,null,"Custo unitário de execução",{"$nulls":5},{"$f":"J1006/I995","v":16.966517561298875}]
[{"$nulls":7},"Custo do FIC",null,0]
[{"$nulls":7},"Custo do FIT",null,0]
[null,"C - MATERIAL",null,"Quantidade","Unidade",null,"Preço Unitário","Custo Unitário"]
[null,"M2037","Microesferas refletivas de vidro tipo I-B",0.12,"kg",null,8.7142999999999997,null,null,{"$f":"D1011*G1011","v":1.0457159999999999}]
[null,"M2038","Microesferas refletivas de vidro tipo II-A",0.35,"kg",null,8.8077000000000005,null,null,{"$f":"D1012*G1012","v":3.0826950000000002}]
[null,"M2034","Solvente para tinta à base de resina acrílica",0.03,"l",null,16.6828,null,null,0.50048400000000004]
[null,"M2044","Tinta à base de resina acrílica emulsionada em água para pré-marcação viária",9.7000000000000005E-4,"l",null,19.888300000000001,null,null,1.9291651000000003E-2]
[null,"M2027","Tinta à base de resina acrílica estirenada para demarcação viária",0.6,"l",null,31.8858,null,null,19.13148]
[null,null,null,"Custo unitário total de material",{"$nulls":5},{"$f":"SUM(J1011:J1015)","v":23.779666650999999}]
[null,"D - ATIVIDADES AUXILIARES",null,"Quantidade","Unidade",null,"Custo Unitário","Custo Unitário"]
[null,"-",0,null,0,null,0,null,null,{"$f":"D1018*G1018","v":0}]
[null,"-",0,null,0,null,0,null,null,{"$f":"D1019*G1019","v":0}]
[null,null,null,"Custo total de atividades auxiliares",{"$nulls":5},{"$f":"SUM(J1018:J1019)","v":0}]
[{"$nulls":7},"Subtotal",null,{"$f":"J1007+J1016+J1020+J1008+J1009","v":40.746184212298871}]
[null,"E - TEMPO FIXO",null,"Código","Quantidade","Unidade",null,"Custo Unitário","Custo Unitário"]
[null,"M2037","Microesferas refletivas de vidro tipo I-B",5914655,1.2E-4,"t",null,32.39,null,{"$f":"ROUNDDOWN(E1023*H1023,4)","v":3.8E-3}]
[null,"M2038","Microesferas refletivas de vidro tipo II-A",5914655,3.5E-4,"t",null,32.39,null,{"$f":"ROUNDDOWN(E1024*H1024,4)","v":1.1299999999999999E-2}]
[null,"M2034","Solvente para tinta à base de resina acrílica",5914655,3.0000000000000001E-5,"t",null,32.39,null,8.9999999999999998E-4]
[null,"M2027","Tinta à base de resina acrílica estirenada para demarcação viária",5914655,8.3000000000000001E-4,"t",null,32.39,null,2.6800000000000001E-2]
[null,null,null,"Custo unitário total de tempo fixo",{"$nulls":5},{"$f":"SUM(J1023:J1026)","v":4.2800000000000005E-2}]
[null,"F - MOMENTO DE TRANSPORTE",null,"Quantidade","Unidade","DMT",null,null,null,"Custo Unitário"]
[{"$nulls":5},"LN","RP","P"]
[null,"M2037","Microesferas refletivas de vidro tipo I-B",1.2E-4,"tkm"]
[null,"M2038","Microesferas refletivas de vidro tipo II-A",3.5E-4,"tkm"]
[null,"M2034","Solvente para tinta à base de resina acrílica",3.0000000000000001E-5,"tkm"]
[null,"M2027","Tinta à base de resina acrílica estirenada para demarcação viária",8.3000000000000001E-4,"tkm"]
[null,null,null,"Custo unitário total de transporte"]
[{"$nulls":5},"Custo unitário direto total",null,null,null,{"$f":"TRUNC(J1021+J1027,2)","v":40.78}]
[null,"Obs."]

{"sheet":"CPU-FORNEC","index":2,"n_rows":92,"n_cols":14,"rows_kept":92,"cut":false,"hidden":false,"merged":[[28,8,33,10],[71,0,80,0],[71,1,71,3],[71,4,71,7],[72,2,72,5],[73,2,73,3],[74,1,74,7],[77,1,77,3],[77,5,77,6],[78,1,78,6],[79,1,79,6],[80,1,80,6],[38,0,47,0],[38,1,38,3],[38,4,38,7],[39,2,39,5],[0,0,26,0],[0,1,0,3],[0,4,0,7],[22,1,22,3],[49,0,58,0],[49,1,49,3],[49,4,49,7],[50,2,50,5],[51,2,51,3],[52,1,52,7],[55,1,55,3],[55,5,55,6],[56,1,56,6],[57,1,57,6],[58,1,58,6],[27,1,27,3],[27,4,27,7],[28,2,28,5],[27,0,36,0],[29,2,29,3],[30,1,30,7],[33,1,33,3],[33,5,33,6],[34,1,34,6],[35,1,35,6],[36,1,36,6],[0,10,0,11],[1,2,1,5],[1,10,1,11],[2,2,2,3],[3,1,3,7],[22,5,22,6],[23,1,23,6],[24,1,24,6],[25,1,25,6],[5,1,5,7],[9,1,9,7],[13,1,13,7],[17,1,17,7],[40,2,40,3],[41,1,41,7],[44,1,44,3],[44,5,44,6],[45,1,45,6],[46,1,46,6],[47,1,47,6],[60,0,69,0],[60,1,60,3],[60,4,60,7],[61,2,61,5],[62,2,62,3],[63,1,63,7],[66,1,66,3],[66,5,66,6],[67,1,67,6],[68,1,68,6],[69,1,69,6],[81,1,81,7],[82,0,91,0],[82,1,82,3],[82,4,82,7],[83,2,83,5],[84,2,84,3],[85,1,85,7],[88,1,88,3],[88,5,88,6],[89,1,89,6],[90,1,90,6],[91,1,91,6]]}
[1,"CODEVASF",null,null," COMPOSIÇÃO DE PREÇO UNITÁRIO",null,null,null,{"$f":"H24","v":0},{"$f":"H26","v":0},"BDI CALCULADO:",null,{"$f":"ORÇAMENTO!L7","v":15}]
[null,"OBRA:  ","PAVIMENTAÇÃO ASFÁLTICA EM CBUQ DE VIAS EM COMUNIDADES RURAIS (COMUNIDADE MARIA PRETA, COMUNIDADE TIRIRICAL E DISTRITO DE SÃO NORBERTO - ENGENHEIRO NAVARRO / MG)",null,null,null,"DATA: ",{"$f":"ORÇAMENTO!C7","v":" SETEMBRO / 2025"},null,null,"BDI DIFERENCIADO:",null,{"$f":"'BDI FORN'!D31/100","v":0.15}]
[null,"SERVIÇO:  ","CPU.1",null,"Referência:","CODEVASF","UNIDADE: ",{"$f":"VLOOKUP(A1,ORÇAMENTO!A12:L32,5)","v":"MOBILIZAÇÃO E DESMOBILIZAÇÃO"}]
[]
[null,"TIPO ITEM","CODIGO ITEM","DESCRIÇÃO ITEM","UNIDADE ITEM","COEFICIENTE","PRECO UNITARIO","CUSTO TOTAL",null,"distancia =",90,"B.DESPACHO"]
[null,"EQUIPAMENTOS",{"$nulls":7},"Pá carregadeira ",null,null,10.1," ton"]
[null,null,"E9001","E9001","E9001",null,"E9001"]
[]
[]
[null,"MÃO DE OBRA"]
[]
[]
[]
[null,"MATERIAIS"]
[]
[]
[{"$nulls":7},{"$f":"ROUNDDOWN(F17*G17,2)","v":0},null,"Motoniveladora ",null,null,12.47," ton"]
[null,"ATIVIDADES AUXILIARES",{"$nulls":7},"Trator de pneus",null,null,2.8," ton"]
[{"$nulls":7},{"$f":"ROUNDDOWN(F19*G19,2)","v":0}]
[{"$nulls":7},0]
[{"$nulls":7},0]
[{"$nulls":7},{"$f":"ROUNDDOWN(F22*G22,2)","v":0},null,"Rolo Compactador ",null,null,15.33," ton"]
[null,"PRODUÇÃO DA EQUIPE",null,null,1,"CUSTO ",null,{"$f":"SUM(H6:H22)","v":0},null,"Grade de disco",null,null,1," ton"]
[null,"TOTAL",{"$nulls":5},{"$f":"H23/E23","v":0},"OK","RETROESCAVADEIRA",null,null,6.67," ton"]
[null,"BDI                %",{"$nulls":5},{"$f":"1+$M$1","v":16}]
[null,"TOTAL DO SERVIÇO - R$",{"$nulls":5},{"$f":"ROUND(H24*H25,2)","v":0}]
[]
["F1","CODEVASF",null,null," COMPOSIÇÃO DE PREÇO UNITÁRIO",null,null,null,{"$f":"H35","v":2732.37},{"$f":"H37","v":3142.23}]
[null,"OBRA:  ","PAVIMENTAÇÃO ASFÁLTICA EM CBUQ DE VIAS EM COMUNIDADES RURAIS (COMUNIDADE MARIA PRETA, COMUNIDADE TIRIRICAL E DISTRITO DE SÃO NORBERTO - ENGENHEIRO NAVARRO / MG)",null,null,null,"DATA: ",{"$f":"$H$2","v":" SETEMBRO / 2025"}]
[null,"SERVIÇO:  ","AQUISIÇÃO DE EMULSÃO ASFÁLTICA PARA IMPRIMAÇÃO (EAI) - EXCLUSIVE TRANSPORTE",null,"Referência:","CPU.5","UNIDADE: ",{"$f":"VLOOKUP(A28,ORÇAMENTO!$A$12:$L$43,7)","v":"T"}]
[]
[null,"TIPO ITEM","CODIGO ITEM","DESCRIÇÃO ITEM","UNIDADE ITEM","COEFICIENTE","PRECO UNITARIO","CUSTO TOTAL"]
[null,"INSUMO","ANP","EMULSÃO ASFÁLTICA PARA SERVIÇO DE IMPRIMAÇÃO (MEMÓRIA EM ANEXO)","T",1,2732.3744869653506,{"$f":"ROUNDDOWN(F33*G33,2)","v":2732.37}]
[null,"PRODUÇÃO DA EQUIPE",null,null,1,"CUSTO ",null,{"$f":"SUM(H33:H33)","v":2732.37}]
[null,"TOTAL",{"$nulls":5},{"$f":"H34/E34","v":2732.37}]
[null,"BDI                %",{"$nulls":5},{"$f":"1+$M$2","v":1.1499999999999999}]
[null,"TOTAL DO SERVIÇO - R$",{"$nulls":5},{"$f":"ROUND(H35*H36,2)","v":3142.23},"OK"]
[]
["F2","CODEVASF",null,null," COMPOSIÇÃO DE PREÇO UNITÁRIO",null,null,null,{"$f":"H46","v":341.88},{"$f":"H48","v":393.16}]
[null,"OBRA:  ","PAVIMENTAÇÃO ASFÁLTICA EM CBUQ DE VIAS EM COMUNIDADES RURAIS (COMUNIDADE MARIA PRETA, COMUNIDADE TIRIRICAL E DISTRITO DE SÃO NORBERTO - ENGENHEIRO NAVARRO / MG)",null,null,null,"DATA: ",{"$f":"$H$2","v":" SETEMBRO / 2025"}]
[null,"SERVIÇO:  ","TRANSPORTE DE EMULSÃO ASFÁLTICA PARA IMPRIMAÇÃO (EAI)",null,"Referência:","CPU.6","UNIDADE: ",{"$f":"VLOOKUP(A39,ORÇAMENTO!$A$12:$L$43,7)","v":"T"}]
[]
[null,"TIPO ITEM","CODIGO ITEM","DESCRIÇÃO ITEM","UNIDADE ITEM","COEFICIENTE","PRECO UNITARIO","CUSTO TOTAL"]
[null,"INSUMO"," - ","TRANSPORTE DE EMULSÃO ASFÁLTICA PARA IMPRIMAÇÃO (EAI), INCLUINDO CUSTO TOTAL DO TRANSPORTE (COMBUSTÍVEL, PEDÁGIOS, ETC.) E ICMS - MEMÓRIA ANEXA","T",1,341.88157894736844,{"$f":"ROUNDDOWN(F44*G44,2)","v":341.88}]
[null,"PRODUÇÃO DA EQUIPE",null,null,1,"CUSTO ",null,{"$f":"SUM(H44:H44)","v":341.88}]
[null,"TOTAL",{"$nulls":5},{"$f":"H45/E45","v":341.88}]
[null,"BDI                %",{"$nulls":5},{"$f":"1+$M$2","v":1.1499999999999999}]
[null,"TOTAL DO SERVIÇO - R$",{"$nulls":5},{"$f":"ROUND(H46*H47,2)","v":393.16},"OK"]
[]
["F3","CODEVASF",null,null," COMPOSIÇÃO DE PREÇO UNITÁRIO",null,null,null,{"$f":"H57","v":3375.89},{"$f":"H59","v":3882.27}]
[null,"OBRA:  ","PAVIMENTAÇÃO ASFÁLTICA EM CBUQ DE VIAS EM COMUNIDADES RURAIS (COMUNIDADE MARIA PRETA, COMUNIDADE TIRIRICAL E DISTRITO DE SÃO NORBERTO - ENGENHEIRO NAVARRO / MG)",null,null,null,"DATA: ",{"$f":"$H$2","v":" SETEMBRO / 2025"}]
[null,"SERVIÇO:  ","AQUISIÇÃO DE EMULSAO ASFALTICA CATIONICA RR-1C - EXCLUSIVE TRANSPORTE",null,"Referência:","CPU.7","UNIDADE: ",{"$f":"VLOOKUP(A50,ORÇAMENTO!$A$12:$L$43,7)","v":"T"}]
[]
[null,"TIPO ITEM","CODIGO ITEM","DESCRIÇÃO ITEM","UNIDADE ITEM","COEFICIENTE","PRECO UNITARIO","CUSTO TOTAL"]
[null,"INSUMO","ANP","EMULSÃO ASFÁLTICA CATIÔNICA RR-1C(MEMÓRIA EM ANEXO)","T",1,3375.8970747684684,{"$f":"ROUNDDOWN(F55*G55,2)","v":3375.89}]
[null,"PRODUÇÃO DA EQUIPE",null,null,1,"CUSTO ",null,{"$f":"SUM(H55:H55)","v":3375.89}]
[null,"TOTAL",{"$nulls":5},{"$f":"H56/E56","v":3375.89},"OK"]
[null,"BDI                %",{"$nulls":5},{"$f":"1+$M$2","v":1.1499999999999999}]
[null,"TOTAL DO SERVIÇO - R$",{"$nulls":5},{"$f":"ROUND(H57*H58,2)","v":3882.27}]
[]
["F4","CODEVASF",null,null," COMPOSIÇÃO DE PREÇO UNITÁRIO",null,null,null,{"$f":"H68","v":435.8},{"$f":"H70","v":501.17}]
[null,"OBRA:  ","PAVIMENTAÇÃO ASFÁLTICA EM CBUQ DE VIAS EM COMUNIDADES RURAIS (COMUNIDADE MARIA PRETA, COMUNIDADE TIRIRICAL E DISTRITO DE SÃO NORBERTO - ENGENHEIRO NAVARRO / MG)",null,null,null,"DATA: ",{"$f":"$H$2","v":" SETEMBRO / 2025"}]
[null,"SERVIÇO:  ","TRANSPORTE DE EMULSÃO ASFÁLTICA CATIONICA RR-1C",null,"Referência:","CPU.8","UNIDADE: ",{"$f":"VLOOKUP(A61,ORÇAMENTO!$A$12:$L$43,7)","v":"T"}]
[]
[null,"TIPO ITEM","CODIGO ITEM","DESCRIÇÃO ITEM","UNIDADE ITEM","COEFICIENTE","PRECO UNITARIO","CUSTO TOTAL"]
[null,"INSUMO"," - ","TRANSPORTE DE EMULSÃO ASFÁLTICA CATIONICA TIPO RR-1C, INCLUINDO CUSTO TOTAL DO TRANSPORTE (COMBUSTÍVEL, PEDÁGIOS, ETC.) E ICMS - MEMÓRIA ANEXA","T",1,435.80222222222221,{"$f":"ROUNDDOWN(F66*G66,2)","v":435.8}]
[null,"PRODUÇÃO DA EQUIPE",null,null,1,"CUSTO ",null,{"$f":"SUM(H66:H66)","v":435.8}]
[null,"TOTAL",{"$nulls":5},{"$f":"H67/E67","v":435.8},"OK"]
[null,"BDI                %",{"$nulls":5},{"$f":"1+$M$2","v":1.1499999999999999}]
[null,"TOTAL DO SERVIÇO - R$",{"$nulls":5},{"$f":"ROUND(H68*H69,2)","v":501.17}]
[]
["F5","CODEVASF",null,null," COMPOSIÇÃO DE PREÇO UNITÁRIO",null,null,null,{"$f":"H79","v":4511.6000000000004},{"$f":"H81","v":5188.34}]
[null,"OBRA:  ","PAVIMENTAÇÃO ASFÁLTICA EM CBUQ DE VIAS EM COMUNIDADES RURAIS (COMUNIDADE MARIA PRETA, COMUNIDADE TIRIRICAL E DISTRITO DE SÃO NORBERTO - ENGENHEIRO NAVARRO / MG)",null,null,null,"DATA: ",{"$f":"$H$2","v":" SETEMBRO / 2025"}]
[null,"SERVIÇO:  ","AQUISIÇÃO DE CONCRETO ASFÁLTICO DE PETRÓLEO - CAP 50/70 - EXCLUSIVE TRANSPORTE",null,"Referência:","CPU.9","UNIDADE: ",{"$f":"VLOOKUP(A72,ORÇAMENTO!$A$12:$L$43,7)","v":"T"}]
[]
[null,"TIPO ITEM","CODIGO ITEM","DESCRIÇÃO ITEM","UNIDADE ITEM","COEFICIENTE","PRECO UNITARIO","CUSTO TOTAL"]
[null,"INSUMO",1518,"CIMENTOS ASFÁLTICO DE PETRÓLEO TIPO CAP 50/70 (MEMÓRIA EM ANEXO)","T",1,4511.6031484658479,{"$f":"ROUNDDOWN(F77*G77,2)","v":4511.6000000000004}]
[null,"PRODUÇÃO DA EQUIPE",null,null,1,"CUSTO ",null,{"$f":"SUM(H77:H77)","v":4511.6000000000004}]
[null,"TOTAL",{"$nulls":5},{"$f":"H78/E78","v":4511.6000000000004}]
[null,"BDI                %",{"$nulls":5},{"$f":"1+$M$2","v":1.1499999999999999}]
[null,"TOTAL DO SERVIÇO - R$",{"$nulls":5},{"$f":"ROUND(H79*H80,2)","v":5188.34}]
[]
["F6","CODEVASF",null,null," COMPOSIÇÃO DE PREÇO UNITÁRIO",null,null,null,{"$f":"H90","v":690.07},{"$f":"H92","v":793.58}]
[null,"OBRA:  ","PAVIMENTAÇÃO ASFÁLTICA EM CBUQ DE VIAS EM COMUNIDADES RURAIS (COMUNIDADE MARIA PRETA, COMUNIDADE TIRIRICAL E DISTRITO DE SÃO NORBERTO - ENGENHEIRO NAVARRO / MG)",null,null,null,"DATA: ",{"$f":"$H$2","v":" SETEMBRO / 2025"}]
[null,"SERVIÇO:  ","TRANSPORTE DE CONCRETO ASFÁLTICO DE PETRÓLEO - CAP 50/70",null,"Referência:","CPU.10","UNIDADE: ",{"$f":"VLOOKUP(A83,ORÇAMENTO!$A$12:$L$43,7)","v":"T"}]
[]
[null,"TIPO ITEM","CODIGO ITEM","DESCRIÇÃO ITEM","UNIDADE ITEM","COEFICIENTE","PRECO UNITARIO","CUSTO TOTAL"]
[null,"INSUMO"," - ","TRANSPORTE DE CIMENTO ASFÁLTICO DE PETRÓLEO TIPO CAP 50-70, INCLUINDO CUSTO TOTAL DO TRANSPORTE (COMBUSTÍVEL, PEDÁGIOS, ETC.) E ICMS - MEMÓRIA ANEXA","T",1,690.07666666666671,{"$f":"ROUNDDOWN(F88*G88,2)","v":690.07}]
[null,"PRODUÇÃO DA EQUIPE",null,null,1,"CUSTO ",null,{"$f":"SUM(H88:H88)","v":690.07}]
[null,"TOTAL",{"$nulls":5},{"$f":"H89/E89","v":690.07}]
[null,"BDI                %",{"$nulls":5},{"$f":"1+$M$2","v":1.1499999999999999}]
[null,"TOTAL DO SERVIÇO - R$",{"$nulls":5},{"$f":"ROUND(H90*H91,2)","v":793.58}]

{"sheet":"AUX-VEIC.","index":3,"n_rows":31,"n_cols":6,"rows_kept":31,"cut":false,"hidden":false,"merged":[[25,2,25,3],[1,1,1,4],[2,1,2,2],[3,1,3,4],[17,1,17,4],[18,2,18,3],[19,2,19,3],[20,2,20,3],[21,2,21,3],[22,2,22,3],[23,2,23,3],[24,2,24,3],[26,2,26,3],[27,2,27,3],[28,2,28,3],[29,1,30,1],[29,2,29,3],[30,2,30,3]]}
[]
[null,"CÁLCULO DO CUSTO POR MÊS DE VEÍCULOS"]
[null,"Veículo: Polo TSI, Onix Turbo, Argo 1.3, HB-20 Turbo",null,"Data:","2025-07-28"]
[null,"DADOS ELEMENTARES DO VEÍCULO"]
[null,"Dados Básicos","Preço (R$)","Quantidade","Vida Útil"]
[null,"Quilometragem média mensal",null,3000]
[null,"Valor de Aquisição (VA)",103900]
[null,"Taxa de Juros (i)%",null,14.75]
[null,"IPVA e Seguro Obrigatório (4%)",{"$f":"0.04*C7","v":4156}]
[null,"Lavagem",50,2]
[null,"Pneus",479.9,4,50000]
[null,"Combustível",6.01,14]
[null,"Óleo Lubrificante + Filtros (revisão)",{"$f":"4*(188.59+213.69+186.16+283.83+186.16)/5","v":846.74400000000003},1,10000]
[null,"Seguro Total Anual",3378.94]
[null,"Jogo de Amortecedores",1287,null,50000]
[null,"Coeficiente de Manutenção",null,4.7999999999999998E-6]
[null,"Motorista",{"$f":"5284.47/1.7393","v":3038.2740182832176},1]
[null,"CÁLCULO DO CUSTO POR MÊS"]
[null,"DEPRECIAÇÃO","D = (VA-0,60xVA) / 12 x 5",null,{"$f":"(C7-(0.6*C7))/60","v":692.66666666666663},{"$f":"E19/E$30","v":0.16243931000033615}]
[null,"JUROS","J = (VA-0,60xVA) x i / 12",null,{"$f":"ROUND(((C7-0.6*C7)*D8/100)/12,2)","v":510.84},0.11979860027031529]
[null,"LICENCIAMENTO","L = (IPVA=SEG.OBRIG.)/12",null,{"$f":"ROUND(C9/12,2)","v":346.33},8.121887329030282E-2]
[null,"SEGURO TOTAL","ST = SEGURO ANUAL/12",null,{"$f":"ROUND(C14/12,2)","v":281.58},6.6034159157691993E-2]
[null,"COMBUSTÍVEL","OD = (Comb./Consu)x Km.mês",null,{"$f":"ROUND(C12/D12*D6,2)","v":1287.8599999999999},0.30201986012083676]
[null,"ÓLEO LUBRIFICANTE","OL = ((Ol. X Quant)/Vida Útil)xKm.mês)",null,{"$f":"ROUND(((C13*D13)/E13)*D6,2)","v":254.02},5.9570981991749851E-2]
[null,"LAVAGEM","LL = Preço Lavagem x Quantidade",null,{"$f":"ROUND(C10*D10,2)","v":100},2.3451295957700121E-2]
[null,"PNEUS","P = ((P. PneusxQuant)/Vida Útil)xkm.mês)",null,{"$f":"ROUND(((C11*D11)/E11)*D6,2)","v":115.18},2.7011202684079E-2]
[null,"AMORTECEDORES","AM = (P. Amort/Vida Útil)xkm.mês",null,{"$f":"ROUND(C15/E15*D6,2)","v":77.22},1.8109090738536032E-2]
[null,"MANUTENÇÃO","M = (VA-VPxK)xkm.mês",null,{"$f":"ROUND((C7-0.6*C7)*D16*D6,2)","v":598.46},0.14034662578845214]
[null,"MOTORISTA","MOT = SALÁRIO+LEIS SOCIAIS",null,{"$f":"ROUND((C17+C17*0.7368),2)","v":5276.87}]
[null,"CUSTO POR MÊS","SEM MOTORISTA",null,{"$f":"SUM(E19:E28)","v":4264.1566666666658},{"$f":"E30-E23","v":2976.2966666666662}]
[null,null,"COM MOTORISTA",null,{"$f":"E30+E29","v":9541.0266666666648}]

{"sheet":"BDI SERV","index":4,"n_rows":60,"n_cols":5,"rows_kept":60,"cut":false,"hidden":false,"merged":[[35,0,35,5],[36,0,36,5],[38,1,38,4],[39,2,39,3],[0,1,2,4],[25,1,25,3],[26,1,26,2],[26,3,26,4],[27,3,27,4]]}
[null,"DETALHAMENTO DO BDI - SERVIÇOS"]
[]
[]
[null,"Item","Descrição dos Serviços","% - PV","% - CD"]
[]
[null,1,"ADMINISTRAÇÃO CENTRAL"," ",{"$f":"SUM(E7:E9)","v":4.01}]
[null,"1.1","ESCRITÓRIO CENTRAL",null,4.01]
[null,"1.2","VIAGENS"]
[null,"1.3","OUTROS"]
[null," "," "," "," "]
[null,2,"IMPOSTOS E TAXAS",{"$f":"SUM(D12:D15)","v":8.65},{"$f":"SUM(E12:E15)","v":0}]
[null,"2.1","ISS - Proposta",{"$f":"D34*100","v":5}]
[null,"2.2","PIS",0.65]
[null,"2.3","Cofins",3]
[null,"2.4","Contribuição Previdenciaria (CPRB)"]
[]
[null,3,"TAXA DE RISCO",null,{"$f":"SUM(E18:E20)","v":0.96}]
[null,"3.1","SEGURO",null,0.2]
[null,"3.2","RISCO",null,0.56000000000000005]
[null,"3.3","GARANTIA",null,0.2]
[]
[null,4,"DESPESAS FINANCEIRAS",null,1.1100000000000001]
[]
[null,5,"LUCRO",null,7.3]
[]
[null,"BDI APRESENTADO:",null,null,{"$f":"IF($D$41=$C$43,$D$43,IF($D$41=$C$44,$D$44,IF($D$41=$C$44,$D$44,IF($D$41=$C$45,$D$45,0))))","v":24.67}]
[]
[null,null,"Legislação Municipal:","Código Tributário"]
[null,null,"Município:","Engenheiro Navarro-MG"]
[null,null,"Alíquota ISSQN:",0.05,"Município"]
[null,null,"Base de Cálculo:",1,"Art. 4º - Parágrafo Único"]
[null,null,"Valor Serviço:",843877.81]
[null,null,"Dedução - Material (estimado):"]
[null,null,"ISSQN BDI:",{"$f":"IF(D32=\"\",0,ROUND(IF(D31=D49,((1-(D33/D32))*D30),D30*D31),4))","v":0.05},"(*)"]
[]
["Acórdão nº 2.622/2013 - TCU Plenário"]
["BDI = ARRED((((((1+(AC+TR)/100)*(1+DF/100)*(1+L/100))/(1-IMP/100))-1)*100);2)"]
[]
[null,"(*) É obrigação da licitante a verificação da Legislação Tributária vigente no município, bem como o cálculo dos valores totais de serviços e materiais estimados, para apresentação de sua proposta."]
[]
[null,null,"Forma de Cálculo do BDI:","BDI - Acórdão nº 2.622/2013 - TCU"]
[]
[null,null,"BDI - Digitado",{"$f":"ROUND(E6+E11+E17+E22+E24,2)","v":13.38}]
[null,null,"BDI - Calculado",{"$f":"ROUND((((1+(E6/100+E22/100+E17/100))/(1-(D11/100+E24/100)))-1)*100,2)","v":26.21}]
[null,null,"BDI - Acórdão nº 2.622/2013 - TCU",{"$f":"ROUND((((((1+(E6+E17)/100)*(1+E22/100)*(1+E24/100))/(1-D11/100))-1)*100),2)","v":24.67}]
[]
[]
[]
[null,null,null,"Dedução - Material","Município"]
[null,null,null,0.1,"Simples Nacional"]
[null,null,null,0.2,"Municípios Indefinidos"]
[null,null,null,0.3]
[null,null,null,0.4]
[null,null,null,0.5]
[null,null,null,0.6]
[null,null,null,0.7]
[null,null,null,0.8]
[null,null,null,0.9]
[null,null,null,1]
[null,null,null,{"$f":"E31","v":"Art. 4º - Parágrafo Único"}]

{"sheet":"BDI FORN","index":5,"n_rows":37,"n_cols":5,"rows_kept":37,"cut":false,"hidden":false,"merged":[[31,1,31,2],[32,0,34,5],[36,0,36,5],[0,1,2,4],[3,1,4,1],[3,2,4,2],[28,0,28,5],[30,1,30,2]]}
[null,"DETALHAMENTO DO BDI - FORNECIMENTO \n(MATERIAL ASFÁLTICO)"]
[]
[]
[null,"Item","Descrição dos Serviços","%","%"]
[null,null,null,"PV","CD"]
[]
[null,1,"ADMINISTRAÇÃO CENTRAL"," ",3.45]
[null,"1.1","ESCRITÓRIO CENTRAL"," "," "]
[null,"1.2","VIAGENS"," "," "]
[null,"1.3","OUTROS"," "," "]
[null," "," "," "," "]
[null,2,"IMPOSTOS E TAXAS",{"$f":"SUM(D13:D16)","v":3.65},{"$f":"SUM(E13:E16)","v":4.5600000000000005}]
[null,"2.1","ISS (*)",null,{"$f":"ROUND(D13*1.2515,2)","v":0}]
[null,"2.2","PIS",0.65,{"$f":"ROUND(D14*1.2515,2)","v":0.81}]
[null,"2.3","Cofins",3,{"$f":"ROUND(D15*1.2515,2)","v":3.75}]
[null,"2.4","CONTRIBUIÇÃO PREVIDENCIÁRIA SOBRE A RENDA BRUTA",0,{"$f":"ROUND(D16*1.2515,2)","v":0}]
[]
[null,3,"TAXA DE RISCO"," ",{"$f":"SUM(E19:E22)","v":1.08}]
[null,"3.1","SEGURO",null,0.24]
[null,"3.2","RISCO",null,0.6]
[null,"3.3","GARANTIA",null,0.24]
[]
[null,4,"DESPESAS FINANCEIRAS"," ",0.85]
[]
[null,5,"LUCRO",null,5.1100000000000003]
[]
[null," ","BDI - CALCULADO"," ",{"$f":"ROUND((((1+(E7+E18)/100)*(1+E23/100)*(1+E25/100)/(1-D12/100)-1)*100),2)","v":15}]
[]
["BDI = ((1+((AC+S+R+G)/100))x(1+DF/100)x(1+L/100)/(1-I/100)-1)*100"]
[]
[null,"BDI (CALCULADO):",null,{"$f":"ROUND((((1+((E7+E18)/100))*(1+E23/100)*(1+E25/100))/(1-D12/100)-1)*100,2)","v":15},"%"]
[null," "]
[]
[]
[]
[]
["BDI EM CONFORMIDADE COM OS ACÓRDÃOS Nº 2369/2011 e ACÓRDÃO Nº 2.622/2013 - TCU - PLENÁRIO"]

{"sheet":"CRONOGRAMA","index":6,"n_rows":19,"n_cols":12,"rows_kept":19,"cut":false,"hidden":false,"merged":[[15,1,16,2],[18,1,22,11],[11,0,12,0],[11,1,12,1],[11,2,12,2],[13,0,14,0],[13,1,14,1],[13,2,14,2],[9,0,10,0],[9,1,10,1],[9,2,10,2],[3,1,3,10],[5,0,6,0],[5,1,6,1],[5,2,6,2],[7,0,8,0],[7,1,8,1],[7,2,8,2],[0,1,0,11],[1,1,2,1],[1,2,2,4],[1,6,1,11],[2,6,2,11]]}
[null,"CRONOGRAMA FÍSICO-FINANCEIRO"]
[null,"OBRA: ",{"$f":"ORÇAMENTO!C5","v":"PAVIMENTAÇÃO ASFÁLTICA EM CBUQ DE VIAS EM COMUNIDADES RURAIS (COMUNIDADE MARIA PRETA, COMUNIDADE TIRIRICAL E DISTRITO DE SÃO NORBERTO - ENGENHEIRO NAVARRO / MG)"},null,null,"VALOR:",{"$f":"ORÇAMENTO!L43","v":1428594.29}]
[{"$nulls":5},"PRAZO: ","180 DIAS "]
[]
[null,"ITEM","ETAPAS/DESCRIÇAO","FISICO/  FINANCEIRO","TOTAL  ETAPAS","MÊS 1","MÊS 2","MÊS 3","MÊS 4","MÊS 5","MÊS 6","TOTAL"]
["A",{"$f":"VLOOKUP(A6,ORÇAMENTO!$A$11:$L$43,2)","v":1},{"$f":"VLOOKUP(A6,ORÇAMENTO!$A$11:$L$43,5)","v":"SERVIÇOS PRELIMINARES "},"FISICO ",{"$f":"ROUND(E7/$G$2,4)","v":0.1545},0.25,0.15,0.15,0.15,0.15,0.15,{"$f":"SUM(F6:K6)","v":1}]
[null,null,null,"FINANCEIRO",{"$f":"ORÇAMENTO!L11","v":220664.00000000003},{"$f":"ROUND($E$7*F6,2)","v":55166},{"$f":"ROUND($E$7*G6,2)","v":33099.599999999999},{"$f":"ROUND($E$7*H6,2)","v":33099.599999999999},{"$f":"ROUND($E$7*I6,2)","v":33099.599999999999},33099.599999999999,33099.599999999999,{"$f":"SUM(F7:K7)","v":220664.00000000003}]
["B",{"$f":"VLOOKUP(A8,ORÇAMENTO!$A$11:$L$43,2)","v":2},{"$f":"VLOOKUP(A8,ORÇAMENTO!$A$11:$L$43,5)","v":"TERRAPLANAGEM E PAVIMENTAÇÃO"},"FISICO ",{"$f":"ROUND(E9/$G$2,4)","v":0.21840000000000001},0.15,0.25,0.25,0.25,0.1,null,{"$f":"SUM(F8:K8)","v":1}]
[null,null,null,"FINANCEIRO",{"$f":"ORÇAMENTO!L18","v":311973.90000000002},{"$f":"ROUND($E$9*F8,2)","v":46796.09},{"$f":"ROUND($E$9*G8,2)","v":77993.48},{"$f":"ROUND($E$9*H8,2)","v":77993.48},{"$f":"ROUND($E$9*I8,2)","v":77993.48},31197.39,0,{"$f":"SUM(F9:K9)","v":311973.92}]
["C",{"$f":"VLOOKUP(A10,ORÇAMENTO!$A$11:$L$43,2)","v":3},{"$f":"VLOOKUP(A10,ORÇAMENTO!$A$11:$L$43,5)","v":"TRANSPORTE DE MATERIAIS"},"FISICO ",{"$f":"ROUND(E11/$G$2,4)","v":0.1464},0.15,0.25,0.25,0.25,0.1,null,{"$f":"SUM(F10:K10)","v":1}]
[null,null,null,"FINANCEIRO",{"$f":"ORÇAMENTO!L25","v":209160},{"$f":"ROUND($E$11*F10,2)","v":31374},{"$f":"ROUND($E$11*G10,2)","v":52290},{"$f":"ROUND($E$11*H10,2)","v":52290},{"$f":"ROUND($E$11*I10,2)","v":52290},20916,0,{"$f":"SUM(F11:K11)-0.04","v":209159.96}]
["E",{"$f":"VLOOKUP(A12,ORÇAMENTO!$A$11:$L$43,2)","v":4},{"$f":"VLOOKUP(A12,ORÇAMENTO!$A$11:$L$43,5)","v":"DRENAGEM E OBRAS COMPLEMENTARES"},"FISICO ",{"$f":"ROUND(E13/$G$2,4)","v":0.2162},null,0.2,0.2,0.2,0.2,0.2,{"$f":"SUM(F12:K12)","v":1}]
[null,null,null,"FINANCEIRO",{"$f":"ORÇAMENTO!L31","v":308821.45},{"$f":"ROUND($E$13*F12,2)","v":0},{"$f":"ROUND($E$13*G12,2)","v":61764.29},{"$f":"ROUND($E$13*H12,2)","v":61764.29},{"$f":"ROUND($E$13*I12,2)","v":61764.29},61764.29,61764.29,{"$f":"SUM(F13:K13)-0.02","v":308821.43}]
["F",{"$f":"VLOOKUP(A14,ORÇAMENTO!$A$11:$L$43,2)","v":5},{"$f":"VLOOKUP(A14,ORÇAMENTO!$A$11:$L$43,5)","v":"FORNECIMENTOS - MATERIAL ASFÁLTICO (BDI DIFERENCIADO)"},"FISICO ",{"$f":"ROUND(E15/$G$2,4)","v":0.2646},null,null,0.25,0.5,0.25,null,{"$f":"SUM(F14:K14)","v":1}]
[null,null,null,"FINANCEIRO",{"$f":"ORÇAMENTO!L36","v":377974.93999999994},{"$f":"ROUND($E$15*F14,2)","v":0},0,94493.74,188987.47,94493.74,0,{"$f":"SUM(F15:K15)-0.02","v":377974.93}]
[null,"TOTAL",null,"FISICO ",{"$f":"SUM(F16:K16)","v":1.000000020999664},{"$f":"F17/$E$17","v":9.3333769379688625E-2},{"$f":"G17/$E$17","v":0.15760063691700743},{"$f":"H17/$E$17","v":0.22374519640562193},{"$f":"I17/$E$17","v":0.28988974889434849},0.169027009060774,6.6403660342223558E-2,{"$f":"SUM(F16:K16)","v":1.000000020999664}]
[null,null,null,"FINANCEIRO",{"$f":"E11+E9+E7+E15+E13","v":1428594.2899999998},{"$f":"F11+F9+F7+F15+F13","v":133336.09},{"$f":"G11+G9+G7+G15+G13","v":225147.37},319641.11,414134.83999999997,241471.02,94863.89,{"$f":"SUM(F17:K17)-0.03","v":1428594.2899999998}]
[]
[null,"OBSERVAÇÕES:"]