{"text_format":"2","workbook":"xlsx","n_sheets":8,"sheets":["ORÇAMENTO","CPU-SERV","AUX-VEIC.","CPU-FORNEC","BDI SERV","BDI SERV DIF","BDI FORN","CRONOGRAMA"],"not_rendered":{"charts":0,"images":1,"macros":0,"external_links":1,"defined_names":10,"comments":2,"pivot_tables":0},"unopened":[],"bounds":{"document_bytes":16777216,"sheet_cells":100000,"run_cost":"one","rows_first":2000,"rows_last":500,"rows_between":2000,"halvings":0,"cell_chars":16384,"cell_head_chars":4096},"cells_cut":0,"cells_raw":0,"read":"whole","date_system":"1900"}

{"sheet":"ORÇAMENTO","index":0,"n_rows":46,"n_cols":12,"rows_kept":46,"cut":false,"hidden":false,"merged":[[6,9,6,10],[5,2,5,8],[6,14,8,15],[45,1,45,4],[0,0,8,0],[0,4,0,11],[1,4,1,11],[2,4,2,11],[6,1,6,4],[9,14,9,15],[45,14,45,15],[7,1,7,11],[4,2,4,8],[4,9,4,10],[5,9,5,10]]}
["<---- NUMERAR SERVIÇOS PARA CPU",null,null,null,"Ministério do Desenvolvimento Regional"]
[{"$nulls":4},"Companhia de Desenvolvimento dos Vales do São Francisco e do Parnaíba"]
[{"$nulls":4},"1ª Superintendência Regional"]
[]
[null,"OBRA: "," PAVIMENTAÇÃO ASFÁLTICA EM CBUQ - VIAS URBANAS DIVERSAS - PAVÃO / MG",{"$nulls":6},"BDI Serviços % :",null,{"$f":"'BDI SERV'!E26","v":22.14}]
[null,"DATA:"," JUNHO / 2025",{"$nulls":6},"BDI Diferenc. Serviços % :",null,{"$f":"'BDI SERV DIF'!D31","v":15}]
[null," PRAZO DE EXECUÇÃO:     180 DIAS",{"$nulls":7},"BDI Fornecimentos % :",null,{"$f":"'BDI FORN'!D31","v":15}]
[null,"PLANILHA DE ORÇAMENTAÇÃO"]
[null,"ITEM","CÓDIGO","FONTE","DISCRIMINAÇÃO","TIPO","UNID.","QUANT.","VR.UNIT.S/BDI","PR. UNIT.C/BDI","C. TOT.S/BDI","P. TOT.C/BDI"]
["A",1,null,null,"SERVIÇOS PRELIMINARES ",{"$nulls":6},{"$f":"SUM(L11:L18)","v":387348.04}]
[1,"1.1","CPU.1","CODEVASF","MOBILIZAÇÃO E DESMOBILIZAÇÃO","SERV","GL",1,{"$f":"VLOOKUP(A11,'CPU-SERV'!A:K,11,0)","v":22455.89},{"$f":"TRUNC(_xlfn.IFS(F11=\"SERV\",I11*(1+$L$5/100),F11=\"SERV DIF\",I11*(1+$L$6/100),F11=\"FORN\",I11*(1+$L$7/100)),2)","v":27427.62},{"$f":"TRUNC(H11*I11,2)","v":22455.89},{"$f":"TRUNC(H11*J11,2)","v":27427.62}]
[2,"1.2","CPU.2","CODEVASF","ADMINISTRAÇÃO LOCAL ","SERV","GL",1,{"$f":"VLOOKUP(A12,'CPU-SERV'!A:K,11,0)","v":133368.93},{"$f":"TRUNC(_xlfn.IFS(F12=\"SERV\",I12*(1+$L$5/100),F12=\"SERV DIF\",I12*(1+$L$6/100),F12=\"FORN\",I12*(1+$L$7/100)),2)","v":162896.81},{"$f":"TRUNC(H12*I12,2)","v":133368.93},{"$f":"TRUNC(H12*J12,2)","v":162896.81}]
[3,"1.3","CPU.3","CODEVASF","CANTEIRO DE OBRAS ","SERV","GL",1,{"$f":"VLOOKUP(A13,'CPU-SERV'!A:K,11,0)","v":13722.3},{"$f":"TRUNC(_xlfn.IFS(F13=\"SERV\",I13*(1+$L$5/100),F13=\"SERV DIF\",I13*(1+$L$6/100),F13=\"FORN\",I13*(1+$L$7/100)),2)","v":16760.41},{"$f":"TRUNC(H13*I13,2)","v":13722.3},16760.41]
[4,"1.4",103689,"SINAPI","PLACA DE OBRA EM CHAPA DE AÇO GALVANIZADO","SERV","M2",4,{"$f":"VLOOKUP(A14,'CPU-SERV'!A:K,11,0)","v":543.91999999999996},{"$f":"TRUNC(_xlfn.IFS(F14=\"SERV\",I14*(1+$L$5/100),F14=\"SERV DIF\",I14*(1+$L$6/100),F14=\"FORN\",I14*(1+$L$7/100)),2)","v":664.34},{"$f":"TRUNC(H14*I14,2)","v":2175.6799999999998},2657.36]
[5,"1.5","CPU.4","CODEVASF","VEÍCULO PARA A FISCALIZAÇÃO, MÁXIMO 02 ANOS DE USO OU 50.000KM, PREFERENCIALMENTE NA COR BRANCA, COM IDENTIFICAÇÃO CONFORME ESPECIFICAÇÕES DA CODEVASF, INCLUSIVE COMBUSTÍVEL, MANUTENÇÃO, SEGURO E IMPOSTOS - CONFORME ESPECIFICAÇÕES","SERV","MÊS",8,{"$f":"VLOOKUP(A15,'CPU-SERV'!A:K,11,0)","v":4264.1499999999996},{"$f":"TRUNC(_xlfn.IFS(F15=\"SERV\",I15*(1+$L$5/100),F15=\"SERV DIF\",I15*(1+$L$6/100),F15=\"FORN\",I15*(1+$L$7/100)),2)","v":5208.2299999999996},{"$f":"TRUNC(H15*I15,2)","v":34113.199999999997},{"$f":"TRUNC(H15*J15,2)","v":41665.839999999997}]
{"$rows_left_out":32}
{"sheet":"CPU-SERV","index":1,"n_rows":1072,"n_cols":12,"rows_kept":1072,"cut":false,"hidden":false,"merged":[[671,1,672,2],[671,3,672,3],[671,4,671,5],[671,6,671,7],[676,7,676,9],[679,3,679,7],[680,3,680,7],[681,3,681,7],[684,7,684,9],[687,3,687,7],[688,7,688,9],[166,0,211,0],[167,2,167,9],[168,1,169,3],[168,4,168,5],[169,4,169,5],[170,2,170,7],[170,8,170,9],[171,1,172,2],[171,3,172,3],[171,4,171,5],[171,6,171,7],[176,7,176,9],[179,3,179,7],[180,3,180,7],[181,3,181,7],[184,7,184,9],[187,3,187,7],[188,7,188,9],[199,3,199,7],[201,8,201,9],[204,3,204,7],[7,13,7,15],[18,11,18,13],[30,8,30,9],[24,3,24,7],[4,2,4,7],[4,8,4,9],[5,1,6,2],[5,3,6,3],[5,4,5,5],[5,6,5,7],[573,0,625,0],[574,2,574,9],[575,1,576,3],[575,4,575,5],[576,4,576,5],[577,2,577,7],[577,8,577,9],[578,1,579,2],[578,3,579,3],[578,4,578,5],[578,6,578,7],[586,7,586,9],[588,3,588,7],[589,3,589,7],[590,3,590,7],[593,7,593,9],[602,3,602,7],[42,0,84,0],[43,2,43,9],[666,0,703,0],[44,1,45,3],[44,4,44,5],[45,4,45,5],[46,2,46,7],[46,8,46,9],[47,1,48,2],[0,0,40,0],[3,4,3,5],[0,11,0,12],[1,11,1,12],[2,4,2,5],[1,2,1,9],[2,1,3,3],[34,3,35,3],[34,4,35,4],[34,5,34,7],[34,9,35,9],[38,3,38,7],[39,5,39,7],[13,7,13,9],[16,3,16,7],[17,3,17,7],[18,3,18,7],[21,7,21,9],[33,3,33,7],[34,1,35,2],[25,7,25,9],[28,3,28,7],[2,10,2,11],[82,3,82,7],[83,5,83,7],[88,4,88,5],[77,3,77,7],[78,1,79,2],[78,3,79,3],[78,4,79,4],[78,5,78,7],[78,9,79,9],[60,3,60,7],[63,7,63,9],[66,3,66,7],[67,7,67,9],[72,3,72,7],[74,8,74,9],[47,3,48,3],[47,4,47,5],[47,6,47,7],[52,7,52,9],[58,3,58,7],[59,3,59,7],[117,1,118,2],[117,3,118,3],[117,4,118,4],[117,5,117,7],[117,9,118,9],[121,3,121,7],[96,7,96,9],[101,3,101,7],[104,7,104,9],[107,3,107,7],[108,7,108,9],[111,3,111,7],[86,0,123,0],[87,2,87,9],[88,1,89,3],[89,4,89,5],[90,2,90,7],[90,8,90,9],[91,1,92,2],[113,8,113,9],[116,3,116,7],[99,3,99,7],[100,3,100,7],[91,3,92,3],[91,4,91,5],[91,6,91,7],[139,3,139,7],[140,3,140,7],[143,7,143,9],[148,3,148,7],[149,7,149,9],[152,3,152,7],[130,1,131,2],[130,3,131,3],[130,4,130,5],[130,6,130,7],[135,7,135,9],[138,3,138,7],[122,5,122,7],[125,0,164,0],[126,2,126,9],[127,1,128,3],[127,4,127,5],[128,4,128,5],[129,2,129,7],[129,8,129,9],[162,3,162,7],[163,5,163,7],[307,3,307,7],[308,3,308,7],[311,7,311,9],[314,3,314,7],[315,7,315,9],[295,8,295,9],[296,1,297,2],[296,3,297,3],[296,4,296,5],[296,6,296,7],[301,7,301,9],[292,2,292,9],[293,1,294,3],[293,4,293,5],[294,4,294,5],[295,2,295,7],[154,8,154,9],[157,3,157,7],[158,1,159,2],[158,3,159,3],[158,4,159,4],[158,5,158,7],[158,9,159,9],[205,1,206,2],[205,3,206,3],[205,4,206,4],[205,5,205,7],[205,9,206,9],[209,3,209,7],[210,5,210,7],[332,0,369,0],[333,2,333,9],[334,1,335,3],[334,4,334,5],[335,4,335,5],[336,2,336,7],[318,3,318,7],[320,8,320,9],[323,3,323,7],[324,1,325,2],[324,3,325,3],[324,4,325,4],[324,5,324,7],[324,9,325,9],[357,3,357,7],[359,8,359,9],[362,3,362,7],[363,1,364,2],[363,3,364,3],[363,4,364,4],[363,5,363,7],[363,9,364,9],[345,3,345,7],[346,3,346,7],[336,8,336,9],[337,1,338,2],[337,3,338,3],[337,4,337,5],[291,0,330,0],[328,3,328,7],[329,5,329,7],[306,3,306,7],[375,8,375,9],[376,1,377,2],[376,3,377,3],[376,4,376,5],[337,6,337,7],[342,7,342,9],[367,3,367,7],[368,5,368,7],[347,3,347,7],[350,7,350,9],[353,3,353,7],[354,7,354,9],[414,0,453,0],[415,2,415,9],[416,1,417,3],[416,4,416,5],[417,4,417,5],[418,2,418,7],[451,3,451,7],[452,5,452,7],[371,0,412,0],[372,2,372,9],[373,1,374,3],[373,4,373,5],[374,4,374,5],[375,2,375,7],[400,3,400,7],[402,8,402,9],[405,3,405,7],[406,1,407,2],[406,3,407,3],[406,4,407,4],[376,6,376,7],[385,7,385,9],[429,3,429,7],[430,3,430,7],[431,3,431,7],[434,7,434,9],[437,3,437,7],[438,7,438,9],[418,8,418,9],[419,1,420,2],[419,3,420,3],[419,4,419,5],[419,6,419,7],[426,7,426,9],[410,3,410,7],[411,5,411,7],[390,3,390,7],[393,7,393,9],[396,3,396,7],[397,7,397,9],[441,3,441,7],[443,8,443,9],[446,3,446,7],[447,1,448,2],[447,3,448,3],[447,4,448,4],[447,5,447,7],[447,9,448,9],[486,1,487,2],[486,3,487,3],[486,4,487,4],[486,5,486,7],[486,9,487,9],[406,5,406,7],[406,9,407,9],[388,3,388,7],[389,3,389,7],[439,7,439,8],[459,8,459,9],[460,1,461,2],[460,3,461,3],[460,4,460,5],[460,6,460,7],[465,7,465,9],[533,0,571,0],[534,2,534,9],[535,1,536,3],[535,4,535,5],[536,4,536,5],[537,2,537,7],[569,3,569,7],[570,5,570,7],[513,7,513,8],[494,0,531,0],[495,2,495,9],[496,1,497,3],[496,4,496,5],[497,4,497,5],[498,2,498,7],[480,3,480,7],[482,8,482,9],[485,3,485,7],[455,0,492,0],[456,2,456,9],[457,1,458,3],[457,4,457,5],[458,4,458,5],[459,2,459,7],[490,3,490,7],[537,8,537,9],[538,1,539,2],[538,3,539,3],[538,4,538,5],[538,6,538,7],[544,7,544,9],[499,4,499,5],[468,3,468,7],[469,3,469,7],[470,3,470,7],[473,7,473,9],[476,3,476,7],[477,7,477,9],[491,5,491,7],[474,7,474,8],[507,3,507,7],[498,8,498,9],[499,1,500,2],[499,3,500,3],[499,6,499,7],[504,7,504,9],[547,3,547,7],[548,3,548,7],[529,3,529,7],[530,5,530,7],[508,3,508,7],[509,3,509,7],[512,7,512,9],[515,3,515,7],[516,7,516,9],[519,3,519,7],[521,8,521,9],[524,3,524,7],[525,1,526,2],[525,3,526,3],[525,4,526,4],[525,5,525,7],[525,9,526,9],[718,3,718,7],[719,3,719,7],[658,9,659,9],[603,7,603,9],[645,7,645,9],[648,3,648,7],[649,7,649,9],[631,8,631,9],[632,1,633,2],[632,3,633,3],[632,4,632,5],[632,6,632,7],[637,7,637,9],[549,3,549,7],[552,7,552,9],[555,3,555,7],[556,7,556,9],[559,3,559,7],[696,3,696,7],[697,1,698,2],[697,3,698,3],[697,4,698,4],[697,5,697,7],[697,9,698,9],[701,3,701,7],[702,5,702,7],[667,2,667,9],[668,1,669,3],[668,4,668,5],[669,4,669,5],[670,2,670,7],[670,8,670,9],[720,3,720,7],[723,7,723,9],[726,3,726,7],[631,2,631,7],[561,8,561,9],[564,3,564,7],[565,1,566,2],[565,3,566,3],[565,4,566,4],[565,5,565,7],[565,9,566,9],[615,1,616,2],[615,3,616,3],[615,4,616,4],[615,5,615,7],[615,9,616,9],[623,3,623,7],[605,3,605,7],[607,8,607,9],[614,3,614,7],[640,3,640,7],[598,7,598,8],[624,5,624,7],[652,3,652,7],[654,8,654,9],[657,3,657,7],[658,1,659,2],[658,3,659,3],[658,4,659,4],[658,5,658,7],[691,3,691,7],[693,8,693,9],[727,7,727,9],[709,8,709,9],[710,1,711,2],[710,3,711,3],[710,4,710,5],[710,6,710,7],[715,7,715,9],[662,3,662,7],[663,5,663,7],[705,0,742,0],[706,2,706,9],[707,1,708,3],[707,4,707,5],[708,4,708,5],[709,2,709,7],[740,3,740,7],[741,5,741,7],[627,0,664,0],[628,2,628,9],[629,1,630,3],[629,4,629,5],[630,4,630,5],[730,3,730,7],[732,8,732,9],[735,3,735,7],[736,1,737,2],[736,3,737,3],[736,4,737,4],[736,5,736,7],[736,9,737,9],[641,3,641,7],[642,3,642,7],[769,3,769,7],[771,8,771,9],[774,3,774,7],[775,1,776,2],[775,3,776,3],[775,4,776,4],[775,5,775,7],[775,9,776,9],[757,3,757,7],[758,3,758,7],[759,3,759,7],[762,7,762,9],[765,3,765,7],[766,7,766,9],[748,8,748,9],[749,1,750,2],[749,3,750,3],[749,4,749,5],[749,6,749,7],[754,7,754,9],[796,3,796,7],[797,3,797,7],[798,3,798,7],[801,7,801,9],[804,3,804,7],[805,7,805,9],[787,8,787,9],[788,1,789,2],[788,3,789,3],[788,4,788,5],[788,6,788,7],[793,7,793,9],[779,3,779,7],[780,5,780,7],[783,0,820,0],[784,2,784,9],[785,1,786,3],[785,4,785,5],[786,4,786,5],[787,2,787,7],[818,3,818,7],[819,5,819,7],[744,0,781,0],[745,2,745,9],[746,1,747,3],[746,4,746,5],[747,4,747,5],[748,2,748,7],[808,3,808,7],[810,8,810,9],[813,3,813,7],[814,1,815,2],[814,3,815,3],[814,4,815,4],[814,5,814,7],[814,9,815,9],[847,3,847,7],[849,8,849,9],[852,3,852,7],[853,1,854,2],[853,3,854,3],[853,4,854,4],[853,5,853,7],[853,9,854,9],[835,3,835,7],[836,3,836,7],[837,3,837,7],[840,7,840,9],[843,3,843,7],[844,7,844,9],[826,8,826,9],[827,1,828,2],[827,3,828,3],[827,4,827,5],[827,6,827,7],[832,7,832,9],[857,3,857,7],[858,5,858,7],[822,0,859,0],[823,2,823,9],[824,1,825,3],[824,4,824,5],[825,4,825,5],[826,2,826,7],[874,3,874,7],[875,3,875,7],[876,3,876,7],[879,7,879,9],[884,3,884,7],[885,7,885,9],[865,8,865,9],[866,1,867,2],[866,3,867,3],[866,4,866,5],[866,6,866,7],[871,7,871,9],[861,0,900,0],[862,2,862,9],[863,1,864,3],[863,4,863,5],[864,4,864,5],[865,2,865,7],[898,3,898,7],[899,5,899,7],[888,3,888,7],[890,8,890,9],[893,3,893,7],[894,1,895,2],[894,3,895,3],[894,4,895,4],[894,5,894,7],[894,9,895,9],[927,3,927,7],[929,8,929,9],[932,3,932,7],[933,1,934,2],[933,3,934,3],[933,4,934,4],[933,5,933,7],[933,9,934,9],[915,3,915,7],[916,3,916,7],[917,3,917,7],[920,7,920,9],[923,3,923,7],[924,7,924,9],[906,8,906,9],[907,1,908,2],[907,3,908,3],[907,4,907,5],[907,6,907,7],[912,7,912,9],[937,3,937,7],[938,5,938,7],[902,0,939,0],[903,2,903,9],[904,1,905,3],[904,4,904,5],[905,4,905,5],[906,2,906,7],[954,3,954,7],[955,3,955,7],[956,3,956,7],[959,7,959,9],[965,3,965,7],[966,7,966,9],[945,8,945,9],[946,1,947,2],[946,3,947,3],[946,4,946,5],[946,6,946,7],[951,7,951,9],[941,0,985,0],[942,2,942,9],[943,1,944,3],[943,4,943,5],[944,4,944,5],[945,2,945,7],[983,3,983,7],[984,5,984,7],[969,3,969,7],[971,8,971,9],[976,3,976,7],[977,1,978,2],[977,3,978,3],[977,4,978,4],[977,5,977,7],[977,9,978,9],[1000,3,1000,7],[1001,3,1001,7],[1002,3,1002,7],[1005,7,1005,9],[1011,3,1011,7],[1012,7,1012,9],[991,8,991,9],[992,1,993,2],[992,3,993,3],[992,4,992,5],[992,6,992,7],[997,7,997,9],[987,0,1031,0],[988,2,988,9],[989,1,990,3],[989,4,989,5],[990,4,990,5],[991,2,991,7],[1029,3,1029,7],[1030,5,1030,7],[1033,0,1071,0],[1033,11,1033,12],[1034,2,1034,9],[1034,11,1034,12],[1035,1,1036,3],[1035,4,1035,5],[1036,4,1036,5],[1037,2,1037,7],[1015,3,1015,7],[1017,8,1017,9],[1022,3,1022,7],[1023,1,1024,2],[1023,3,1024,3],[1023,4,1024,4],[1023,5,1023,7],[1023,9,1024,9],[1059,3,1059,7],[1061,8,1061,9],[1064,3,1064,7],[1065,1,1066,2],[1065,3,1066,3],[1065,4,1066,4],[1065,5,1065,7],[1065,9,1066,9],[1046,3,1046,7],[1047,3,1047,7],[1048,3,1048,7],[1051,7,1051,9],[1055,3,1055,7],[1056,7,1056,9],[1037,8,1037,9],[1038,1,1039,2],[1038,3,1039,3],[1038,4,1038,5],[1038,6,1038,7],[1043,7,1043,9],[1069,3,1069,7],[1070,5,1070,7],[213,0,250,0],[214,2,214,9],[215,1,216,3],[215,4,215,5],[216,4,216,5],[217,2,217,7],[217,8,217,9],[218,1,219,2],[218,3,219,3],[218,4,218,5],[218,6,218,7],[223,7,223,9],[226,3,226,7],[227,3,227,7],[228,3,228,7],[231,7,231,9],[234,3,234,7],[235,7,235,9],[238,3,238,7],[240,8,240,9],[243,3,243,7],[244,1,245,2],[244,3,245,3],[244,4,245,4],[244,5,244,7],[244,9,245,9],[248,3,248,7],[249,5,249,7],[252,0,289,0],[253,2,253,9],[254,1,255,3],[254,4,254,5],[255,4,255,5],[256,2,256,7],[256,8,256,9],[257,1,258,2],[257,3,258,3],[257,4,257,5],[257,6,257,7],[262,7,262,9],[265,3,265,7],[266,3,266,7],[267,3,267,7],[270,7,270,9],[273,3,273,7],[274,7,274,9],[277,3,277,7],[279,8,279,9],[282,3,282,7],[283,1,284,2],[283,3,284,3],[283,4,284,4],[283,5,283,7],[283,9,284,9],[287,3,287,7],[288,5,288,7]]}
[1,"1ª/GRD",{"$nulls":8},{"$f":"J40","v":22455.89},"Minas Gerais"]
[null,"OBRA:"," PAVIMENTAÇÃO ASFÁLTICA EM CBUQ - VIAS URBANAS DIVERSAS - PAVÃO / MG",{"$nulls":8}," Janeiro/2025 "]
[null,"Custo Unitário de Referência",null,null,"Minas Gerais"]
[{"$nulls":4}," Janeiro/2025 ",null,null,"Produção da equipe ",0.5,{"$f":"VLOOKUP(A1,ORÇAMENTO!$A$10:$L$46,7,1)","v":"GL"}]
[null,"CPU.1","MOBILIZAÇÃO E DESMOBILIZAÇÃO",{"$nulls":5},"Valores em reais (R$)"]
[null,"A - EQUIPAMENTOS",null,"Quantidade","Utilização",null,"Custo Horário",null,null,"Custo"]
[{"$nulls":4},"Operativa","Improdutiva","Produtivo","Improdutivo",null,"Horário Total"]
[null,"E9687","Caminhão carroceria com capacidade de 5 t - 115 kW",8,0.6,0.4,146.88079999999999,57.423099999999998,null,{"$f":"D8*(E8*G8+F8*H8)","v":888.78175999999996}]
[null,"E9571","Caminhão tanque com capacidade de 10.000 l - 188 kW",4,1,0,323.59019999999998,80.173299999999998,null,{"$f":"D9*(E9*G9+F9*H9)","v":1294.3607999999999}]
[null,"E9509","Caminhão tanque distribuidor de asfalto com capacidade de 6.000 l - 7 kW/136 kW",4,1,0,261.03050000000002,72.388300000000001,null,{"$f":"D10*(E10*G10+F10*H10)","v":1044.1220000000001}]
[null,"E9514","Distribuidor de agregados sobre pneus autopropelido - 130 kW",4,1,0,292.00130000000001,107.6279,null,{"$f":"D11*(E11*G11+F11*H11)","v":1168.0052000000001}]
[null,"E9575","Caminhão basculante com caçamba estanque com capacidade de 14 m³ - 210 kW",12,1,0,309.83940000000001,90.412199999999999,null,{"$f":"D12*(E12*G12+F12*H12)","v":3718.0727999999999}]
[{"$nulls":7},"Custo horário total de equipamentos",null,{"$f":"SUM(J8:J12)","v":8113.3425599999991}]
[null,"B - MÃO DE OBRA",null,"Quantidade","Unidade",null,"Custo Horário","Custo Horário Total"]
[null,"P9824","Servente",8,"h",null,21.3355,null,null,{"$f":"D15*G15","v":170.684}]
{"$rows_left_out":1058}
{"sheet":"AUX-VEIC.","index":2,"n_rows":31,"n_cols":5,"rows_kept":31,"cut":false,"hidden":false,"merged":[[26,2,26,3],[27,2,27,3],[28,2,28,3],[29,1,30,1],[29,2,29,3],[30,2,30,3],[20,2,20,3],[21,2,21,3],[22,2,22,3],[23,2,23,3],[24,2,24,3],[25,2,25,3],[1,1,1,4],[2,1,2,2],[3,1,3,4],[17,1,17,4],[18,2,18,3],[19,2,19,3]]}
[]
[null,"CÁLCULO DO CUSTO POR MÊS DE VEÍCULOS"]
[null,"Veículo: Polo TSI, Onix Turbo, Argo 1.3, HB-20 Turbo",null,"Data:","2025-05-28"]
[null,"DADOS ELEMENTARES DO VEÍCULO"]
[null,"Dados Básicos","Preço (R$)","Quantidade","Vida Útil"]
[null,"Quilometragem média mensal",null,3000]
[null,"Valor de Aquisição (VA)",103900]
[null,"Taxa de Juros (i)%",null,14.75]
[null,"IPVA e Seguro Obrigatório (4%)",{"$f":"0.04*C7","v":4156}]
[null,"Lavagem",50,2]
[null,"Pneus",479.9,4,50000]
[null,"Combustível",6.01,14]
[null,"Óleo Lubrificante + Filtros (revisão)",{"$f":"4*(188.59+213.69+186.16+283.83+186.16)/5","v":846.74400000000003},1,10000]
[null,"Seguro Total Anual",3378.94]
[null,"Jogo de Amortecedores",1287,null,50000]
{"$rows_left_out":17}
{"sheet":"CPU-FORNEC","index":3,"n_rows":92,"n_cols":14,"rows_kept":92,"cut":false,"hidden":false,"merged":[[71,0,80,0],[71,1,71,3],[71,4,71,7],[72,2,72,5],[73,2,73,3],[74,1,74,7],[77,1,77,3],[77,5,77,6],[78,1,78,6],[79,1,79,6],[80,1,80,6],[0,0,26,0],[0,1,0,3],[0,4,0,7],[22,1,22,3],[49,0,58,0],[49,1,49,3],[49,4,49,7],[50,2,50,5],[51,2,51,3],[52,1,52,7],[55,1,55,3],[55,5,55,6],[56,1,56,6],[57,1,57,6],[58,1,58,6],[27,1,27,3],[27,4,27,7],[28,2,28,5],[27,0,36,0],[29,2,29,3],[30,1,30,7],[33,1,33,3],[33,5,33,6],[34,1,34,6],[35,1,35,6],[36,1,36,6],[0,10,0,11],[1,2,1,5],[1,10,1,11],[2,2,2,3],[3,1,3,7],[22,5,22,6],[23,1,23,6],[24,1,24,6],[25,1,25,6],[5,1,5,7],[9,1,9,7],[13,1,13,7],[17,1,17,7],[38,0,47,0],[38,1,38,3],[38,4,38,7],[39,2,39,5],[40,2,40,3],[41,1,41,7],[44,1,44,3],[44,5,44,6],[45,1,45,6],[46,1,46,6],[47,1,47,6],[60,0,69,0],[60,1,60,3],[60,4,60,7],[61,2,61,5],[62,2,62,3],[63,1,63,7],[66,1,66,3],[66,5,66,6],[67,1,67,6],[68,1,68,6],[69,1,69,6],[81,1,81,7],[82,0,91,0],[82,1,82,3],[82,4,82,7],[83,2,83,5],[84,2,84,3],[85,1,85,7],[88,1,88,3],[88,5,88,6],[89,1,89,6],[90,1,90,6],[91,1,91,6]]}
[1,"CODEVASF",null,null," COMPOSIÇÃO DE PREÇO UNITÁRIO",null,null,null,{"$f":"H24","v":0},{"$f":"H26","v":0},"BDI CALCULADO:",null,{"$f":"ORÇAMENTO!L6","v":15}]
[null,"OBRA:  "," PAVIMENTAÇÃO ASFÁLTICA EM CBUQ - VIAS URBANAS DIVERSAS - PAVÃO / MG",null,null,null,"DATA: ",{"$f":"ORÇAMENTO!C6","v":" JUNHO / 2025"},null,null,"BDI DIFERENCIADO:",null,{"$f":"'BDI FORN'!D31/100","v":0.15}]
[null,"SERVIÇO:  ","CPU.1",null,"Referência:","CODEVASF","UNIDADE: ",{"$f":"VLOOKUP(A1,ORÇAMENTO!A11:L33,5)","v":"MOBILIZAÇÃO E DESMOBILIZAÇÃO"}]
[]
[null,"TIPO ITEM","CODIGO ITEM","DESCRIÇÃO ITEM","UNIDADE ITEM","COEFICIENTE","PRECO UNITARIO","CUSTO TOTAL",null,"distancia =",90,"B.DESPACHO"]
[null,"EQUIPAMENTOS",{"$nulls":7},"Pá carregadeira ",null,null,10.1," ton"]
[null,null,"E9001","E9001","E9001",null,"E9001"]
[]
[]
[null,"MÃO DE OBRA"]
[]
[]
[]
[null,"MATERIAIS"]
[]
{"$rows_left_out":78}
{"sheet":"BDI SERV","index":4,"n_rows":60,"n_cols":5,"rows_kept":60,"cut":false,"hidden":false,"merged":[[35,0,35,5],[36,0,36,5],[38,1,38,4],[39,2,39,3],[0,1,2,4],[25,1,25,3],[26,1,26,2],[26,3,26,4],[27,3,27,4]]}
[null,"DETALHAMENTO DO BDI - SERVIÇOS"]
[]
[]
[null,"Item","Descrição dos Serviços","% - PV","% - CD"]
[]
[null,1,"ADMINISTRAÇÃO CENTRAL"," ",{"$f":"SUM(E7:E9)","v":4.01}]
[null,"1.1","ESCRITÓRIO CENTRAL",null,4.01]
[null,"1.2","VIAGENS"]
[null,"1.3","OUTROS"]
[null," "," "," "," "]
[null,2,"IMPOSTOS E TAXAS",{"$f":"SUM(D12:D15)","v":6.15},{"$f":"SUM(E12:E15)","v":0}]
[null,"2.1","ISS - Proposta",{"$f":"D34*100","v":2.5}]
[null,"2.2","PIS",0.65]
[null,"2.3","Cofins",3]
[null,"2.4","Contribuição Previdenciaria (CPRB)"]
{"$rows_left_out":46}
{"sheet":"BDI SERV DIF","index":5,"n_rows":37,"n_cols":5,"rows_kept":37,"cut":false,"hidden":false,"merged":[[32,0,34,5],[36,0,36,5],[0,1,2,4],[3,1,4,1],[3,2,4,2],[28,0,28,5],[30,1,30,2],[31,1,31,2]]}
[null,"DETALHAMENTO DO BDI - \nTRANSPORTE DE MATERIAL ASFÁLTICO"]
[]
[]
[null,"Item","Descrição dos Serviços","%","%"]
[null,null,null,"PV","CD"]
[]
[null,1,"ADMINISTRAÇÃO CENTRAL"," ",3.45]
[null,"1.1","ESCRITÓRIO CENTRAL"," "," "]
[null,"1.2","VIAGENS"," "," "]
[null,"1.3","OUTROS"," "," "]
[null," "," "," "," "]
[null,2,"IMPOSTOS E TAXAS",{"$f":"SUM(D13:D16)","v":3.65},{"$f":"SUM(E13:E16)","v":4.5600000000000005}]
[null,"2.1","ISS (*)",null,{"$f":"ROUND(D13*1.2515,2)","v":0}]
[null,"2.2","PIS",0.65,{"$f":"ROUND(D14*1.2515,2)","v":0.81}]
[null,"2.3","Cofins",3,{"$f":"ROUND(D15*1.2515,2)","v":3.75}]
{"$rows_left_out":23}
{"sheet":"BDI FORN","index":6,"n_rows":37,"n_cols":5,"rows_kept":37,"cut":false,"hidden":false,"merged":[[31,1,31,2],[32,0,34,5],[36,0,36,5],[0,1,2,4],[3,1,4,1],[3,2,4,2],[28,0,28,5],[30,1,30,2]]}
[null,"DETALHAMENTO DO BDI - FORNECIMENTO \n(MATERIAL ASFÁLTICO)"]
[]
[]
[null,"Item","Descrição dos Serviços","%","%"]
[null,null,null,"PV","CD"]
[]
[null,1,"ADMINISTRAÇÃO CENTRAL"," ",3.45]
[null,"1.1","ESCRITÓRIO CENTRAL"," "," "]
[null,"1.2","VIAGENS"," "," "]
[null,"1.3","OUTROS"," "," "]
[null," "," "," "," "]
[null,2,"IMPOSTOS E TAXAS",{"$f":"SUM(D13:D16)","v":3.65},{"$f":"SUM(E13:E16)","v":4.5600000000000005}]
[null,"2.1","ISS (*)",null,{"$f":"ROUND(D13*1.2515,2)","v":0}]
[null,"2.2","PIS",0.65,{"$f":"ROUND(D14*1.2515,2)","v":0.81}]
[null,"2.3","Cofins",3,{"$f":"ROUND(D15*1.2515,2)","v":3.75}]
{"$rows_left_out":23}
{"sheet":"CRONOGRAMA","index":7,"n_rows":19,"n_cols":12,"rows_kept":19,"cut":false,"hidden":false,"merged":[[15,1,16,2],[18,1,22,11],[11,0,12,0],[11,1,12,1],[11,2,12,2],[13,0,14,0],[13,1,14,1],[13,2,14,2],[9,0,10,0],[9,1,10,1],[9,2,10,2],[3,1,3,10],[5,0,6,0],[5,1,6,1],[5,2,6,2],[7,0,8,0],[7,1,8,1],[7,2,8,2],[0,1,0,11],[1,1,2,1],[1,2,2,4],[1,6,1,11],[2,6,2,11]]}
[null,"CRONOGRAMA FÍSICO-FINANCEIRO"]
[null,"OBRA: ",{"$f":"ORÇAMENTO!C5","v":" PAVIMENTAÇÃO ASFÁLTICA EM CBUQ - VIAS URBANAS DIVERSAS - PAVÃO / MG"},null,null,"VALOR:",{"$f":"ORÇAMENTO!L46","v":2499956.6800000002}]
[{"$nulls":5},"PRAZO: ","180 DIAS "]
[]
[null,"ITEM","ETAPAS/DESCRIÇAO","FISICO/  FINANCEIRO","TOTAL    ETAPAS","MÊS 1","MÊS 2","MÊS 3","MÊS 4","MÊS 5","MÊS 6","TOTAL"]
["A",{"$f":"VLOOKUP(A6,ORÇAMENTO!$A$10:$L$46,2)","v":1},{"$f":"VLOOKUP(A6,ORÇAMENTO!$A$10:$L$46,5)","v":"SERVIÇOS PRELIMINARES "},"FISICO ",{"$f":"ROUND(E7/$G$2,4)","v":0.15490000000000001},0.25,0.15,0.15,0.15,0.15,0.15,{"$f":"SUM(F6:K6)","v":1}]
[null,null,null,"FINANCEIRO",{"$f":"ORÇAMENTO!L10","v":387348.04},{"$f":"ROUND($E$7*F6,2)","v":96837.01},{"$f":"ROUND($E$7*G6,2)","v":58102.21},{"$f":"ROUND($E$7*H6,2)","v":58102.21},{"$f":"ROUND($E$7*I6,2)","v":58102.21},58102.21,58102.21,{"$f":"SUM(F7:K7)","v":387348.06000000006}]
["B",{"$f":"VLOOKUP(A8,ORÇAMENTO!$A$10:$L$46,2)","v":2},{"$f":"VLOOKUP(A8,ORÇAMENTO!$A$10:$L$46,5)","v":"TERRAPLANAGEM E PAVIMENTAÇÃO"},"FISICO ",{"$f":"ROUND(E9/$G$2,4)","v":0.27379999999999999},0.1,0.2,0.2,0.2,0.2,0.1,{"$f":"SUM(F8:K8)","v":0.99999999999999989}]
[null,null,null,"FINANCEIRO",{"$f":"ORÇAMENTO!L19","v":684567},{"$f":"ROUND($E$9*F8,2)","v":68456.7},{"$f":"ROUND($E$9*G8,2)","v":136913.4},{"$f":"ROUND($E$9*H8,2)","v":136913.4},{"$f":"ROUND($E$9*I8,2)","v":136913.4},136913.4,68456.7,{"$f":"SUM(F9:K9)","v":684567}]
["C",{"$f":"VLOOKUP(A10,ORÇAMENTO!$A$10:$L$46,2)","v":3},{"$f":"VLOOKUP(A10,ORÇAMENTO!$A$10:$L$46,5)","v":"TRANSPORTE DE MATERIAIS"},"FISICO ",{"$f":"ROUND(E11/$G$2,4)","v":0.20760000000000001},0.25,0.5,0.25,null,null,null,{"$f":"SUM(F10:K10)","v":1}]
[null,null,null,"FINANCEIRO",{"$f":"ORÇAMENTO!L26","v":518908},{"$f":"ROUND($E$11*F10,2)","v":129727},{"$f":"ROUND($E$11*G10,2)","v":259454},{"$f":"ROUND($E$11*H10,2)","v":129727},{"$f":"ROUND($E$11*I10,2)","v":0},0,0,{"$f":"SUM(F11:K11)-0.04","v":518907.96}]
["E",{"$f":"VLOOKUP(A12,ORÇAMENTO!$A$10:$L$46,2)","v":4},{"$f":"VLOOKUP(A12,ORÇAMENTO!$A$10:$L$46,5)","v":"DRENAGEM E OBRAS COMPLEMENTARES"},"FISICO ",{"$f":"ROUND(E13/$G$2,4)","v":0.11070000000000001},null,0.2,0.2,0.2,0.2,0.2,{"$f":"SUM(F12:K12)","v":1}]
[null,null,null,"FINANCEIRO",{"$f":"ORÇAMENTO!L32","v":276750.66000000003},{"$f":"ROUND($E$13*F12,2)","v":0},{"$f":"ROUND($E$13*G12,2)","v":55350.13},{"$f":"ROUND($E$13*H12,2)","v":55350.13},{"$f":"ROUND($E$13*I12,2)","v":55350.13},55350.13,55350.13,{"$f":"SUM(F13:K13)-0.02","v":276750.62999999995}]
["F",{"$f":"VLOOKUP(A14,ORÇAMENTO!$A$10:$L$46,2)","v":5},{"$f":"VLOOKUP(A14,ORÇAMENTO!$A$10:$L$46,5)","v":"FORNECIMENTOS - MATERIAL ASFÁLTICO (BDI DIFERENCIADO)"},"FISICO ",{"$f":"ROUND(E15/$G$2,4)","v":0.253},null,0.2,0.2,0.2,0.2,0.2,{"$f":"SUM(F14:K14)","v":1}]
[null,null,null,"FINANCEIRO",{"$f":"ORÇAMENTO!L39","v":632382.98},{"$f":"ROUND($E$15*F14,2)","v":0},126476.6,126476.6,126476.6,126476.6,126476.6,{"$f":"SUM(F15:K15)-0.02","v":632382.98}]
{"$rows_left_out":4}