{"text_format":"2","workbook":"xlsx","n_sheets":11,"sheets":["ORÇAMENTO","CPU-SERV","CPU-FORNEC","AUX-VEIC.","BDI SERV","BDI FORN","CRONOGRAMA","EAI","RR-1C","CAP","MAT.ASF"],"not_rendered":{"charts":0,"images":4,"macros":0,"external_links":2,"defined_names":13,"comments":5,"pivot_tables":0},"unopened":[],"bounds":{"document_bytes":16777216,"sheet_cells":100000,"run_cost":"one","rows_first":2000,"rows_last":500,"rows_between":2000,"halvings":0,"cell_chars":16384,"cell_head_chars":4096},"cells_cut":0,"cells_raw":0,"read":"whole","date_system":"1900"}

{"sheet":"ORÇAMENTO","index":0,"n_rows":43,"n_cols":12,"rows_kept":43,"cut":false,"hidden":false,"merged":[[9,14,9,16],[42,1,42,4],[0,0,8,0],[0,4,0,11],[1,4,1,11],[2,4,2,11],[6,1,6,4],[4,9,4,10],[5,8,5,10],[4,2,4,7],[5,2,5,4],[6,9,6,10],[7,1,7,11]]}
["<---- NUMERAR SERVIÇOS PARA CPU",null,null,null,"Ministério do Desenvolvimento Regional"]
[{"$nulls":4},"Companhia de Desenvolvimento dos Vales do São Francisco e do Parnaíba"]
[{"$nulls":4},"1ª Superintendência Regional"]
[]
[null,"OBRA: ","PAVIMENTAÇÃO ASFÁLTICA EM CBUQ - VIAS URBANAS DIVERSAS (MATO VERDE / MG)",{"$nulls":6},"BDI Serviços (%):",null,{"$f":"'BDI SERV'!E26","v":21.62}]
[null,"DATA:"," AGOSTO / 2025",{"$nulls":5},"BDI Diferenciado Serviços (%):",null,null,{"$f":"'BDI FORN'!D31","v":15}]
[null," PRAZO DE EXECUÇÃO:     240 DIAS",{"$nulls":7},"BDI Fornecimentos (%):",null,{"$f":"'BDI FORN'!D31","v":15}]
[null,"PLANILHA DE ORÇAMENTAÇÃO"]
{"$rows_left_out":36}
{"sheet":"CPU-SERV","index":1,"n_rows":952,"n_cols":16,"rows_kept":952,"cut":false,"hidden":false,"merged":[[163,0,208,0],[165,4,165,5],[166,4,166,5],[167,2,167,7],[167,8,167,9],[168,1,169,2],[168,3,169,3],[168,4,168,5],[168,6,168,7],[173,7,173,9],[176,3,176,7],[177,3,177,7],[178,3,178,7],[181,7,181,9],[184,3,184,7],[185,7,185,9],[196,3,196,7],[198,8,198,9],[907,0,951,0],[908,2,908,9],[909,1,910,3],[909,4,909,5],[910,4,910,5],[911,2,911,7],[949,3,949,7],[950,5,950,7],[935,3,935,7],[937,8,937,9],[942,3,942,7],[943,1,944,2],[943,3,944,3],[943,4,944,4],[943,5,943,7],[943,9,944,9],[920,3,920,7],[921,3,921,7],[922,3,922,7],[925,7,925,9],[931,3,931,7],[932,7,932,9],[911,8,911,9],[912,1,913,2],[912,3,913,3],[912,4,912,5],[912,6,912,7],[917,7,917,9],[861,0,905,0],[862,2,862,9],[863,1,864,3],[863,4,863,5],[864,4,864,5],[865,2,865,7],[903,3,903,7],[904,5,904,7],[889,3,889,7],[891,8,891,9],[896,3,896,7],[897,1,898,2],[897,3,898,3],[897,4,898,4],[897,5,897,7],[897,9,898,9],[874,3,874,7],[875,3,875,7],[876,3,876,7],[879,7,879,9],[885,3,885,7],[886,7,886,9],[865,8,865,9],[866,1,867,2],[866,3,867,3],[866,4,866,5],[866,6,866,7],[871,7,871,9],[826,8,826,9],[827,1,828,2],[827,3,828,3],[827,4,827,5],[827,6,827,7],[832,7,832,9],[857,3,857,7],[858,5,858,7],[822,0,859,0],[823,2,823,9],[824,1,825,3],[824,4,824,5],[825,4,825,5],[826,2,826,7],[847,3,847,7],[849,8,849,9],[852,3,852,7],[853,1,854,2],[853,3,854,3],[853,4,854,4],[853,5,853,7],[853,9,854,9],[835,3,835,7],[836,3,836,7],[837,3,837,7],[840,7,840,9],[843,3,843,7],[844,7,844,9],[781,0,820,0],[782,2,782,9],[783,1,784,3],[783,4,783,5],[784,4,784,5],[785,2,785,7],[818,3,818,7],[819,5,819,7],[808,3,808,7],[810,8,810,9],[813,3,813,7],[814,1,815,2],[814,3,815,3],[814,4,815,4],[814,5,814,7],[814,9,815,9],[794,3,794,7],[795,3,795,7],[796,3,796,7],[799,7,799,9],[804,3,804,7],[805,7,805,9],[785,8,785,9],[786,1,787,2],[786,3,787,3],[786,4,786,5],[786,6,786,7],[791,7,791,9],[746,8,746,9],[747,1,748,2],[747,3,748,3],[747,4,747,5],[747,6,747,7],[752,7,752,9],[777,3,777,7],[778,5,778,7],[742,0,779,0],[743,2,743,9],[744,1,745,3],[744,4,744,5],[745,4,745,5],[746,2,746,7],[767,3,767,7],[769,8,769,9],[772,3,772,7],[773,1,774,2],[773,3,774,3],[773,4,774,4],[773,5,773,7],[773,9,774,9],[755,3,755,7],[756,3,756,7],[757,3,757,7],[760,7,760,9],[763,3,763,7],[764,7,764,9],[703,0,740,0],[704,2,704,9],[705,1,706,3],[705,4,705,5],[706,4,706,5],[707,2,707,7],[738,3,738,7],[739,5,739,7],[664,0,701,0],[665,2,665,9],[666,1,667,3],[666,4,666,5],[667,4,667,5],[668,2,668,7],[728,3,728,7],[730,8,730,9],[733,3,733,7],[734,1,735,2],[734,3,735,3],[734,4,735,4],[734,5,734,7],[734,9,735,9],[721,7,721,9],[724,3,724,7],[725,7,725,9],[707,8,707,9],[708,1,709,2],[708,3,709,3],[708,4,708,5],[708,6,708,7],[713,7,713,9],[668,8,668,9],[669,1,670,2],[669,3,670,3],[669,4,669,5],[669,6,669,7],[674,7,674,9],[716,3,716,7],[717,3,717,7],[718,3,718,7],[699,3,699,7],[700,5,700,7],[689,3,689,7],[691,8,691,9],[694,3,694,7],[695,1,696,2],[695,3,696,3],[695,4,696,4],[695,5,695,7],[695,9,696,9],[677,3,677,7],[678,3,678,7],[679,3,679,7],[682,7,682,9],[685,3,685,7],[686,7,686,9],[625,0,662,0],[626,2,626,9],[627,1,628,3],[627,4,627,5],[628,4,628,5],[629,2,629,7],[660,3,660,7],[661,5,661,7],[547,0,584,0],[548,2,548,9],[549,1,550,3],[549,4,549,5],[550,4,550,5],[650,3,650,7],[652,8,652,9],[655,3,655,7],[656,1,657,2],[656,3,657,3],[656,4,657,4],[656,5,656,7],[656,9,657,9],[561,3,561,7],[562,3,562,7],[647,7,647,9],[629,8,629,9],[630,1,631,2],[630,3,631,3],[630,4,630,5],[630,6,630,7],[635,7,635,9],[582,3,582,7],[583,5,583,7],[646,3,646,7],[551,2,551,7],[482,8,482,9],[485,3,485,7],[486,1,487,2],[486,3,487,3],[486,4,487,4],[486,5,486,7],[486,9,487,9],[536,1,537,2],[536,3,537,3],[536,4,537,4],[536,5,536,7],[536,9,537,9],[544,3,544,7],[526,3,526,7],[528,8,528,9],[535,3,535,7],[560,3,560,7],[498,2,498,4],[498,5,498,7],[552,1,553,2],[552,3,553,3],[552,4,552,5],[552,6,552,7],[557,7,557,9],[638,3,638,7],[639,3,639,7],[640,3,640,7],[643,7,643,9],[430,3,430,7],[433,7,433,9],[436,3,436,7],[437,7,437,9],[524,7,524,9],[565,7,565,9],[568,3,568,7],[569,7,569,9],[551,8,551,9],[572,3,572,7],[574,8,574,9],[577,3,577,7],[578,1,579,2],[578,3,579,3],[578,4,579,4],[578,5,578,7],[578,9,579,9],[420,6,420,7],[425,7,425,9],[468,3,468,7],[469,3,469,7],[470,3,470,7],[473,7,473,9],[476,3,476,7],[477,7,477,9],[458,8,458,9],[459,1,460,2],[459,3,460,3],[459,4,459,5],[459,6,459,7],[465,7,465,9],[450,3,450,7],[451,5,451,7],[434,7,434,8],[415,0,452,0],[416,2,416,9],[417,1,418,3],[417,4,417,5],[418,4,418,5],[419,2,419,7],[401,3,401,7],[403,8,403,9],[406,3,406,7],[407,1,408,2],[407,3,408,3],[407,4,408,4],[407,5,407,7],[407,9,408,9],[440,3,440,7],[442,8,442,9],[445,3,445,7],[446,1,447,2],[446,3,447,3],[446,4,447,4],[446,5,446,7],[446,9,447,9],[429,3,429,7],[480,3,480,7],[454,0,492,0],[455,2,455,9],[456,1,457,3],[456,4,456,5],[457,4,457,5],[458,2,458,7],[490,3,490,7],[491,5,491,7],[362,3,362,7],[364,8,364,9],[367,3,367,7],[368,1,369,2],[368,3,369,3],[368,4,369,4],[368,5,368,7],[368,9,369,9],[428,3,428,7],[419,8,419,9],[420,1,421,2],[420,3,421,3],[420,4,420,5],[389,3,389,7],[390,3,390,7],[391,3,391,7],[394,7,394,9],[397,3,397,7],[398,7,398,9],[380,8,380,9],[381,1,382,2],[381,3,382,3],[381,4,381,5],[381,6,381,7],[376,0,413,0],[377,2,377,9],[378,1,379,3],[378,4,378,5],[379,4,379,5],[380,2,380,7],[411,3,411,7],[412,5,412,7],[395,7,395,8],[386,7,386,9],[304,7,304,9],[350,3,350,7],[351,3,351,7],[352,3,352,7],[355,7,355,9],[358,3,358,7],[359,7,359,9],[337,8,337,9],[338,1,339,2],[338,3,339,3],[338,4,338,5],[338,6,338,7],[347,7,347,9],[329,3,329,7],[330,5,330,7],[309,3,309,7],[312,7,312,9],[315,3,315,7],[316,7,316,9],[333,0,374,0],[334,2,334,9],[335,1,336,3],[335,4,335,5],[336,4,336,5],[337,2,337,7],[372,3,372,7],[373,5,373,7],[290,0,331,0],[291,2,291,9],[292,1,293,3],[292,4,292,5],[293,4,293,5],[294,2,294,7],[319,3,319,7],[321,8,321,9],[324,3,324,7],[325,1,326,2],[325,3,326,3],[325,4,326,4],[325,5,325,7],[325,9,326,9],[307,3,307,7],[308,3,308,7],[295,1,296,2],[295,3,296,3],[295,4,295,5],[256,6,256,7],[261,7,261,9],[286,3,286,7],[287,5,287,7],[266,3,266,7],[269,7,269,9],[272,3,272,7],[273,7,273,9],[295,6,295,7],[255,8,255,9],[256,1,257,2],[256,3,257,3],[256,4,256,5],[210,0,249,0],[247,3,247,7],[248,5,248,7],[225,3,225,7],[294,8,294,9],[251,0,288,0],[252,2,252,9],[253,1,254,3],[253,4,253,5],[254,4,254,5],[255,2,255,7],[237,3,237,7],[239,8,239,9],[242,3,242,7],[243,1,244,2],[243,3,244,3],[243,4,244,4],[243,5,243,7],[243,9,244,9],[276,3,276,7],[278,8,278,9],[281,3,281,7],[282,1,283,2],[282,3,283,3],[282,4,283,4],[282,5,282,7],[282,9,283,9],[264,3,264,7],[265,3,265,7],[211,2,211,9],[212,1,213,3],[212,4,212,5],[213,4,213,5],[214,2,214,7],[151,8,151,9],[154,3,154,7],[155,1,156,2],[155,3,156,3],[155,4,156,4],[155,5,155,7],[155,9,156,9],[164,2,164,9],[165,1,166,3],[201,3,201,7],[202,1,203,2],[202,3,203,3],[202,4,203,4],[202,5,202,7],[202,9,203,9],[206,3,206,7],[207,5,207,7],[226,3,226,7],[227,3,227,7],[230,7,230,9],[233,3,233,7],[234,7,234,9],[214,8,214,9],[215,1,216,2],[215,3,216,3],[215,4,215,5],[215,6,215,7],[220,7,220,9],[122,0,161,0],[123,2,123,9],[124,1,125,3],[124,4,124,5],[125,4,125,5],[126,2,126,7],[126,8,126,9],[159,3,159,7],[160,5,160,7],[136,3,136,7],[137,3,137,7],[140,7,140,9],[145,3,145,7],[146,7,146,9],[149,3,149,7],[127,1,128,2],[127,3,128,3],[127,4,127,5],[127,6,127,7],[132,7,132,9],[135,3,135,7],[118,3,118,7],[93,7,93,9],[98,3,98,7],[101,7,101,9],[104,3,104,7],[105,7,105,9],[108,3,108,7],[83,0,120,0],[84,2,84,9],[85,1,86,3],[86,4,86,5],[87,2,87,7],[87,8,87,9],[88,1,89,2],[110,8,110,9],[113,3,113,7],[96,3,96,7],[97,3,97,7],[88,3,89,3],[88,4,88,5],[88,6,88,7],[119,5,119,7],[44,3,45,3],[44,4,44,5],[44,6,44,7],[49,7,49,9],[55,3,55,7],[56,3,56,7],[114,1,115,2],[114,3,115,3],[114,4,115,4],[114,5,114,7],[114,9,115,9],[0,0,37,0],[3,4,3,5],[0,11,0,12],[1,11,1,12],[2,4,2,5],[1,2,1,9],[2,1,3,3],[31,3,32,3],[31,4,32,4],[31,5,31,7],[31,9,32,9],[35,3,35,7],[36,5,36,7],[10,7,10,9],[13,3,13,7],[14,3,14,7],[15,3,15,7],[18,7,18,9],[30,3,30,7],[31,1,32,2],[22,7,22,9],[25,3,25,7],[2,10,2,11],[39,0,81,0],[40,2,40,9],[586,0,623,0],[41,1,42,3],[41,4,41,5],[42,4,42,5],[43,2,43,7],[43,8,43,9],[44,1,45,2],[79,3,79,7],[80,5,80,7],[85,4,85,5],[74,3,74,7],[75,1,76,2],[75,3,76,3],[75,4,76,4],[75,5,75,7],[75,9,76,9],[57,3,57,7],[60,7,60,9],[63,3,63,7],[64,7,64,9],[69,3,69,7],[71,8,71,9],[494,0,545,0],[495,2,495,9],[496,1,497,3],[496,4,496,5],[497,4,497,5],[498,8,498,9],[499,1,500,2],[499,3,500,3],[499,4,499,5],[499,6,499,7],[507,7,507,9],[509,3,509,7],[510,3,510,7],[511,3,511,7],[514,7,514,9],[523,3,523,7],[519,7,519,8],[545,5,545,7],[7,13,7,15],[15,11,15,13],[27,8,27,9],[21,3,21,7],[4,2,4,7],[4,8,4,9],[5,1,6,2],[5,3,6,3],[5,4,5,5],[5,6,5,7],[622,5,622,7],[587,2,587,9],[588,1,589,3],[588,4,588,5],[589,4,589,5],[590,2,590,7],[590,8,590,9],[591,1,592,2],[591,3,592,3],[591,4,591,5],[591,6,591,7],[596,7,596,9],[599,3,599,7],[600,3,600,7],[601,3,601,7],[604,7,604,9],[607,3,607,7],[608,7,608,9],[611,3,611,7],[613,8,613,9],[616,3,616,7],[617,1,618,2],[617,3,618,3],[617,4,618,4],[617,5,617,7],[617,9,618,9],[621,3,621,7]]}
[1,"1ª/GRD",{"$nulls":8},{"$f":"J37","v":15816.96},"Minas Gerais"]
[null,"OBRA:","PAVIMENTAÇÃO ASFÁLTICA EM CBUQ - VIAS URBANAS DIVERSAS (MATO VERDE / MG)",{"$nulls":8}," Abril/2025 "]
[null,"Custo Unitário de Referência",null,null,"Minas Gerais",{"$nulls":5},"QUANT.MATERIAL:",null,{"$f":"SUM(M20:M953)","v":0},{"$f":"M3/(ORÇAMENTO!L43-ORÇAMENTO!L36)","v":0}]
[{"$nulls":4}," Abril/2025 ",null,null,"Produção da equipe ",0.5,{"$f":"VLOOKUP(A1,ORÇAMENTO!$A$10:$L$43,7,1)","v":"GL"}]
[null,"CPU.1","MOBILIZAÇÃO E DESMOBILIZAÇÃO",{"$nulls":5},"Valores em reais (R$)"]
[null,"A - EQUIPAMENTOS",null,"Quantidade","Utilização",null,"Custo Horário",null,null,"Custo"]
[{"$nulls":4},"Operativa","Improdutiva","Produtivo","Improdutivo",null,"Horário Total"]
[null,"E9687","Caminhão carroceria com capacidade de 5 t - 120 kW",8,0.6,0.4,154.82689999999999,59.719900000000003,null,{"$f":"D8*(E8*G8+F8*H8)","v":934.27279999999996},null,"distancia =",220,"MOC"]
{"$rows_left_out":945}
{"sheet":"CPU-FORNEC","index":2,"n_rows":92,"n_cols":14,"rows_kept":92,"cut":false,"hidden":false,"merged":[[81,1,81,7],[82,0,91,0],[82,1,82,3],[82,4,82,7],[83,2,83,5],[84,2,84,3],[85,1,85,7],[88,1,88,3],[88,5,88,6],[89,1,89,6],[90,1,90,6],[91,1,91,6],[60,0,69,0],[60,1,60,3],[60,4,60,7],[61,2,61,5],[62,2,62,3],[63,1,63,7],[66,1,66,3],[66,5,66,6],[67,1,67,6],[68,1,68,6],[69,1,69,6],[38,0,47,0],[38,1,38,3],[38,4,38,7],[39,2,39,5],[40,2,40,3],[41,1,41,7],[44,1,44,3],[44,5,44,6],[45,1,45,6],[46,1,46,6],[47,1,47,6],[22,5,22,6],[23,1,23,6],[24,1,24,6],[25,1,25,6],[5,1,5,7],[9,1,9,7],[13,1,13,7],[17,1,17,7],[0,10,0,11],[1,2,1,5],[1,10,1,11],[2,2,2,3],[3,1,3,7],[27,4,27,7],[28,2,28,5],[27,0,36,0],[29,2,29,3],[30,1,30,7],[33,1,33,3],[33,5,33,6],[34,1,34,6],[35,1,35,6],[36,1,36,6],[0,0,26,0],[0,1,0,3],[0,4,0,7],[22,1,22,3],[49,0,58,0],[49,1,49,3],[49,4,49,7],[50,2,50,5],[51,2,51,3],[52,1,52,7],[55,1,55,3],[55,5,55,6],[56,1,56,6],[57,1,57,6],[58,1,58,6],[27,1,27,3],[71,0,80,0],[71,1,71,3],[71,4,71,7],[72,2,72,5],[73,2,73,3],[74,1,74,7],[77,1,77,3],[77,5,77,6],[78,1,78,6],[79,1,79,6],[80,1,80,6]]}
[1,"CODEVASF",null,null," COMPOSIÇÃO DE PREÇO UNITÁRIO",null,null,null,{"$f":"H24","v":0},{"$f":"H26","v":0},"BDI CALCULADO:",null,{"$f":"ORÇAMENTO!L6","v":15}]
[null,"OBRA:  ","PAVIMENTAÇÃO ASFÁLTICA EM CBUQ - VIAS URBANAS DIVERSAS (MATO VERDE / MG)",null,null,null,"DATA: ",{"$f":"ORÇAMENTO!C6","v":" AGOSTO / 2025"},null,null,"BDI DIFERENCIADO:",null,{"$f":"'BDI FORN'!D31/100","v":0.15}]
[null,"SERVIÇO:  ","CPU.1",null,"Referência:","SICRO","UNIDADE: ",{"$f":"VLOOKUP(A1,ORÇAMENTO!A11:L31,5)","v":"MOBILIZAÇÃO E DESMOBILIZAÇÃO"}]
[]
[null,"TIPO ITEM","CODIGO ITEM","DESCRIÇÃO ITEM","UNIDADE ITEM","COEFICIENTE","PRECO UNITARIO","CUSTO TOTAL",null,"distancia =",90,"B.DESPACHO"]
[null,"EQUIPAMENTOS",{"$nulls":7},"Pá carregadeira ",null,null,10.1," ton"]
[null,null,"E9001","E9001","E9001",null,"E9001"]
[]
{"$rows_left_out":85}
{"sheet":"AUX-VEIC.","index":3,"n_rows":31,"n_cols":5,"rows_kept":31,"cut":false,"hidden":false,"merged":[[26,2,26,3],[27,2,27,3],[28,2,28,3],[29,1,30,1],[29,2,29,3],[30,2,30,3],[25,2,25,3],[1,1,1,4],[2,1,2,2],[3,1,3,4],[17,1,17,4],[18,2,18,3],[19,2,19,3],[20,2,20,3],[21,2,21,3],[22,2,22,3],[23,2,23,3],[24,2,24,3]]}
[]
[null,"CÁLCULO DO CUSTO POR MÊS DE VEÍCULOS"]
[null,"Veículo: Polo TSI, Onix Turbo, Argo 1.3, HB-20 Turbo",null,"Data:","2025-07-28"]
[null,"DADOS ELEMENTARES DO VEÍCULO"]
[null,"Dados Básicos","Preço (R$)","Quantidade","Vida Útil"]
[null,"Quilometragem média mensal",null,3000]
[null,"Valor de Aquisição (VA)",103900]
[null,"Taxa de Juros (i)%",null,14.75]
{"$rows_left_out":24}
{"sheet":"BDI SERV","index":4,"n_rows":60,"n_cols":5,"rows_kept":60,"cut":false,"hidden":false,"merged":[[35,0,35,5],[36,0,36,5],[38,1,38,4],[39,2,39,3],[0,1,2,4],[25,1,25,3],[26,1,26,2],[26,3,26,4],[27,3,27,4]]}
[null,"DETALHAMENTO DO BDI - SERVIÇOS"]
[]
[]
[null,"Item","Descrição dos Serviços","% - PV","% - CD"]
[]
[null,1,"ADMINISTRAÇÃO CENTRAL"," ",{"$f":"SUM(E7:E9)","v":4.01}]
[null,"1.1","ESCRITÓRIO CENTRAL",null,4.01]
[null,"1.2","VIAGENS"]
{"$rows_left_out":53}
{"sheet":"BDI FORN","index":5,"n_rows":37,"n_cols":5,"rows_kept":37,"cut":false,"hidden":false,"merged":[[31,1,31,2],[32,0,34,5],[36,0,36,5],[0,1,2,4],[3,1,4,1],[3,2,4,2],[28,0,28,5],[30,1,30,2]]}
[null,"DETALHAMENTO DO BDI - FORNECIMENTO \n(MATERIAL ASFÁLTICO)"]
[]
[]
[null,"Item","Descrição dos Serviços","%","%"]
[null,null,null,"PV","CD"]
[]
[null,1,"ADMINISTRAÇÃO CENTRAL"," ",3.45]
[null,"1.1","ESCRITÓRIO CENTRAL"," "," "]
{"$rows_left_out":30}
{"sheet":"CRONOGRAMA","index":6,"n_rows":19,"n_cols":14,"rows_kept":19,"cut":false,"hidden":false,"merged":[[0,1,0,13],[1,1,2,1],[1,2,2,4],[1,6,1,13],[2,6,2,13],[9,0,10,0],[9,1,10,1],[9,2,10,2],[3,1,3,12],[5,0,6,0],[5,1,6,1],[5,2,6,2],[7,0,8,0],[7,1,8,1],[7,2,8,2],[15,1,16,2],[18,1,22,13],[11,0,12,0],[11,1,12,1],[11,2,12,2],[13,0,14,0],[13,1,14,1],[13,2,14,2]]}
[null,"CRONOGRAMA FÍSICO-FINANCEIRO"]
[null,"OBRA: ",{"$f":"ORÇAMENTO!C5","v":"PAVIMENTAÇÃO ASFÁLTICA EM CBUQ - VIAS URBANAS DIVERSAS (MATO VERDE / MG)"},null,null,"VALOR:",{"$f":"ORÇAMENTO!L43","v":2999960.9899999998}]
[{"$nulls":5},"PRAZO: ","240 DIAS "]
[]
[null,"ITEM","ETAPAS/DESCRIÇAO","FISICO/  FINANCEIRO","TOTAL    ETAPAS","MÊS 1","MÊS 2","MÊS 3","MÊS 4","MÊS 5","MÊS 6","MÊS 7","MÊS 8","TOTAL"]
["A",{"$f":"VLOOKUP(A6,ORÇAMENTO!$A$10:$L$43,2)","v":1},{"$f":"VLOOKUP(A6,ORÇAMENTO!$A$10:$L$43,5)","v":"SERVIÇOS PRELIMINARES "},"FISICO ",{"$f":"ROUND(E7/$G$2,4)","v":0.1178},0.4,0.1,0.1,0.1,0.1,0.1,0.05,0.05,{"$f":"SUM(F6:M6)","v":1}]
[null,null,null,"FINANCEIRO",{"$f":"ORÇAMENTO!L10","v":353439.22},{"$f":"ROUND($E$7*F6,2)","v":141375.69},{"$f":"ROUND($E$7*G6,2)","v":35343.919999999998},{"$f":"ROUND($E$7*H6,2)","v":35343.919999999998},{"$f":"ROUND($E$7*I6,2)","v":35343.919999999998},35343.919999999998,{"$f":"ROUND($E$7*K6,2)","v":35343.919999999998},17671.96,17671.96,{"$f":"SUM(F7:M7)","v":353439.20999999996}]
["B",{"$f":"VLOOKUP(A8,ORÇAMENTO!$A$10:$L$43,2)","v":2},{"$f":"VLOOKUP(A8,ORÇAMENTO!$A$10:$L$43,5)","v":"TERRAPLANAGEM E PAVIMENTAÇÃO"},"FISICO ",{"$f":"ROUND(E9/$G$2,4)","v":0.21099999999999999},0.15,0.15,0.15,0.15,0.15,0.15,0.1,0,{"$f":"SUM(F8:M8)","v":1}]
{"$rows_left_out":12}
{"sheet":"EAI","index":7,"n_rows":90,"n_cols":34,"rows_kept":90,"cut":false,"hidden":false,"merged":[[12,3,24,3],[1,2,3,26],[5,2,7,2],[5,12,7,12],[6,6,7,6],[6,19,6,20],[10,4,10,8],[10,9,10,10],[10,22,10,23],[5,6,5,7],[5,8,5,9],[6,21,6,24],[7,21,7,24]]}
[]
[null,null,"MEMÓRIA DE CÁLCULO"]
[]
[]
[]
[{"$nulls":6},"TIPOLOGIA DO MATERIAL",null,"Emulsão Asfáltica para Serviço de Imprimação",null,null,null,"IMPOSTOS","COFINS",6.4999999999999997E-3,6.4999999999999997E-3]
[{"$nulls":6},"ÍNDICE DE PAVIMENTAÇÃO DNIT","2014-07-01","ÍNDICE INICIAL",270.23700000000002,null,null,null,"PIS",0.03,0.03,null,null,null,"LEGENDA",{"$nulls":8},"As empresas tributadas pelo Lucro Presumido pagam 0,65% de PIS e 3% de COFINS"]
[{"$nulls":7},"2025-06-01","ÍNDICE FINAL",586.21100000000001,null,null,null," ICMS",0.18,0.18,{"$f":"1-(O8/1)","v":0.82000000000000006},{"$f":"1-(P8/1)","v":0.82000000000000006},{"$f":"1-(Q8/1)","v":0.17999999999999994},"ENTRADA DE DADOS",null,"QUANT.ESTIMADA DE EMULSÃO ASFÁLTICA PARA IMPRIMAÇÃO (TON.):",null,null,null,{"$f":"ORÇAMENTO!H37","v":28},"TONELADAS",null,"As empresas tributadas pelo Lucro Real pagam 1,65% de PIS e 7,60% de COFINS"]
{"$rows_left_out":76}
{"sheet":"RR-1C","index":8,"n_rows":92,"n_cols":34,"rows_kept":92,"cut":false,"hidden":false,"merged":[[12,3,26,3],[6,19,6,20],[6,6,7,6],[5,12,7,12],[5,6,5,7],[5,8,5,9],[1,2,3,26],[5,2,7,2],[10,4,10,8],[10,9,10,10],[10,22,10,23],[6,21,6,24],[7,21,7,24]]}
[]
[null,null,"MEMÓRIA DE CÁLCULO"]
[]
[]
[]
[{"$nulls":6},"TIPOLOGIA DO MATERIAL",null,"EMULSÕES ASFÁLTICAS RR-1C",null,null,null,"IMPOSTOS","COFINS",6.4999999999999997E-3,6.4999999999999997E-3]
[{"$nulls":6},"ÍNDICE DE PAVIMENTAÇÃO DNIT","2014-07-01","ÍNDICE INICIAL",270.23700000000002,null,null,null,"PIS",0.03,0.03,null,null,null,"LEGENDA",{"$nulls":8},"As empresas tributadas pelo Lucro Presumido pagam 0,65% de PIS e 3% de COFINS"]
[{"$nulls":7},"2023-10-01","ÍNDICE FINAL",586.21100000000001,null,null,null," ICMS",0.18,0.18,{"$f":"1-(O8/1)","v":0.82000000000000006},{"$f":"1-(P8/1)","v":0.82000000000000006},{"$f":"1-(Q8/1)","v":0.17999999999999994},"ENTRADA DE DADOS",null,"QUANT.ESTIMADA DE RR-1C (TON.):",null,null,null,{"$f":"ORÇAMENTO!H39","v":9},"TONELADAS",null,"As empresas tributadas pelo Lucro Real pagam 1,65% de PIS e 7,60% de COFINS"]
{"$rows_left_out":78}
{"sheet":"CAP","index":9,"n_rows":91,"n_cols":34,"rows_kept":91,"cut":false,"hidden":false,"merged":[[10,4,10,8],[10,9,10,10],[10,22,10,23],[12,3,24,3],[1,2,3,26],[5,2,7,2],[5,12,7,12],[6,6,7,6],[6,19,6,20],[6,21,6,24],[7,21,7,24],[5,6,5,7],[5,8,5,9]]}
[]
[null,null,"MEMÓRIA DE CÁLCULO"]
[]
[]
[]
[{"$nulls":6},"TIPOLOGIA DO MATERIAL",null,"CIMENTOS ASFÁLTICOS CAP-50-70",null,null,null,"IMPOSTOS","COFINS",6.4999999999999997E-3,6.4999999999999997E-3]
[{"$nulls":6},"ÍNDICE DE PAVIMENTAÇÃO DNIT","2014-07-01","ÍNDICE INICIAL",270.23700000000002,null,null,null,"PIS",0.03,0.03,null,null,null,"LEGENDA",null,"QUANT.ESTIMADA DE MASSA ASFÁLTICA (TON.):",null,null,null,{"$f":"ORÇAMENTO!H23","v":2200},"TONELADAS",null,"As empresas tributadas pelo Lucro Presumido pagam 0,65% de PIS e 3% de COFINS"]
[{"$nulls":7},"2025-06-01","ÍNDICE FINAL",586.21100000000001,null,null,null," ICMS",0.18,0.18,{"$f":"1-(O8/1)","v":0.82000000000000006},{"$f":"1-(P8/1)","v":0.82000000000000006},{"$f":"1-(Q8/1)","v":0.17999999999999994},"ENTRADA DE DADOS",null,"QUANT.ESTIMADA DE CAP 50/70 (TON.):",null,null,null,{"$f":"ORÇAMENTO!H41","v":125},"TONELADAS",null,"As empresas tributadas pelo Lucro Real pagam 1,65% de PIS e 7,60% de COFINS"]
{"$rows_left_out":76}
{"sheet":"MAT.ASF","index":10,"n_rows":33,"n_cols":23,"rows_kept":33,"cut":false,"hidden":false,"merged":[[20,2,25,2],[27,2,32,2],[19,1,19,22],[26,1,26,22],[11,2,12,2],[11,3,11,6],[11,7,11,8],[11,18,11,19],[13,2,18,2],[7,1,7,19],[8,1,10,22],[2,1,2,8],[3,1,3,8],[4,1,4,8],[5,1,5,8],[6,1,6,22]]}
{"$rows_empty":8}
[null,"PLANILHA RESUMO - MATERIAIS ASFÁLTICOS"]
[]
[]
[null,"DATA-BASE","PRODUTOS","LOCALIDADES",null,null,null,"CUSTO ANP (R$/Kg)",null,"CUSTO ANP","IMPOSTOS DO PRODUTO","CUSTO DO PRODUTO COM IMPOSTOS","DMT's","DMT's","CUSTO DO TRANSPORTE TOTAL","ICMS","ATUALIZAÇÃO DO CUSTO DE TRANSPORTE","CUSTO DO TRANSPORTE RODOVIA PAVIMENTADA COM IMPOSTOS E ATUALIZAÇÃO MONETÁRIA","PEDÁGIO ",null,"TOTAL TRANSPORTE","TOTAL PRODUTO","TOTAL GERAL"]
[null,{"$f":"CAP!H9","v":"2025-06-01"},null,"REFINARIAS","ENDEREÇO","ORIGEM - REFINARIAS / DISTRIBUIDORAS","DESTINO","ESTADO","REGIÃO","R$/t","R$/t","R$/t","KM","KM","R$/t","R$/t","R$/t","R$/t","CUSTO POR EIXO","R$/t","R$/t","R$/t","R$/t"]
[null,1,"CAP 50/70","Refinaria Abreu e Lima","Rodovia PE 60, Km 10 - Ipojuca - PE CEP:55590-000",{"$f":"VLOOKUP($W14,CAP!$B:$AA,7,FALSE)","v":"SÃO JOSÉ DOS CAMPOS - SP"},{"$f":"VLOOKUP($W14,CAP!$B:$AA,8,FALSE)","v":"JANAÚBA - MG"},{"$f":"VLOOKUP($W14,CAP!$B:$AA,9,FALSE)","v":3.5232200022636051},{"$f":"VLOOKUP($W14,CAP!$B:$AA,10,FALSE)","v":3.7003936998971256},{"$f":"VLOOKUP($W14,CAP!$B:$AA,11,FALSE)","v":3523.2200022636052},{"$f":"VLOOKUP($W14,CAP!$B:$AA,12,FALSE)","v":973.55},{"$f":"VLOOKUP($W14,CAP!$B:$AA,13,FALSE)","v":4496.7700022636054},{"$f":"VLOOKUP($W14,CAP!$B$13:$AA$25,14,FALSE)","v":1078},{"$f":"VLOOKUP($W14,'[2]Transporte Cap 50-70'!$B:$AA,15,FALSE)","v":{"$error":"#N/A"}},{"$f":"VLOOKUP($W14,CAP!$B:$AA,18,FALSE)","v":299.67},{"$f":"VLOOKUP($W14,CAP!$B:$AA,19,FALSE)","v":65.78},{"$f":"VLOOKUP($W14,CAP!$B:$AA,20,FALSE)","v":427.3},{"$f":"VLOOKUP($W14,CAP!$B:$AA,21,FALSE)","v":792.75},{"$f":"VLOOKUP($W14,CAP!$B:$AA,22,FALSE)","v":566.4},{"$f":"VLOOKUP($W14,CAP!$B:$AA,23,FALSE)","v":45.311999999999998},{"$f":"VLOOKUP($W14,CAP!$B:$AA,24,FALSE)","v":838.06200000000001},{"$f":"VLOOKUP($W14,CAP!$B:$AA,25,FALSE)","v":4496.7700022636054},{"$f":"SMALL(CAP!$AA$13:$AA$25,1)","v":5334.8320022636053}]
[null,2,null,"Refinaria Potiguar Clara Camarão","Rodovia RN 221, KM 25 - Guamaré - RN CEP:59598-000",{"$f":"VLOOKUP($W15,CAP!$B:$AA,7,FALSE)","v":"BETIM - MG"},{"$f":"VLOOKUP($W15,CAP!$B:$AA,8,FALSE)","v":"JANAÚBA - MG"},{"$f":"VLOOKUP($W15,CAP!$B:$AA,9,FALSE)","v":3.8177312193514235},{"$f":"VLOOKUP($W15,CAP!$B:$AA,10,FALSE)","v":3.7003936998971256},{"$f":"VLOOKUP($W15,CAP!$B:$AA,11,FALSE)","v":3817.7312193514235},{"$f":"VLOOKUP($W15,CAP!$B:$AA,12,FALSE)","v":1054.93},{"$f":"VLOOKUP($W15,CAP!$B:$AA,13,FALSE)","v":4872.6612193514238},{"$f":"VLOOKUP($W15,CAP!$B$13:$AA$25,14,FALSE)","v":556},{"$f":"VLOOKUP($W15,'[2]Transporte Cap 50-70'!$B:$AA,15,FALSE)","v":{"$error":"#N/A"}},{"$f":"VLOOKUP($W15,CAP!$B:$AA,18,FALSE)","v":167.61},{"$f":"VLOOKUP($W15,CAP!$B:$AA,19,FALSE)","v":36.79},{"$f":"VLOOKUP($W15,CAP!$B:$AA,20,FALSE)","v":238.99},{"$f":"VLOOKUP($W15,CAP!$B:$AA,21,FALSE)","v":443.39},{"$f":"VLOOKUP($W15,CAP!$B:$AA,22,FALSE)","v":369},{"$f":"VLOOKUP($W15,CAP!$B:$AA,23,FALSE)","v":29.52},{"$f":"VLOOKUP($W15,CAP!$B:$AA,24,FALSE)","v":472.90999999999997},{"$f":"VLOOKUP($W15,CAP!$B:$AA,25,FALSE)","v":4872.6612193514238},{"$f":"SMALL(CAP!$AA$13:$AA$25,2)","v":5345.5712193514237}]
{"$rows_left_out":18}