{"text_format":"2","workbook":"xlsx","n_sheets":11,"sheets":["ORÇAMENTO","CPU-SERV","CPU-FORNEC","AUX-VEIC.","BDI SERV","BDI FORN","CRONOGRAMA","EAI","RR-1C","CAP","MAT.ASF"],"not_rendered":{"charts":0,"images":4,"macros":0,"external_links":2,"defined_names":13,"comments":5,"pivot_tables":0},"unopened":[],"bounds":{"document_bytes":16777216,"sheet_cells":100000,"run_cost":"one","rows_first":2000,"rows_last":500,"rows_between":2000,"halvings":0,"cell_chars":16384,"cell_head_chars":4096},"cells_cut":0,"cells_raw":0,"read":"whole","date_system":"1900"}

{"sheet":"ORÇAMENTO","index":0,"n_rows":43,"n_cols":12,"rows_kept":43,"cut":false,"hidden":false,"merged":[[9,14,9,16],[42,1,42,4],[0,0,8,0],[0,4,0,11],[1,4,1,11],[2,4,2,11],[6,1,6,4],[4,9,4,10],[5,8,5,10],[4,2,4,7],[5,2,5,4],[6,9,6,10],[7,1,7,11]]}
["<---- NUMERAR SERVIÇOS PARA CPU",null,null,null,"Ministério do Desenvolvimento Regional"]
[{"$nulls":4},"Companhia de Desenvolvimento dos Vales do São Francisco e do Parnaíba"]
[{"$nulls":4},"1ª Superintendência Regional"]
[]
[null,"OBRA: ","PAVIMENTAÇÃO ASFÁLTICA EM CBUQ - VIAS URBANAS DIVERSAS (MATO VERDE / MG)",{"$nulls":6},"BDI Serviços (%):",null,{"$f":"'BDI SERV'!E26","v":21.62}]
[null,"DATA:"," AGOSTO / 2025",{"$nulls":5},"BDI Diferenciado Serviços (%):",null,null,{"$f":"'BDI FORN'!D31","v":15}]
[null," PRAZO DE EXECUÇÃO:     240 DIAS",{"$nulls":7},"BDI Fornecimentos (%):",null,{"$f":"'BDI FORN'!D31","v":15}]
[null,"PLANILHA DE ORÇAMENTAÇÃO"]
[null,"ITEM","CÓDIGO","FONTE","DISCRIMINAÇÃO","TIPO","UNID.","QUANT.","VR. UNIT.C/BDI","PR. UNIT.C/BDI","C. TOT.S/BDI","P. TOT.C/BDI"]
["A",1,null,null,"SERVIÇOS PRELIMINARES ",{"$nulls":6},{"$f":"SUM(L11:L16)","v":353439.22}]
[1,"1.1","CPU.1","SICRO","MOBILIZAÇÃO E DESMOBILIZAÇÃO","SERV","GL",1,{"$f":"VLOOKUP(A11,'CPU-SERV'!A:K,11,0)","v":15816.96},{"$f":"TRUNC(_xlfn.IFS(F11=\"SERV\",I11*(1+$L$5/100),F11=\"SERV DIF\",I11*(1+$L$6/100),F11=\"FORN\",I11*(1+$L$7/100)),2)","v":19236.580000000002},{"$f":"TRUNC(H11*I11,2)","v":15816.96},{"$f":"TRUNC(H11*J11,2)","v":19236.580000000002}]
[2,"1.2","CPU.2","SICRO","ADMINISTRAÇÃO LOCAL ","SERV","GL",1,{"$f":"VLOOKUP(A12,'CPU-SERV'!A:K,11,0)","v":197551.27},{"$f":"TRUNC(_xlfn.IFS(F12=\"SERV\",I12*(1+$L$5/100),F12=\"SERV DIF\",I12*(1+$L$6/100),F12=\"FORN\",I12*(1+$L$7/100)),2)","v":240261.85},{"$f":"TRUNC(H12*I12,2)","v":197551.27},{"$f":"TRUNC(H12*J12,2)","v":240261.85}]
[3,"1.3","CPU.3","CODEVASF","CANTEIRO DE OBRAS ","SERV","GL",1,{"$f":"VLOOKUP(A13,'CPU-SERV'!A:K,11,0)","v":19489.27},{"$f":"TRUNC(_xlfn.IFS(F13=\"SERV\",I13*(1+$L$5/100),F13=\"SERV DIF\",I13*(1+$L$6/100),F13=\"FORN\",I13*(1+$L$7/100)),2)","v":23702.85},19489.27,23702.85]
[4,"1.4",103689,"SINAPI","PLACA DE OBRA EM CHAPA DE AÇO GALVANIZADO","SERV","M2",8,{"$f":"VLOOKUP(A14,'CPU-SERV'!A:K,11,0)","v":550.64},{"$f":"TRUNC(_xlfn.IFS(F14=\"SERV\",I14*(1+$L$5/100),F14=\"SERV DIF\",I14*(1+$L$6/100),F14=\"FORN\",I14*(1+$L$7/100)),2)","v":669.68},4405.12,5357.44]
[5,"1.5","CPU. 4","CODEVASF","VEÍCULO PARA A FISCALIZAÇÃO, MÁXIMO 02 ANOS DE USO OU 50.000KM, PREFERENCIALMENTE NA COR BRANCA, COM IDENTIFICAÇÃO CONFORME ESPECIFICAÇÕES DA CODEVASF, INCLUSIVE COMBUSTÍVEL, MANUTENÇÃO, SEGURO E IMPOSTOS - CONFORME ESPECIFICAÇÕES","SERV","MÊS",10,{"$f":"VLOOKUP(A15,'CPU-SERV'!A:K,11,0)","v":4264.1499999999996},{"$f":"TRUNC(_xlfn.IFS(F15=\"SERV\",I15*(1+$L$5/100),F15=\"SERV DIF\",I15*(1+$L$6/100),F15=\"FORN\",I15*(1+$L$7/100)),2)","v":5186.05},{"$f":"TRUNC(H15*I15,2)","v":42641.5},{"$f":"TRUNC(H15*J15,2)","v":51860.5}]
[6,"1.6",78472,"SINAPI","SERVIÇOS TOPOGRÁFICOS PARA PAVIMENTAÇÃO, INCLUSIVE LEVANTAMENTO PLANIALTIMÉTRICO CADASTRAL, GERAÇÃO DE NOTAS DE SERVIÇO, SEÇÕES TRANSVERSAIS E GREIDE, ESTAQUEAMENTO E ACOMPANHAMENTO EXECUTIVO","SERV","M2",21000,{"$f":"VLOOKUP(A16,'CPU-SERV'!A:K,11,0)","v":0.51},{"$f":"TRUNC(_xlfn.IFS(F16=\"SERV\",I16*(1+$L$5/100),F16=\"SERV DIF\",I16*(1+$L$6/100),F16=\"FORN\",I16*(1+$L$7/100)),2)","v":0.62},10710,13020]
["B",2,null,null,"TERRAPLANAGEM E PAVIMENTAÇÃO",{"$nulls":6},{"$f":"SUM(L18:L23)","v":632944}]
[7,"2.1",5502140,"SICRO","ESCAVAÇÃO, CARGA E TRANSPORTE DE MATERIAL DE 1ª CATEGORIA - DMT 1.000 A 1.200M, CAMINHO DE SERVIÇO EM REVESTIMENTO PRIMÁRIO","SERV","M3",6400,{"$f":"VLOOKUP(A18,'CPU-SERV'!A:K,11,0)","v":6.89},{"$f":"TRUNC(_xlfn.IFS(F18=\"SERV\",I18*(1+$L$5/100),F18=\"SERV DIF\",I18*(1+$L$6/100),F18=\"FORN\",I18*(1+$L$7/100)),2)","v":8.3699999999999992},44096,{"$f":"TRUNC(H18*J18,2)","v":53568}]
[9,"2.2",4011209,"SICRO","REGULARIZAÇÃO E COMPACTAÇÃO DO SUBLEITO ","SERV","M2",21000,{"$f":"VLOOKUP(A19,'CPU-SERV'!A:K,11,0)","v":1.56},{"$f":"TRUNC(_xlfn.IFS(F19=\"SERV\",I19*(1+$L$5/100),F19=\"SERV DIF\",I19*(1+$L$6/100),F19=\"FORN\",I19*(1+$L$7/100)),2)","v":1.89},32760,39690]
[10,"2.3",4011219,"SICRO","EXECUÇÃO E COMPACTAÇÃO DE BASE E OU SUB BASE PARA PAVIMENTAÇÃO COM SOLO ESTABILIZADO GRANULOMETRICAMENTE SEM MISTURA, COM MATERIAL DE JAZIDA - EXCLUSIVE TRANSPORTE","SERV","M3",3200,{"$f":"VLOOKUP(A20,'CPU-SERV'!A:K,11,0)","v":14.79},{"$f":"TRUNC(_xlfn.IFS(F20=\"SERV\",I20*(1+$L$5/100),F20=\"SERV DIF\",I20*(1+$L$6/100),F20=\"FORN\",I20*(1+$L$7/100)),2)","v":17.98},47328,57536]
[12,"2.4",4011352,"SICRO","IMPRIMAÇÃO COM EMULSÃO ASFÁLTICA (EAI)","SERV","M2",21000,{"$f":"VLOOKUP(A21,'CPU-SERV'!A:K,11,0)","v":0.41},{"$f":"TRUNC(_xlfn.IFS(F21=\"SERV\",I21*(1+$L$5/100),F21=\"SERV DIF\",I21*(1+$L$6/100),F21=\"FORN\",I21*(1+$L$7/100)),2)","v":0.49},8610,10290]
[13,"2.5",4011353,"SICRO","PINTURA DE LIGAÇÃO COM EMULSÃO ASFÁLTICA RR-1C","SERV","M2",18000,{"$f":"VLOOKUP(A22,'CPU-SERV'!A:K,11,0)","v":0.28000000000000003},{"$f":"TRUNC(_xlfn.IFS(F22=\"SERV\",I22*(1+$L$5/100),F22=\"SERV DIF\",I22*(1+$L$6/100),F22=\"FORN\",I22*(1+$L$7/100)),2)","v":0.34},5040,6120]
[14,"2.6",4011463,"SICRO","EXECUÇÃO DE PAVIMENTO COM APLICAÇÃO DE CONCRETO ASFÁLTICO USINADO A QUENTE (CBUQ), CAMADA DE ROLAMENTO - EXCLUSIVE TRANSPORTE","SERV","T",2200,{"$f":"VLOOKUP(A23,'CPU-SERV'!A:K,11,0)","v":174.07},{"$f":"TRUNC(_xlfn.IFS(F23=\"SERV\",I23*(1+$L$5/100),F23=\"SERV DIF\",I23*(1+$L$6/100),F23=\"FORN\",I23*(1+$L$7/100)),2)","v":211.7},382954,465740]
["C",3,null,null,"TRANSPORTE DE MATERIAIS",{"$nulls":6},{"$f":"SUM(L25:L29)","v":316714}]
[15,"3.1",5915321,"SICRO","TRANSPORTE COM CAMINHÃO BASCULANTE, EM RODOVIA PAVIMENTADA","SERV","TXKM",75000,{"$f":"VLOOKUP(A25,'CPU-SERV'!A:K,11,0)","v":0.66},{"$f":"TRUNC(_xlfn.IFS(F25=\"SERV\",I25*(1+$L$5/100),F25=\"SERV DIF\",I25*(1+$L$6/100),F25=\"FORN\",I25*(1+$L$7/100)),2)","v":0.8},49500,{"$f":"TRUNC(H25*J25,2)","v":60000}]
[16,"3.2",5915320,"SICRO","TRANSPORTE COM CAMINHÃO BASCULANTE, RODOVIA EM REVESTIMENTO PRIMÁRIO","SERV","TXKM",53000,{"$f":"VLOOKUP(A26,'CPU-SERV'!A:K,11,0)","v":0.73},{"$f":"TRUNC(_xlfn.IFS(F26=\"SERV\",I26*(1+$L$5/100),F26=\"SERV DIF\",I26*(1+$L$6/100),F26=\"FORN\",I26*(1+$L$7/100)),2)","v":0.88},38690,{"$f":"TRUNC(H26*J26,2)","v":46640}]
[17,"3.3",5914434,"SICRO","TRANSPORTE COM CAMINHÃO CARROCERIA 9T, EM VIA URBANA PAVIMENTADA","SERV","TXKM",4000,{"$f":"VLOOKUP(A27,'CPU-SERV'!A:K,11,0)","v":0.79},{"$f":"TRUNC(_xlfn.IFS(F27=\"SERV\",I27*(1+$L$5/100),F27=\"SERV DIF\",I27*(1+$L$6/100),F27=\"FORN\",I27*(1+$L$7/100)),2)","v":0.96},3160,3840]
[18,"3.4",5914612,"SICRO","TRANSPORTE DE MASSA ASFÁLTICA COM CAMINHÃO BASCULANTE, EM VIA URBANA PAVIMENTADA","SERV","TXKM",210000,{"$f":"VLOOKUP(A28,'CPU-SERV'!A:K,11,0)","v":0.81},{"$f":"TRUNC(_xlfn.IFS(F28=\"SERV\",I28*(1+$L$5/100),F28=\"SERV DIF\",I28*(1+$L$6/100),F28=\"FORN\",I28*(1+$L$7/100)),2)","v":0.98},170100,{"$f":"TRUNC(H28*J28,2)","v":205800}]
[19,"3.5",5914622,"SICRO","TRANSPORTE COM CAMINHÃO TANQUE DE TRANSPORTE DE MATERIAL ASFÁLTICO DE 30000 L, EM VIA URBANA PAVIMENTADA","SERV","TXKM",200,{"$f":"VLOOKUP(A29,'CPU-SERV'!A:K,11,0)","v":1.79},{"$f":"TRUNC(_xlfn.IFS(F29=\"SERV\",I29*(1+$L$5/100),F29=\"SERV DIF\",I29*(1+$L$6/100),F29=\"FORN\",I29*(1+$L$7/100)),2)","v":2.17},358,434]
["E",4,null,null,"DRENAGEM E OBRAS COMPLEMENTARES",{"$nulls":6},{"$f":"SUM(L31:L35)","v":783411}]
[20,"4.1",94273,"SINAPI","ASSENTAMENTO DE GUIA (MEIO-FIO) PRÉ-MOLDADO DE CONCRETO - 100X15X13X30 CM (COMPRIMENTO X BASE INFERIOR X BASE SUPERIOR X ALTURA) - USO VIÁRIO","SERV","M",6500,{"$f":"VLOOKUP(A31,'CPU-SERV'!A:K,11,0)","v":57.96},{"$f":"TRUNC(_xlfn.IFS(F31=\"SERV\",I31*(1+$L$5/100),F31=\"SERV DIF\",I31*(1+$L$6/100),F31=\"FORN\",I31*(1+$L$7/100)),2)","v":70.489999999999995},376740,{"$f":"TRUNC(H31*J31,2)","v":458185}]
[23,"4.2","94287a","SINAPI","EXECUÇÃO DE SARJETA EM CONCRETO USINADO, MOLDADO IN LOCO - 30CM DE BASE X 5CM DE ALTURA","SERV","M",6500,{"$f":"VLOOKUP(A32,'CPU-SERV'!A:K,11,0)","v":24.41},{"$f":"TRUNC(_xlfn.IFS(F32=\"SERV\",I32*(1+$L$5/100),F32=\"SERV DIF\",I32*(1+$L$6/100),F32=\"FORN\",I32*(1+$L$7/100)),2)","v":29.68},158665,192920]
[46,"4.3",5213440,"SICRO","PLACA DE REGULAMENTAÇÃO EM AÇO, D=60CM - PELÍCULA RETRORREFLETIVA - FORNECIMENTO E INSTALAÇÃO, INCLUSIVE  SUPORTE","SERV","UN.",150,{"$f":"VLOOKUP(A33,'CPU-SERV'!A:K,11,0)","v":271.87},{"$f":"TRUNC(_xlfn.IFS(F33=\"SERV\",I33*(1+$L$5/100),F33=\"SERV DIF\",I33*(1+$L$6/100),F33=\"FORN\",I33*(1+$L$7/100)),2)","v":330.64},40780.5,49596]
[49,"4.4",5213401,"SICRO","PINTURA DE EIXO VIÁRIO SOBRE ASFALTO COM TINTA RETRORREFLETIVA A BASE DE RESINA ACRÍLICA COM MICROESFERAS DE VIDRO, APLICAÇÃO MECÂNICA COM DEMARCADORA AUTOPROPELIDA","SERV","M2",1000,{"$f":"VLOOKUP(A34,'CPU-SERV'!A:K,11,0)","v":27.24},{"$f":"TRUNC(_xlfn.IFS(F34=\"SERV\",I34*(1+$L$5/100),F34=\"SERV DIF\",I34*(1+$L$6/100),F34=\"FORN\",I34*(1+$L$7/100)),2)","v":33.119999999999997},27240,33120]
[51,"4.5",5213405,"SICRO","PINTURA DE FAIXA DE PEDESTRE OU ZEBRADA TINTA RETRORREFLETIVA A BASE DE RESINA ACRÍLICA COM MICROESFERAS DE VIDRO, APLICAÇÃO MANUAL","SERV","M2",1000,{"$f":"VLOOKUP(A35,'CPU-SERV'!A:K,11,0)","v":40.78},{"$f":"TRUNC(_xlfn.IFS(F35=\"SERV\",I35*(1+$L$5/100),F35=\"SERV DIF\",I35*(1+$L$6/100),F35=\"FORN\",I35*(1+$L$7/100)),2)","v":49.59},40780,49590]
["F",5,null,null,"FORNECIMENTOS - MATERIAL ASFÁLTICO (BDI DIFERENCIADO)",{"$nulls":6},{"$f":"SUM(L37:L42)","v":913452.76}]
["F1","5.1","CPU.7","CODEVASF","AQUISIÇÃO DE EMULSÃO ASFÁLTICA PARA IMPRIMAÇÃO (EAI) - EXCLUSIVE TRANSPORTE","FORN","T",28,{"$f":"VLOOKUP(A37,'CPU-FORNEC'!A:J,9,0)","v":2723.1},{"$f":"TRUNC(_xlfn.IFS(F37=\"SERV\",I37*(1+$L$5/100),F37=\"SERV DIF\",I37*(1+$L$6/100),F37=\"FORN\",I37*(1+$L$7/100)),2)","v":3131.56},76246.8,{"$f":"TRUNC(H37*J37,2)","v":87683.68}]
["F2","5.2","CPU.8","CODEVASF","TRANSPORTE DE EMULSÃO ASFÁLTICA PARA IMPRIMAÇÃO (EAI)","SERV DIF","T",28,{"$f":"VLOOKUP(A38,'CPU-FORNEC'!A:J,9,0)","v":527.96},{"$f":"TRUNC(_xlfn.IFS(F38=\"SERV\",I38*(1+$L$5/100),F38=\"SERV DIF\",I38*(1+$L$6/100),F38=\"FORN\",I38*(1+$L$7/100)),2)","v":607.15},14782.88,17000.2]
["F3","5.3","CPU.9","CODEVASF","AQUISIÇÃO DE EMULSAO ASFALTICA CATIONICA RR-1C - EXCLUSIVE TRANSPORTE","FORN","T",9,{"$f":"VLOOKUP(A39,'CPU-FORNEC'!A:J,9,0)","v":3456.95},{"$f":"TRUNC(_xlfn.IFS(F39=\"SERV\",I39*(1+$L$5/100),F39=\"SERV DIF\",I39*(1+$L$6/100),F39=\"FORN\",I39*(1+$L$7/100)),2)","v":3975.49},31112.55,35779.410000000003]
["F4","5.4","CPU.10","CODEVASF","TRANSPORTE DE EMULSÃO ASFÁLTICA CATIONICA RR-1C","SERV DIF","T",9,{"$f":"VLOOKUP(A40,'CPU-FORNEC'!A:J,9,0)","v":590.29},{"$f":"TRUNC(_xlfn.IFS(F40=\"SERV\",I40*(1+$L$5/100),F40=\"SERV DIF\",I40*(1+$L$6/100),F40=\"FORN\",I40*(1+$L$7/100)),2)","v":678.83},5312.61,6109.47]
["F5","5.5","CPU.11","CODEVASF","AQUISIÇÃO DE CONCRETO ASFÁLTICO DE PETRÓLEO - CAP 50/70 - EXCLUSIVE TRANSPORTE","FORN","T",125,{"$f":"VLOOKUP(A41,'CPU-FORNEC'!A:J,9,0)","v":4496.7700000000004},{"$f":"TRUNC(_xlfn.IFS(F41=\"SERV\",I41*(1+$L$5/100),F41=\"SERV DIF\",I41*(1+$L$6/100),F41=\"FORN\",I41*(1+$L$7/100)),2)","v":5171.28},562096.25,646410]
["F6","5.6","CPU.12","CODEVASF","TRANSPORTE DE CONCRETO ASFÁLTICO DE PETRÓLEO - CAP 50/70","SERV DIF","T",125,{"$f":"VLOOKUP(A42,'CPU-FORNEC'!A:J,9,0)","v":838.06},{"$f":"TRUNC(_xlfn.IFS(F42=\"SERV\",I42*(1+$L$5/100),F42=\"SERV DIF\",I42*(1+$L$6/100),F42=\"FORN\",I42*(1+$L$7/100)),2)","v":963.76},104757.5,120470]
[null,"TOTAL GERAL DA OBRA COM BDI ",{"$nulls":9},{"$f":"SUM(L10,L17,L24,L30,L36)+0.01","v":2999960.9899999998}]

{"sheet":"CPU-SERV","index":1,"n_rows":952,"n_cols":16,"rows_kept":952,"cut":false,"hidden":false,"merged":[[163,0,208,0],[165,4,165,5],[166,4,166,5],[167,2,167,7],[167,8,167,9],[168,1,169,2],[168,3,169,3],[168,4,168,5],[168,6,168,7],[173,7,173,9],[176,3,176,7],[177,3,177,7],[178,3,178,7],[181,7,181,9],[184,3,184,7],[185,7,185,9],[196,3,196,7],[198,8,198,9],[907,0,951,0],[908,2,908,9],[909,1,910,3],[909,4,909,5],[910,4,910,5],[911,2,911,7],[949,3,949,7],[950,5,950,7],[935,3,935,7],[937,8,937,9],[942,3,942,7],[943,1,944,2],[943,3,944,3],[943,4,944,4],[943,5,943,7],[943,9,944,9],[920,3,920,7],[921,3,921,7],[922,3,922,7],[925,7,925,9],[931,3,931,7],[932,7,932,9],[911,8,911,9],[912,1,913,2],[912,3,913,3],[912,4,912,5],[912,6,912,7],[917,7,917,9],[861,0,905,0],[862,2,862,9],[863,1,864,3],[863,4,863,5],[864,4,864,5],[865,2,865,7],[903,3,903,7],[904,5,904,7],[889,3,889,7],[891,8,891,9],[896,3,896,7],[897,1,898,2],[897,3,898,3],[897,4,898,4],[897,5,897,7],[897,9,898,9],[874,3,874,7],[875,3,875,7],[876,3,876,7],[879,7,879,9],[885,3,885,7],[886,7,886,9],[865,8,865,9],[866,1,867,2],[866,3,867,3],[866,4,866,5],[866,6,866,7],[871,7,871,9],[826,8,826,9],[827,1,828,2],[827,3,828,3],[827,4,827,5],[827,6,827,7],[832,7,832,9],[857,3,857,7],[858,5,858,7],[822,0,859,0],[823,2,823,9],[824,1,825,3],[824,4,824,5],[825,4,825,5],[826,2,826,7],[847,3,847,7],[849,8,849,9],[852,3,852,7],[853,1,854,2],[853,3,854,3],[853,4,854,4],[853,5,853,7],[853,9,854,9],[835,3,835,7],[836,3,836,7],[837,3,837,7],[840,7,840,9],[843,3,843,7],[844,7,844,9],[781,0,820,0],[782,2,782,9],[783,1,784,3],[783,4,783,5],[784,4,784,5],[785,2,785,7],[818,3,818,7],[819,5,819,7],[808,3,808,7],[810,8,810,9],[813,3,813,7],[814,1,815,2],[814,3,815,3],[814,4,815,4],[814,5,814,7],[814,9,815,9],[794,3,794,7],[795,3,795,7],[796,3,796,7],[799,7,799,9],[804,3,804,7],[805,7,805,9],[785,8,785,9],[786,1,787,2],[786,3,787,3],[786,4,786,5],[786,6,786,7],[791,7,791,9],[746,8,746,9],[747,1,748,2],[747,3,748,3],[747,4,747,5],[747,6,747,7],[752,7,752,9],[777,3,777,7],[778,5,778,7],[742,0,779,0],[743,2,743,9],[744,1,745,3],[744,4,744,5],[745,4,745,5],[746,2,746,7],[767,3,767,7],[769,8,769,9],[772,3,772,7],[773,1,774,2],[773,3,774,3],[773,4,774,4],[773,5,773,7],[773,9,774,9],[755,3,755,7],[756,3,756,7],[757,3,757,7],[760,7,760,9],[763,3,763,7],[764,7,764,9],[703,0,740,0],[704,2,704,9],[705,1,706,3],[705,4,705,5],[706,4,706,5],[707,2,707,7],[738,3,738,7],[739,5,739,7],[664,0,701,0],[665,2,665,9],[666,1,667,3],[666,4,666,5],[667,4,667,5],[668,2,668,7],[728,3,728,7],[730,8,730,9],[733,3,733,7],[734,1,735,2],[734,3,735,3],[734,4,735,4],[734,5,734,7],[734,9,735,9],[721,7,721,9],[724,3,724,7],[725,7,725,9],[707,8,707,9],[708,1,709,2],[708,3,709,3],[708,4,708,5],[708,6,708,7],[713,7,713,9],[668,8,668,9],[669,1,670,2],[669,3,670,3],[669,4,669,5],[669,6,669,7],[674,7,674,9],[716,3,716,7],[717,3,717,7],[718,3,718,7],[699,3,699,7],[700,5,700,7],[689,3,689,7],[691,8,691,9],[694,3,694,7],[695,1,696,2],[695,3,696,3],[695,4,696,4],[695,5,695,7],[695,9,696,9],[677,3,677,7],[678,3,678,7],[679,3,679,7],[682,7,682,9],[685,3,685,7],[686,7,686,9],[625,0,662,0],[626,2,626,9],[627,1,628,3],[627,4,627,5],[628,4,628,5],[629,2,629,7],[660,3,660,7],[661,5,661,7],[547,0,584,0],[548,2,548,9],[549,1,550,3],[549,4,549,5],[550,4,550,5],[650,3,650,7],[652,8,652,9],[655,3,655,7],[656,1,657,2],[656,3,657,3],[656,4,657,4],[656,5,656,7],[656,9,657,9],[561,3,561,7],[562,3,562,7],[647,7,647,9],[629,8,629,9],[630,1,631,2],[630,3,631,3],[630,4,630,5],[630,6,630,7],[635,7,635,9],[582,3,582,7],[583,5,583,7],[646,3,646,7],[551,2,551,7],[482,8,482,9],[485,3,485,7],[486,1,487,2],[486,3,487,3],[486,4,487,4],[486,5,486,7],[486,9,487,9],[536,1,537,2],[536,3,537,3],[536,4,537,4],[536,5,536,7],[536,9,537,9],[544,3,544,7],[526,3,526,7],[528,8,528,9],[535,3,535,7],[560,3,560,7],[498,2,498,4],[498,5,498,7],[552,1,553,2],[552,3,553,3],[552,4,552,5],[552,6,552,7],[557,7,557,9],[638,3,638,7],[639,3,639,7],[640,3,640,7],[643,7,643,9],[430,3,430,7],[433,7,433,9],[436,3,436,7],[437,7,437,9],[524,7,524,9],[565,7,565,9],[568,3,568,7],[569,7,569,9],[551,8,551,9],[572,3,572,7],[574,8,574,9],[577,3,577,7],[578,1,579,2],[578,3,579,3],[578,4,579,4],[578,5,578,7],[578,9,579,9],[420,6,420,7],[425,7,425,9],[468,3,468,7],[469,3,469,7],[470,3,470,7],[473,7,473,9],[476,3,476,7],[477,7,477,9],[458,8,458,9],[459,1,460,2],[459,3,460,3],[459,4,459,5],[459,6,459,7],[465,7,465,9],[450,3,450,7],[451,5,451,7],[434,7,434,8],[415,0,452,0],[416,2,416,9],[417,1,418,3],[417,4,417,5],[418,4,418,5],[419,2,419,7],[401,3,401,7],[403,8,403,9],[406,3,406,7],[407,1,408,2],[407,3,408,3],[407,4,408,4],[407,5,407,7],[407,9,408,9],[440,3,440,7],[442,8,442,9],[445,3,445,7],[446,1,447,2],[446,3,447,3],[446,4,447,4],[446,5,446,7],[446,9,447,9],[429,3,429,7],[480,3,480,7],[454,0,492,0],[455,2,455,9],[456,1,457,3],[456,4,456,5],[457,4,457,5],[458,2,458,7],[490,3,490,7],[491,5,491,7],[362,3,362,7],[364,8,364,9],[367,3,367,7],[368,1,369,2],[368,3,369,3],[368,4,369,4],[368,5,368,7],[368,9,369,9],[428,3,428,7],[419,8,419,9],[420,1,421,2],[420,3,421,3],[420,4,420,5],[389,3,389,7],[390,3,390,7],[391,3,391,7],[394,7,394,9],[397,3,397,7],[398,7,398,9],[380,8,380,9],[381,1,382,2],[381,3,382,3],[381,4,381,5],[381,6,381,7],[376,0,413,0],[377,2,377,9],[378,1,379,3],[378,4,378,5],[379,4,379,5],[380,2,380,7],[411,3,411,7],[412,5,412,7],[395,7,395,8],[386,7,386,9],[304,7,304,9],[350,3,350,7],[351,3,351,7],[352,3,352,7],[355,7,355,9],[358,3,358,7],[359,7,359,9],[337,8,337,9],[338,1,339,2],[338,3,339,3],[338,4,338,5],[338,6,338,7],[347,7,347,9],[329,3,329,7],[330,5,330,7],[309,3,309,7],[312,7,312,9],[315,3,315,7],[316,7,316,9],[333,0,374,0],[334,2,334,9],[335,1,336,3],[335,4,335,5],[336,4,336,5],[337,2,337,7],[372,3,372,7],[373,5,373,7],[290,0,331,0],[291,2,291,9],[292,1,293,3],[292,4,292,5],[293,4,293,5],[294,2,294,7],[319,3,319,7],[321,8,321,9],[324,3,324,7],[325,1,326,2],[325,3,326,3],[325,4,326,4],[325,5,325,7],[325,9,326,9],[307,3,307,7],[308,3,308,7],[295,1,296,2],[295,3,296,3],[295,4,295,5],[256,6,256,7],[261,7,261,9],[286,3,286,7],[287,5,287,7],[266,3,266,7],[269,7,269,9],[272,3,272,7],[273,7,273,9],[295,6,295,7],[255,8,255,9],[256,1,257,2],[256,3,257,3],[256,4,256,5],[210,0,249,0],[247,3,247,7],[248,5,248,7],[225,3,225,7],[294,8,294,9],[251,0,288,0],[252,2,252,9],[253,1,254,3],[253,4,253,5],[254,4,254,5],[255,2,255,7],[237,3,237,7],[239,8,239,9],[242,3,242,7],[243,1,244,2],[243,3,244,3],[243,4,244,4],[243,5,243,7],[243,9,244,9],[276,3,276,7],[278,8,278,9],[281,3,281,7],[282,1,283,2],[282,3,283,3],[282,4,283,4],[282,5,282,7],[282,9,283,9],[264,3,264,7],[265,3,265,7],[211,2,211,9],[212,1,213,3],[212,4,212,5],[213,4,213,5],[214,2,214,7],[151,8,151,9],[154,3,154,7],[155,1,156,2],[155,3,156,3],[155,4,156,4],[155,5,155,7],[155,9,156,9],[164,2,164,9],[165,1,166,3],[201,3,201,7],[202,1,203,2],[202,3,203,3],[202,4,203,4],[202,5,202,7],[202,9,203,9],[206,3,206,7],[207,5,207,7],[226,3,226,7],[227,3,227,7],[230,7,230,9],[233,3,233,7],[234,7,234,9],[214,8,214,9],[215,1,216,2],[215,3,216,3],[215,4,215,5],[215,6,215,7],[220,7,220,9],[122,0,161,0],[123,2,123,9],[124,1,125,3],[124,4,124,5],[125,4,125,5],[126,2,126,7],[126,8,126,9],[159,3,159,7],[160,5,160,7],[136,3,136,7],[137,3,137,7],[140,7,140,9],[145,3,145,7],[146,7,146,9],[149,3,149,7],[127,1,128,2],[127,3,128,3],[127,4,127,5],[127,6,127,7],[132,7,132,9],[135,3,135,7],[118,3,118,7],[93,7,93,9],[98,3,98,7],[101,7,101,9],[104,3,104,7],[105,7,105,9],[108,3,108,7],[83,0,120,0],[84,2,84,9],[85,1,86,3],[86,4,86,5],[87,2,87,7],[87,8,87,9],[88,1,89,2],[110,8,110,9],[113,3,113,7],[96,3,96,7],[97,3,97,7],[88,3,89,3],[88,4,88,5],[88,6,88,7],[119,5,119,7],[44,3,45,3],[44,4,44,5],[44,6,44,7],[49,7,49,9],[55,3,55,7],[56,3,56,7],[114,1,115,2],[114,3,115,3],[114,4,115,4],[114,5,114,7],[114,9,115,9],[0,0,37,0],[3,4,3,5],[0,11,0,12],[1,11,1,12],[2,4,2,5],[1,2,1,9],[2,1,3,3],[31,3,32,3],[31,4,32,4],[31,5,31,7],[31,9,32,9],[35,3,35,7],[36,5,36,7],[10,7,10,9],[13,3,13,7],[14,3,14,7],[15,3,15,7],[18,7,18,9],[30,3,30,7],[31,1,32,2],[22,7,22,9],[25,3,25,7],[2,10,2,11],[39,0,81,0],[40,2,40,9],[586,0,623,0],[41,1,42,3],[41,4,41,5],[42,4,42,5],[43,2,43,7],[43,8,43,9],[44,1,45,2],[79,3,79,7],[80,5,80,7],[85,4,85,5],[74,3,74,7],[75,1,76,2],[75,3,76,3],[75,4,76,4],[75,5,75,7],[75,9,76,9],[57,3,57,7],[60,7,60,9],[63,3,63,7],[64,7,64,9],[69,3,69,7],[71,8,71,9],[494,0,545,0],[495,2,495,9],[496,1,497,3],[496,4,496,5],[497,4,497,5],[498,8,498,9],[499,1,500,2],[499,3,500,3],[499,4,499,5],[499,6,499,7],[507,7,507,9],[509,3,509,7],[510,3,510,7],[511,3,511,7],[514,7,514,9],[523,3,523,7],[519,7,519,8],[545,5,545,7],[7,13,7,15],[15,11,15,13],[27,8,27,9],[21,3,21,7],[4,2,4,7],[4,8,4,9],[5,1,6,2],[5,3,6,3],[5,4,5,5],[5,6,5,7],[622,5,622,7],[587,2,587,9],[588,1,589,3],[588,4,588,5],[589,4,589,5],[590,2,590,7],[590,8,590,9],[591,1,592,2],[591,3,592,3],[591,4,591,5],[591,6,591,7],[596,7,596,9],[599,3,599,7],[600,3,600,7],[601,3,601,7],[604,7,604,9],[607,3,607,7],[608,7,608,9],[611,3,611,7],[613,8,613,9],[616,3,616,7],[617,1,618,2],[617,3,618,3],[617,4,618,4],[617,5,617,7],[617,9,618,9],[621,3,621,7]]}
[1,"1ª/GRD",{"$nulls":8},{"$f":"J37","v":15816.96},"Minas Gerais"]
[null,"OBRA:","PAVIMENTAÇÃO ASFÁLTICA EM CBUQ - VIAS URBANAS DIVERSAS (MATO VERDE / MG)",{"$nulls":8}," Abril/2025 "]
[null,"Custo Unitário de Referência",null,null,"Minas Gerais",{"$nulls":5},"QUANT.MATERIAL:",null,{"$f":"SUM(M20:M953)","v":0},{"$f":"M3/(ORÇAMENTO!L43-ORÇAMENTO!L36)","v":0}]
[{"$nulls":4}," Abril/2025 ",null,null,"Produção da equipe ",0.5,{"$f":"VLOOKUP(A1,ORÇAMENTO!$A$10:$L$43,7,1)","v":"GL"}]
[null,"CPU.1","MOBILIZAÇÃO E DESMOBILIZAÇÃO",{"$nulls":5},"Valores em reais (R$)"]
[null,"A - EQUIPAMENTOS",null,"Quantidade","Utilização",null,"Custo Horário",null,null,"Custo"]
[{"$nulls":4},"Operativa","Improdutiva","Produtivo","Improdutivo",null,"Horário Total"]
[null,"E9687","Caminhão carroceria com capacidade de 5 t - 120 kW",8,0.6,0.4,154.82689999999999,59.719900000000003,null,{"$f":"D8*(E8*G8+F8*H8)","v":934.27279999999996},null,"distancia =",220,"MOC"]
[null,"E9575","Caminhão basculante com caçamba estanque com capacidade de 14 m³ - 210 kW",12,1,0,314.16070000000002,91.266099999999994,null,{"$f":"D9*(E9*G9+F9*H9)","v":3769.9284000000002},null,"Pá carregadeira ",null,null,10.1," ton"]
[{"$nulls":7},"Custo horário total de equipamentos",null,{"$f":"SUM(J8:J9)","v":4704.2012000000004},null,"Motoniveladora ",null,null,12.47," ton"]
[null,"B - MÃO DE OBRA",null,"Quantidade","Unidade",null,"Custo Horário","Custo Horário Total",null,null,null,"Trator de pneus",null,null,2.8," ton"]
[null,"P9824","Servente",8,"h",null,21.435400000000001,null,null,{"$f":"D12*G12","v":171.48320000000001},null,"Rolo Compactador ",null,null,15.33," ton"]
[{"$nulls":9},{"$f":"D13*G13","v":0},null,"Grade de disco",null,null,1," ton"]
[null,null,null,"Custo horário total de mão de obra",{"$nulls":5},{"$f":"SUM(J12:J13)","v":171.48320000000001},null,"RETROESCAVADEIRA",null,null,6.67," ton"]
[null,null,null,"Custo horário total de execução",{"$nulls":5},{"$f":"J10+J14","v":4875.6844000000001}]
[null,null,null,"Custo unitário de execução",{"$nulls":5},{"$f":"J15/I4","v":9751.3688000000002},null,"MOBILIZAÇÃO + DESMOBILIZAÇÃO DOS EQUIPTOS",null,null,{"$f":"SUM(O9:O15)*M8","v":10641.400000000001},"ton.km"]
[{"$nulls":7},"Custo do FIC",null,0]
[{"$nulls":7},"Custo do FIT",null,0]
[null,"C - MATERIAL",null,"Quantidade","Unidade",null,"Preço Unitário","Custo Unitário"]
[null,"-",0,null,0,null,0,null,null,{"$f":"D20*G20","v":0}]
[null,"-",0,null,0,null,0,null,null,{"$f":"D21*G21","v":0}]
[null,null,null,"Custo unitário total de material",{"$nulls":5},{"$f":"SUM(J20:J21)","v":0}]
[null,"D - ATIVIDADES AUXILIARES",null,"Quantidade","Unidade",null,"Custo Unitário","Custo Unitário"]
[null,5914640,"Transporte com cavalo mecânico com semirreboque com capacidade de 32 t - rodovia pavimentada",10641.400000000001,"tkm",null,0.56999999999999995,null,null,{"$f":"D24*G24","v":6065.598}]
[null,"-",0,0,0,null,0,null,null,{"$f":"D25*G25","v":0}]
[null,null,null,"Custo total de atividades auxiliares",{"$nulls":5},{"$f":"SUM(J24:J25)","v":6065.598}]
[{"$nulls":7},"Subtotal",null,{"$f":"J16+J22+J26+J17+J18","v":15816.9668}]
[null,"E - TEMPO FIXO",null,"Código","Quantidade","Unidade",null,"Custo Unitário","Custo Unitário"]
[null,"-",0,"-",null,0,null,0,null,{"$f":"ROUNDDOWN(E29*H29,4)","v":0}]
[null,"-",0,"-",null,0,null,0,null,{"$f":"ROUNDDOWN(E30*H30,4)","v":0}]
[null,null,null,"Custo unitário total de tempo fixo",{"$nulls":5},{"$f":"SUM(J29:J30)","v":0}]
[null,"F - MOMENTO DE TRANSPORTE",null,"Quantidade","Unidade","DMT",null,null,null,"Custo Unitário"]
[{"$nulls":5},"LN","RP","P"]
[null,"-",0,null,"tkm"]
[null,"-",0,null,"tkm"]
[null,null,null,"Custo unitário total de transporte"]
[{"$nulls":5},"Custo unitário direto total",null,null,null,{"$f":"TRUNC(J27+J31,2)","v":15816.96}]
[null,"Obs."]
[]
[{"$f":"A1+1","v":2},"1ª/GRD",{"$nulls":8},{"$f":"J81","v":197551.27}]
[null,"OBRA:","PAVIMENTAÇÃO ASFÁLTICA EM CBUQ - VIAS URBANAS DIVERSAS (MATO VERDE / MG)"]
[null,"Custo Unitário de Referência",null,null,"Minas Gerais"]
[{"$nulls":4}," Abril/2025 ",null,null,"Produção da equipe ",0.125,{"$f":"VLOOKUP(A40,ORÇAMENTO!$A$10:$L$43,7,1)","v":"GL"},"8 MESES"]
[null,"CPU.2","ADMINISTRAÇÃO LOCAL ",{"$nulls":5},"Valores em reais (R$)"]
[null,"A - EQUIPAMENTOS",null,"Quantidade","Utilização",null,"Custo Horário",null,null,"Custo"]
[{"$nulls":4},"Operativa","Improdutiva","Produtivo","Improdutivo",null,"Horário Total"]
[null,"-",0,null,null,null,0,0,null,{"$f":"D47*(E47*G47+F47*H47)","v":0}]
[null,"-",0,null,null,null,0,0,null,{"$f":"D48*(E48*G48+F48*H48)","v":0}]
[{"$nulls":7},"Custo horário total de equipamentos",null,{"$f":"SUM(J47:J48)","v":0}]
[null,"B - MÃO DE OBRA",null,"Quantidade","Unidade",null,"Custo Horário","Custo Horário Total"]
[null,"P9812","Engenheiro",0.25723043487648517,"mês",null,26402.7353,null,null,{"$f":"D51*G51","v":6791.5870831477259}]
[null,"P9840","Encarregado geral",1,"mês",null,10169.553075,null,null,{"$f":"D52*G52","v":10169.553075}]
[null,"P9876","Técnico de segurança do trabalho",0.5,"mês",null,5978.5158000000001,null,null,2989.2579000000001]
[null,"P9858","Laboratorista",0.5,"mês",null,4843.3442249999998,null,null,2421.6721124999999]
[null,"P9806","Auxiliar administrativo",0.5,"mês",null,3423.5984249999997,null,null,1711.7992124999998]
[null,null,null,"Custo horário total de mão de obra",{"$nulls":5},{"$f":"SUM(J51:J55)","v":24083.869383147725}]
[null,null,null,"Custo horário total de execução",{"$nulls":5},{"$f":"J49+J56","v":24083.869383147725}]
[null,null,null,"Custo unitário de execução",{"$nulls":5},{"$f":"J57/I43","v":192670.9550651818}]
[{"$nulls":7},"Custo do FIC",null,"-"]
[{"$nulls":7},"Custo do FIT",null,"-"]
[null,"C - MATERIAL",null,"Quantidade","Unidade",null,"Preço Unitário","Custo Unitário"]
[null,"-",0,0,0,null,0,null,null,{"$f":"D62*G62","v":0}]
[null,"-",0,0,0,null,0,null,null,0]
[null,null,null,"Custo unitário total de material",{"$nulls":5},{"$f":"SUM(J62:J63)","v":0}]
[null,"D - ATIVIDADES AUXILIARES",null,"Quantidade","Unidade",null,"Custo Unitário","Custo Unitário"]
[null,14250,"Energia Elétrica",480,"kwh",null,1.1399999999999999,null,null,{"$f":"D66*G66","v":547.19999999999993}]
[null,44480,"Tarifa A - Água e Esgoto",48,"m³",null,21.57,null,null,{"$f":"D67*G67","v":1035.3600000000001}]
[null,5212560,"Placa de advertência para sinalização de obras montada em suporte metálico móvel, lado 1,00 m - utilização de 600 ciclos - fornecimento, 01 implantação e 01 retirada diária",704,"un.dia",null,3.89,null,null,{"$f":"D68*G68","v":2738.56}]
[null,"Cotação","Telefone",8,"mês",null,69.900000000000006,null,null,{"$f":"D69*G69","v":559.20000000000005}]
[null,null,null,"Custo total de atividades auxiliares",{"$nulls":5},{"$f":"SUM(J66:J69)","v":4880.32}]
[{"$nulls":7},"Subtotal",null,{"$f":"J58+J64+J70","v":197551.27506518181}]
[null,"E - TEMPO FIXO",null,"Código","Quantidade","Unidade",null,"Custo Unitário","Custo Unitário"]
[null,"-",0,"-",0,"t",null,0,null,{"$f":"ROUNDDOWN(E73*H73,4)","v":0}]
[null,"-",0,"-",0,"t",null,0,null,{"$f":"ROUNDDOWN(E74*H74,4)","v":0}]
[null,null,null,"Custo unitário total de tempo fixo",{"$nulls":5},{"$f":"SUM(J73:J74)","v":0}]
[null,"F - MOMENTO DE TRANSPORTE",null,"Quantidade","Unidade","DMT",null,null,null,"Custo Unitário"]
[{"$nulls":5},"LN","RP","P"]
[null,"-",0,null,"tkm"]
[null,"-",0,null,"tkm"]
[null,null,null,"Custo unitário total de transporte"]
[{"$nulls":5},"Custo unitário direto total",null,null,null,{"$f":"TRUNC(J71+J75,2)","v":197551.27}]
[null,"Obs."]
[]
[{"$f":"A40+1","v":3},"1ª/GRD",{"$nulls":8},{"$f":"J120","v":19489.27}]
[null,"OBRA:","PAVIMENTAÇÃO ASFÁLTICA EM CBUQ - VIAS URBANAS DIVERSAS (MATO VERDE / MG)"]
[null,"Custo Unitário de Referência",null,null,"Minas Gerais"]
[{"$nulls":4}," Abril/2025 ",null,null,"Produção da equipe ",1,{"$f":"VLOOKUP(A84,ORÇAMENTO!$A$10:$L$43,7,1)","v":"GL"}]
[null,"CPU.3","CANTEIRO DE OBRAS ",{"$nulls":5},"Valores em reais (R$)"]
[null,"A - EQUIPAMENTOS",null,"Quantidade","Utilização",null,"Custo Horário",null,null,"Custo"]
[{"$nulls":4},"Operativa","Improdutiva","Produtivo","Improdutivo",null,"Horário Total"]
[null,"-",0,null,null,null,0,0,null,{"$f":"D91*(E91*G91+F91*H91)","v":0}]
[null,"-",0,null,null,null,0,0,null,{"$f":"D92*(E92*G92+F92*H92)","v":0}]
[{"$nulls":7},"Custo horário total de equipamentos",null,{"$f":"SUM(J91:J92)","v":0}]
[null,"B - MÃO DE OBRA",null,"Quantidade","Unidade",null,"Custo Horário","Custo Horário Total"]
[null,"P9824","Servente",16,"h",null,21.435400000000001,null,null,{"$f":"D95*G95","v":342.96640000000002}]
[null,"P9808","Carpinteiro",16,"h",null,26.881399999999999,null,null,{"$f":"D96*G96","v":430.10239999999999}]
[null,null,null,"Custo horário total de mão de obra",{"$nulls":5},{"$f":"SUM(J95:J96)","v":773.06880000000001}]
[null,null,null,"Custo horário total de execução",{"$nulls":5},{"$f":"J93+J97","v":773.06880000000001}]
[null,null,null,"Custo unitário de execução",{"$nulls":5},{"$f":"J98/I87","v":773.06880000000001}]
[{"$nulls":7},"Custo do FIC",null,"-"]
[{"$nulls":7},"Custo do FIT",null,"-"]
[null,"C - MATERIAL",null,"Quantidade","Unidade",null,"Preço Unitário","Custo Unitário"]
[null,"M0053","Tela plástica em polipropileno na cor laranja para tapume - L = 1,2 m",100,"m",null,1.7621,null,null,{"$f":"D103*G103","v":176.21}]
[null,"-",0,0,0,null,0,null,null,{"$f":"D104*G104","v":0}]
[null,null,null,"Custo unitário total de material",{"$nulls":5},{"$f":"SUM(J103:J104)","v":176.21}]
[null,"D - ATIVIDADES AUXILIARES",null,"Quantidade","Unidade",null,"Custo Unitário","Custo Unitário"]
[null,10775,"Locação de container 2,30 X 6,00 m, alt. 2,50 m, com 1 sanitário, para escritório, completo, sem divisórias internas",8,"mês",null,1030,null,null,{"$f":"D107*G107","v":8240}]
[null,10779,"Locação de container 2,30 X 4,30 m, alt. 2,50 M, p/ sanitário, c/ 5 bacias, 1 lavatório e 4 mictórios",8,"mês",null,1287.5,null,null,{"$f":"D108*G108","v":10300}]
[null,null,null,"Custo total de atividades auxiliares",{"$nulls":5},{"$f":"SUM(J107:J108)","v":18540}]
[{"$nulls":7},"Subtotal",null,{"$f":"J99+J105+J109","v":19489.2788}]
[null,"E - TEMPO FIXO",null,"Código","Quantidade","Unidade",null,"Custo Unitário","Custo Unitário"]
[null,"-",0,"-",0,"t",null,0,null,{"$f":"ROUNDDOWN(E112*H112,4)","v":0}]
[null,"-",0,"-",0,"t",null,0,null,{"$f":"ROUNDDOWN(E113*H113,4)","v":0}]
[null,null,null,"Custo unitário total de tempo fixo",{"$nulls":5},{"$f":"SUM(J112:J113)","v":0}]
[null,"F - MOMENTO DE TRANSPORTE",null,"Quantidade","Unidade","DMT",null,null,null,"Custo Unitário"]
[{"$nulls":5},"LN","RP","P"]
[null,"-",0,0,"tkm"]
[null,"-",0,0,"tkm"]
[null,null,null,"Custo unitário total de transporte"]
[{"$nulls":5},"Custo unitário direto total",null,null,null,{"$f":"TRUNC(J110+J114,2)","v":19489.27}]
[null,"Obs."]
[]
[{"$f":"A84+1","v":4},"1ª/GRD",{"$nulls":8},{"$f":"J161","v":550.64}]
[null,"OBRA:","PAVIMENTAÇÃO ASFÁLTICA EM CBUQ - VIAS URBANAS DIVERSAS (MATO VERDE / MG)"]
[null,"Custo Unitário de Referência",null,null,"Minas Gerais"]
[{"$nulls":4}," Abril/2025 ",null,null,"Produção da equipe ",1,{"$f":"VLOOKUP(A123,ORÇAMENTO!$A$10:$L$43,7,1)","v":"M2"}]
[null,103689,"PLACA DE OBRA EM CHAPA DE AÇO GALVANIZADO",{"$nulls":5},"Valores em reais (R$)"]
[null,"A - EQUIPAMENTOS",null,"Quantidade","Utilização",null,"Custo Horário",null,null,"Custo"]
[{"$nulls":4},"Operativa","Improdutiva","Produtivo","Improdutivo",null,"Horário Total"]
[null,"-",0,null,null,null,0,0,null,{"$f":"D130*(E130*G130+F130*H130)","v":0}]
[null,"-",0,null,null,null,0,0,null,{"$f":"D131*(E131*G131+F131*H131)","v":0}]
[{"$nulls":7},"Custo horário total de equipamentos",null,{"$f":"SUM(J130:J131)","v":0}]
[null,"B - MÃO DE OBRA",null,"Quantidade","Unidade",null,"Custo Horário","Custo Horário Total"]
[null,"P9824","Servente",1.1186,"h",null,21.435400000000001,null,null,{"$f":"D134*G134","v":23.977638440000003}]
[null,"P9808","Carpinteiro",0.37290000000000001,"h",null,26.881399999999999,null,null,{"$f":"D135*G135","v":10.02407406}]
[null,null,null,"Custo horário total de mão de obra",{"$nulls":5},{"$f":"SUM(J134:J135)","v":34.001712500000004}]
[null,null,null,"Custo horário total de execução",{"$nulls":5},{"$f":"J132+J136","v":34.001712500000004}]
[null,null,null,"Custo unitário de execução",{"$nulls":5},{"$f":"J137/I126","v":34.001712500000004}]
[{"$nulls":7},"Custo do FIC",null,"-"]
[{"$nulls":7},"Custo do FIT",null,"-"]
[null,"C - MATERIAL",null,"Quantidade","Unidade",null,"Preço Unitário","Custo Unitário"]
[null,"M1358","Sarrafo em madeira de terceira - E = 2,5 cm e L = 5 cm",6.4165999999999999,"m",null,2.0291000000000001,null,null,{"$f":"D142*G142","v":13.01992306}]
[null,"M1205","Prego de ferro",2.4500000000000001E-2,"kg",null,16.771799999999999,null,null,{"$f":"D143*G143","v":0.41090909999999997}]
[null,"M0998","Madeira estrutural de eucalipto",2.2608E-2,"m³",null,2685.3184000000001,null,null,{"$f":"D144*G144","v":60.7096783872}]
[null,4813,"Placa de obra (para construção civil) em chapa galvanizada *N. 22*, adesivada, de *2,4 X 1,2* m (sem postes para fixação)",1,"m²",null,442.5,null,null,442.5]
[null,null,null,"Custo unitário total de material",{"$nulls":5},{"$f":"SUM(J142:J145)","v":516.64051054719994}]
[null,"D - ATIVIDADES AUXILIARES",null,"Quantidade","Unidade",null,"Custo Unitário","Custo Unitário"]
[null,"-",0,0,0,null,0,null,null,{"$f":"D148*G148","v":0}]
[null,"-",0,0,0,null,0,null,null,{"$f":"D149*G149","v":0}]
[null,null,null,"Custo total de atividades auxiliares",{"$nulls":5},{"$f":"SUM(J148:J149)","v":0}]
[{"$nulls":7},"Subtotal",null,{"$f":"J138+J146+J150","v":550.64222304719999}]
[null,"E - TEMPO FIXO",null,"Código","Quantidade","Unidade",null,"Custo Unitário","Custo Unitário"]
[null,"-",0,"-",0,"t",null,0,null,{"$f":"ROUNDDOWN(E153*H153,4)","v":0}]
[null,"-",0,"-",0,"t",null,0,null,{"$f":"ROUNDDOWN(E154*H154,4)","v":0}]
[null,null,null,"Custo unitário total de tempo fixo",{"$nulls":5},{"$f":"SUM(J153:J154)","v":0}]
[null,"F - MOMENTO DE TRANSPORTE",null,"Quantidade","Unidade","DMT",null,null,null,"Custo Unitário"]
[{"$nulls":5},"LN","RP","P"]
[null,"-",0,0,"tkm"]
[null,"-",0,0,"tkm"]
[null,null,null,"Custo unitário total de transporte"]
[{"$nulls":5},"Custo unitário direto total",null,null,null,{"$f":"TRUNC(J151+J155,2)","v":550.64}]
[null,"Obs."]
[]
[5,"1ª/GRD",{"$nulls":8},{"$f":"J208","v":4264.1499999999996}]
[null,"OBRA:"," PAVIMENTAÇÃO EM BLOQUETE SEXTAVADOS - RUAS DIVERSAS - JOSENÓPOLIS / MG"]
[null,"Custo Unitário de Referência",null,null,"Minas Gerais"]
[{"$nulls":4}," Abril/2025 ",null,null,"Produção da equipe ",1,{"$f":"VLOOKUP(A164,ORÇAMENTO!$A$10:$L$43,7,1)","v":"MÊS"}]
[null,"CPU. 4","VEÍCULO PARA A FISCALIZAÇÃO, MÁXIMO 02 ANOS DE USO OU 50.000KM, PREFERENCIALMENTE NA COR BRANCA, COM IDENTIFICAÇÃO CONFORME ESPECIFICAÇÕES DA CODEVASF, INCLUSIVE COMBUSTÍVEL, MANUTENÇÃO, SEGURO E IMPOSTOS - CONFORME ESPECIFICAÇÕES",{"$nulls":5},"Valores em reais (R$)"]
[null,"A - EQUIPAMENTOS",null,"Quantidade","Utilização",null,"Custo Horário",null,null,"Custo"]
[{"$nulls":4},"Operativa","Improdutiva","Produtivo","Improdutivo",null,"Horário Total"]
[null,"-",0,null,null,null,0,0,null,{"$f":"D171*(E171*G171+F171*H171)","v":0}]
[null,"-",0,null,null,null,0,0,null,{"$f":"D172*(E172*G172+F172*H172)","v":0}]
[{"$nulls":7},"Custo horário total de equipamentos",null,{"$f":"SUM(J171:J172)","v":0}]
[null,"B - MÃO DE OBRA",null,"Quantidade","Unidade",null,"Custo Horário","Custo Horário Total"]
[null,"-",0,null,0,null,0,null,null,{"$f":"D175*G175","v":0}]
[null,"-",0,null,0,null,0,null,null,0]
[null,null,null,"Custo horário total de mão de obra",{"$nulls":5},{"$f":"SUM(J175:J176)","v":0}]
[null,null,null,"Custo horário total de execução",{"$nulls":5},{"$f":"J173+J177","v":0}]
[null,null,null,"Custo unitário de execução",{"$nulls":5},{"$f":"J178/I167","v":0}]
[{"$nulls":7},"Custo do FIC",null,"-"]
[{"$nulls":7},"Custo do FIT",null,"-"]
[null,"C - MATERIAL",null,"Quantidade","Unidade",null,"Preço Unitário","Custo Unitário"]
[null,"-",0,null,0,null,0,null,null,{"$f":"D183*G183","v":0}]
[null,"-",0,null,0,null,0,null,null,0]
[null,null,null,"Custo unitário total de material",{"$nulls":5},{"$f":"SUM(J183:J184)","v":0}]
[null,"D - ATIVIDADES AUXILIARES",null,"Quantidade","Unidade",null,"Custo Unitário","Custo Unitário"]
[null,"-","Depreciação",1,"vb",null,692.66666666666663,null,null,{"$f":"D187*G187","v":692.66666666666663}]
[null,"-","Oportunidade de Capital",1,"vb",null,510.84,null,null,510.84]
[null,"-","Impostos e Licenciamento",1,"vb",null,346.33,null,null,346.33]
[null,"-","Seguro Total",1,"vb",null,281.58,null,null,281.58]
[null,"-","Combustível",1,"vb",null,1287.8599999999999,null,null,1287.8599999999999]
[null,"-","Manutenções Preventivas",1,"vb",null,254.02,null,null,254.02]
[null,"-","Limpeza",1,"vb",null,100,null,null,100]
[null,"-","Pneus",1,"vb",null,115.18,null,null,115.18]
[null,"-","Peças",1,"vb",null,77.22,null,null,77.22]
[null,"-","Manutenção Corretiva (%)",1,"vb",null,598.46,null,null,598.46]
[null,null,null,"Custo total de atividades auxiliares",{"$nulls":5},{"$f":"SUM(J187:J196)","v":4264.1566666666658}]
[{"$nulls":7},"Subtotal",null,{"$f":"J179+J185+J197","v":4264.1566666666658}]
[null,"E - TEMPO FIXO",null,"Código","Quantidade","Unidade",null,"Custo Unitário","Custo Unitário"]
[null,"-",0,"-",null,0,null,0,null,{"$f":"ROUNDDOWN(E200*H200,4)","v":0}]
[null,"-",0,"-",null,0,null,0,null,{"$f":"ROUNDDOWN(E201*H201,4)","v":0}]
[null,null,null,"Custo unitário total de tempo fixo",{"$nulls":5},{"$f":"SUM(J200:J201)","v":0}]
[null,"F - MOMENTO DE TRANSPORTE",null,"Quantidade","Unidade","DMT",null,null,null,"Custo Unitário"]
[{"$nulls":5},"LN","RP","P"]
[null,"-",0,null,"tkm"]
[null,"-",0,null,"tkm"]
[null,null,null,"Custo unitário total de transporte"]
[{"$nulls":5},"Custo unitário direto total",null,null,null,{"$f":"TRUNC(J198+J202,2)","v":4264.1499999999996}]
[null,"Obs."]
[]
[6,"1ª/GRD",{"$nulls":8},{"$f":"J249","v":0.51}]
[null,"OBRA:","PAVIMENTAÇÃO ASFÁLTICA EM CBUQ - VIAS URBANAS DIVERSAS (MATO VERDE / MG)"]
[null,"Custo Unitário de Referência",null,null,"Minas Gerais"]
[{"$nulls":4}," Abril/2025 ",null,null,"Produção da equipe ",1,{"$f":"VLOOKUP(A211,ORÇAMENTO!$A$10:$L$43,7,1)","v":"M2"}]
[null,78472,"SERVIÇOS TOPOGRÁFICOS PARA PAVIMENTAÇÃO, INCLUSIVE LEVANTAMENTO PLANIALTIMÉTRICO CADASTRAL, GERAÇÃO DE NOTAS DE SERVIÇO, SEÇÕES TRANSVERSAIS E GREIDE, ESTAQUEAMENTO E ACOMPANHAMENTO EXECUTIVO",{"$nulls":5},"Valores em reais (R$)"]
[null,"A - EQUIPAMENTOS",null,"Quantidade","Utilização",null,"Custo Horário",null,null,"Custo"]
[{"$nulls":4},"Operativa","Improdutiva","Produtivo","Improdutivo",null,"Horário Total"]
[null,92145,"Caminhonete cabine simples com motor 1.6 flex, câmbio manual, potência 101/104 cv, 2 portas",5.0000000000000001E-4,1,0,83.97,0,null,{"$f":"D218*(E218*G218+F218*H218)","v":4.1985000000000001E-2}]
[null,"-",0,0,1,0,0,0,null,{"$f":"D219*(E219*G219+F219*H219)","v":0}]
[{"$nulls":7},"Custo horário total de equipamentos",null,{"$f":"SUM(J218:J219)","v":4.1985000000000001E-2}]
[null,"B - MÃO DE OBRA",null,"Quantidade","Unidade",null,"Custo Horário","Custo Horário Total"]
[null,"P9949","Topógrafo",1.590909090909091E-5,"mês",null,6936.5330000000004,28.902220833333335,null,{"$f":"D222*G222","v":0.1103539340909091}]
[null,"P9950","Auxiliar de topografia",1.590909090909091E-5,"mês",null,6476.4769999999999,23.986951851851853,null,{"$f":"D223*G223","v":0.10303486136363636}]
[null,"P9824","Servente",7.4999999999999997E-3,"h",null,21.435400000000001,8.9314166666666667E-2,null,{"$f":"D224*G224","v":0.16076550000000001}]
[null,"P9848","Desenhista",9.090909090909091E-6,"mês",null,10596.234399999999,39.24531259259259,null,{"$f":"D225*G225","v":9.6329403636363636E-2}]
[null,null,null,"Custo horário total de mão de obra",{"$nulls":5},{"$f":"SUM(J222:J225)","v":0.47048369909090915}]
[null,null,null,"Custo horário total de execução",{"$nulls":5},{"$f":"J220+J226","v":0.5124686990909092}]
[null,null,null,"Custo unitário de execução",{"$nulls":5},{"$f":"J227/I214","v":0.5124686990909092}]
[{"$nulls":7},"Custo do FIC",null,"-"]
[{"$nulls":7},"Custo do FIT",null,"-"]
[null,"C - MATERIAL",null,"Quantidade","Unidade",null,"Preço Unitário","Custo Unitário"]
[null,"-",0,0,0,null,0,null,null,{"$f":"D232*G232","v":0}]
[null,"-",0,0,0,null,0,null,null,0]
[null,null,null,"Custo unitário total de material",{"$nulls":5},{"$f":"SUM(J232:J233)","v":0}]
[null,"D - ATIVIDADES AUXILIARES",null,"Quantidade","Unidade",null,"Custo Unitário","Custo Unitário"]
[null,"-",0,0,0,null,0,null,null,{"$f":"D236*G236","v":0}]
[null,"-",0,0,0,null,0,null,null,{"$f":"D237*G237","v":0}]
[null,null,null,"Custo total de atividades auxiliares",{"$nulls":5},{"$f":"SUM(J236:J237)","v":0}]
[{"$nulls":7},"Subtotal",null,{"$f":"J228+J234+J238","v":0.5124686990909092}]
[null,"E - TEMPO FIXO",null,"Código","Quantidade","Unidade",null,"Custo Unitário","Custo Unitário"]
[null,"-",0,"-",0,"t",null,0,null,{"$f":"ROUNDDOWN(E241*H241,4)","v":0}]
[null,"-",0,"-",0,"t",null,0,null,{"$f":"ROUNDDOWN(E242*H242,4)","v":0}]
[null,null,null,"Custo unitário total de tempo fixo",{"$nulls":5},{"$f":"SUM(J241:J242)","v":0}]
[null,"F - MOMENTO DE TRANSPORTE",null,"Quantidade","Unidade","DMT",null,null,null,"Custo Unitário"]
[{"$nulls":5},"LN","RP","P"]
[null,"-",0,0,"tkm"]
[null,"-",0,0,"tkm"]
[null,null,null,"Custo unitário total de transporte"]
[{"$nulls":5},"Custo unitário direto total",null,null,null,{"$f":"TRUNC(J239+J243,2)","v":0.51}]
[null,"Obs."]
[]
[{"$f":"A211+1","v":7},"1ª/GRD",{"$nulls":8},{"$f":"J288","v":6.89}]
[null,"OBRA:","PAVIMENTAÇÃO ASFÁLTICA EM CBUQ - VIAS URBANAS DIVERSAS (MATO VERDE / MG)"]
[null,"Custo Unitário de Referência",null,null,"Minas Gerais"]
[{"$nulls":4}," Abril/2025 ",null,null,"Produção da equipe ",230.19,{"$f":"VLOOKUP(A252,ORÇAMENTO!$A$10:$L$43,7,1)","v":"M3"}]
[null,5502140,"ESCAVAÇÃO, CARGA E TRANSPORTE DE MATERIAL DE 1ª CATEGORIA - DMT 1.000 A 1.200M, CAMINHO DE SERVIÇO EM REVESTIMENTO PRIMÁRIO",{"$nulls":5},"Valores em reais (R$)"]
[null,"A - EQUIPAMENTOS",null,"Quantidade","Utilização",null,"Custo Horário",null,null,"Custo"]
[{"$nulls":4},"Operativa","Improdutiva","Produtivo","Improdutivo",null,"Horário Total"]
[null,"E9667","Caminhão basculante com capacidade de 14 m³ - 210 kW",4,0.97,0.03,313.74529999999999,91.048100000000005,null,{"$f":"D259*(E259*G259+F259*H259)","v":1228.2575360000001}]
[null,"E9515","Escavadeira hidráulica sobre esteiras com caçamba com capacidade de 1,56 m³ - 118 kW",1,1,0,307.78859999999997,139.61009999999999,null,{"$f":"D260*(E260*G260+F260*H260)","v":307.78859999999997}]
[{"$nulls":7},"Custo horário total de equipamentos",null,{"$f":"SUM(J259:J260)","v":1536.0461359999999}]
[null,"B - MÃO DE OBRA",null,"Quantidade","Unidade",null,"Custo Horário","Custo Horário Total"]
[null,"P9824","Servente",1,"h",null,21.435400000000001,null,null,{"$f":"D263*G263","v":21.435400000000001}]
[{"$nulls":9},{"$f":"D264*G264","v":0}]
[null,null,null,"Custo horário total de mão de obra",{"$nulls":5},{"$f":"SUM(J263:J264)","v":21.435400000000001}]
[null,null,null,"Custo horário total de execução",{"$nulls":5},{"$f":"J261+J265","v":1557.481536}]
[null,null,null,"Custo unitário de execução",{"$nulls":5},{"$f":"J266/I255","v":6.7660694904209571}]
[{"$nulls":7},"Custo do FIC",null,0.1313]
[{"$nulls":7},"Custo do FIT",null,0]
[null,"C - MATERIAL",null,"Quantidade","Unidade",null,"Preço Unitário","Custo Unitário"]
[null,"-",0,null,0,null,0,null,null,{"$f":"D271*G271","v":0}]
[null,"-",0,null,0,null,0,null,null,{"$f":"D272*G272","v":0}]
[null,null,null,"Custo unitário total de material",{"$nulls":5},{"$f":"SUM(J271:J272)","v":0}]
[null,"D - ATIVIDADES AUXILIARES",null,"Quantidade","Unidade",null,"Custo Unitário","Custo Unitário"]
[null,"-",0,0,0,null,0,null,null,{"$f":"D275*G275","v":0}]
[null,"-",0,0,0,null,0,null,null,{"$f":"D276*G276","v":0}]
[null,null,null,"Custo total de atividades auxiliares",{"$nulls":5},{"$f":"SUM(J275:J276)","v":0}]
[{"$nulls":7},"Subtotal",null,{"$f":"J267+J273+J277+J268+J269","v":6.8973694904209575}]
[null,"E - TEMPO FIXO",null,"Código","Quantidade","Unidade",null,"Custo Unitário","Custo Unitário"]
[null,"-",0,"-",0,"t",null,0,null,{"$f":"ROUNDDOWN(E280*H280,4)","v":0}]
[null,"-",0,"-",0,"t",null,0,null,{"$f":"ROUNDDOWN(E281*H281,4)","v":0}]
[null,null,null,"Custo unitário total de tempo fixo",{"$nulls":5},{"$f":"SUM(J280:J281)","v":0}]
[null,"F - MOMENTO DE TRANSPORTE",null,"Quantidade","Unidade","DMT",null,null,null,"Custo Unitário"]
[{"$nulls":5},"LN","RP","P"]
[null,"-",0,null,"tkm","5914449","5914464","5914479"]
[null,"-",0,null,"tkm","5914449","5914464","5914479"]
[null,null,null,"Custo unitário total de transporte"]
[{"$nulls":5},"Custo unitário direto total",null,null,null,{"$f":"TRUNC(J278+J282,2)","v":6.89}]
[null,"Obs."]
[]
[9,"1ª/GRD",{"$nulls":8},{"$f":"J331","v":1.56}]
[null,"OBRA:","PAVIMENTAÇÃO ASFÁLTICA EM CBUQ - VIAS URBANAS DIVERSAS (MATO VERDE / MG)"]
[null,"Custo Unitário de Referência",null,null,"Minas Gerais"]
[{"$nulls":4}," Abril/2025 ",null,null,"Produção da equipe ",672.8,{"$f":"VLOOKUP(A291,ORÇAMENTO!$A$10:$L$43,7,1)","v":"M2"}]
[null,4011209,"REGULARIZAÇÃO E COMPACTAÇÃO DO SUBLEITO ",{"$nulls":5},"Valores em reais (R$)"]
[null,"A - EQUIPAMENTOS",null,"Quantidade","Utilização",null,"Custo Horário",null,null,"Custo"]
[{"$nulls":4},"Operativa","Improdutiva","Produtivo","Improdutivo",null,"Horário Total"]
[null,"E9571","Caminhão tanque com capacidade de 10.000 l - 188 kW",1,0.61,0.39,332.8408,83.189300000000003,null,{"$f":"D298*(E298*G298+F298*H298)","v":235.47671499999998}]
[null,"E9518","Grade de 24 discos rebocável de D = 60 cm (24\")",1,0.41,0.59,4.9446000000000003,3.4432999999999998,null,{"$f":"D299*(E299*G299+F299*H299)","v":4.0588329999999999}]
[null,"E9524","Motoniveladora - 93 kW",1,0.43,0.56999999999999995,283.71199999999999,122.7861,null,191.98423699999998]
[null,"E9762","Rolo compactador de pneus autopropelido de 27 t - 85 kW",1,0.96,0.04,257.48289999999997,125.15349999999999,null,252.18972399999996]
[null,"E9685","Rolo compactador pé de carneiro vibratório autopropelido por pneus de 11,6 t - 82 kW",1,1,0,228.8742,102.6397,null,228.8742]
[null,"E9577","Trator agrícola sobre pneus - 77 kW",1,0.41,0.59,154.65969999999999,55.817599999999999,null,96.342860999999999]
[{"$nulls":7},"Custo horário total de equipamentos",null,{"$f":"SUM(J298:J303)","v":1008.9265699999999}]
[null,"B - MÃO DE OBRA",null,"Quantidade","Unidade",null,"Custo Horário","Custo Horário Total"]
[null,"P9824","Servente",1,"h",null,21.435400000000001,null,null,{"$f":"D306*G306","v":21.435400000000001}]
[null,"-",null,0,0,null,0,null,null,{"$f":"D307*G307","v":0}]
[null,null,null,"Custo horário total de mão de obra",{"$nulls":5},{"$f":"SUM(J306:J307)","v":21.435400000000001}]
[null,null,null,"Custo horário total de execução",{"$nulls":5},{"$f":"J304+J308","v":1030.3619699999999}]
[null,null,null,"Custo unitário de execução",{"$nulls":5},{"$f":"J309/I294","v":1.5314535820451842}]
[{"$nulls":7},"Custo do FIC",null,3.1300000000000001E-2]
[{"$nulls":7},"Custo do FIT",null,0]
[null,"C - MATERIAL",null,"Quantidade","Unidade",null,"Preço Unitário","Custo Unitário"]
[null,"-",0,null,0,null,0,null,null,{"$f":"D314*G314","v":0}]
[null,"-",0,null,0,null,0,null,null,{"$f":"D315*G315","v":0}]
[null,null,null,"Custo unitário total de material",{"$nulls":5},{"$f":"SUM(J314:J315)","v":0}]
[null,"D - ATIVIDADES AUXILIARES",null,"Quantidade","Unidade",null,"Custo Unitário","Custo Unitário"]
[null,"-",0,0,0,null,0,null,null,{"$f":"D318*G318","v":0}]
[null,"-",0,0,0,null,0,null,null,{"$f":"D319*G319","v":0}]
[null,null,null,"Custo total de atividades auxiliares",{"$nulls":5},{"$f":"SUM(J318:J319)","v":0}]
[{"$nulls":7},"Subtotal",null,{"$f":"J310+J316+J320+J311+J312","v":1.5627535820451843}]
[null,"E - TEMPO FIXO",null,"Código","Quantidade","Unidade",null,"Custo Unitário","Custo Unitário"]
[null,"-",0,"-",0,"t",null,0,null,{"$f":"ROUNDDOWN(E323*H323,4)","v":0}]
[null,"-",0,"-",0,"t",null,0,null,{"$f":"ROUNDDOWN(E324*H324,4)","v":0}]
[null,null,null,"Custo unitário total de tempo fixo",{"$nulls":5},{"$f":"SUM(J323:J324)","v":0}]
[null,"F - MOMENTO DE TRANSPORTE",null,"Quantidade","Unidade","DMT",null,null,null,"Custo Unitário"]
[{"$nulls":5},"LN","RP","P"]
[null,"-",0,null,"tkm","5914449","5914464","5914479"]
[null,"-",0,null,"tkm","5914449","5914464","5914479"]
[null,null,null,"Custo unitário total de transporte"]
[{"$nulls":5},"Custo unitário direto total",null,null,null,{"$f":"TRUNC(J321+J325,2)","v":1.56}]
[null,"Obs."]
[]
[{"$f":"A291+1","v":10},"1ª/GRD",{"$nulls":8},{"$f":"J374","v":14.79}]
[null,"OBRA:","PAVIMENTAÇÃO ASFÁLTICA EM CBUQ - VIAS URBANAS DIVERSAS (MATO VERDE / MG)"]
[null,"Custo Unitário de Referência",null,null,"Minas Gerais"]
[{"$nulls":4}," Abril/2025 ",null,null,"Produção da equipe ",112.13,{"$f":"VLOOKUP(A334,ORÇAMENTO!$A$10:$L$43,7,1)","v":"M3"}]
[null,4011219,"EXECUÇÃO E COMPACTAÇÃO DE BASE E OU SUB BASE PARA PAVIMENTAÇÃO COM SOLO ESTABILIZADO GRANULOMETRICAMENTE SEM MISTURA, COM MATERIAL DE JAZIDA - EXCLUSIVE TRANSPORTE",{"$nulls":5},"Valores em reais (R$)"]
[null,"A - EQUIPAMENTOS",null,"Quantidade","Utilização",null,"Custo Horário",null,null,"Custo"]
[{"$nulls":4},"Operativa","Improdutiva","Produtivo","Improdutivo",null,"Horário Total"]
[null,"E9571","Caminhão tanque com capacidade de 10.000 l - 188 kW",1,0.62,0.38,332.8408,83.189300000000003,null,{"$f":"D341*(E341*G341+F341*H341)","v":237.97323}]
[null,"E9518","Grade de 24 discos rebocável de D = 60 cm (24\")",1,0.34,0.66,4.9446000000000003,3.4432999999999998,null,{"$f":"D342*(E342*G342+F342*H342)","v":3.9537420000000001}]
[null,"E9524","Motoniveladora - 93 kW",1,0.5,0.5,283.71199999999999,122.7861,null,203.24905000000001]
[null,"E9762","Rolo compactador de pneus autopropelido de 27 t - 85 kW",1,0.96,0.04,257.48289999999997,125.15349999999999,null,252.18972399999996]
[null,"E9685","Rolo compactador pé de carneiro vibratório autopropelido por pneus de 11,6 t - 82 kW",1,1,0,228.8742,102.6397,null,228.8742]
[null,"E9577","Trator agrícola sobre pneus - 77 kW",1,0.34,0.66,154.65969999999999,55.817599999999999,null,{"$f":"D346*(E346*G346+F346*H346)","v":89.423913999999996}]
[{"$nulls":7},"Custo horário total de equipamentos",null,{"$f":"SUM(J341:J346)","v":1015.6638599999999}]
[null,"B - MÃO DE OBRA",null,"Quantidade","Unidade",null,"Custo Horário","Custo Horário Total"]
[null,"P9824","Servente",1,"h",null,21.435400000000001,null,null,{"$f":"D349*G349","v":21.435400000000001}]
[null,"-",0,0,0,null,0,null,null,{"$f":"D350*G350","v":0}]
[null,null,null,"Custo horário total de mão de obra",{"$nulls":5},{"$f":"SUM(J349:J350)","v":21.435400000000001}]
[null,null,null,"Custo horário total de execução",{"$nulls":5},{"$f":"J347+J351","v":1037.09926}]
[null,null,null,"Custo unitário de execução",{"$nulls":5},{"$f":"J352/I337","v":9.2490792829751189}]
[{"$nulls":7},"Custo do FIC",null,0.189]
[{"$nulls":7},"Custo do FIT",null,0]
[null,"C - MATERIAL",null,"Quantidade","Unidade",null,"Preço Unitário","Custo Unitário"]
[null,"-",0,null,0,null,0,null,null,{"$f":"D357*G357","v":0}]
[null,"-",0,null,0,null,0,null,null,{"$f":"D358*G358","v":0}]
[null,null,null,"Custo unitário total de material",{"$nulls":5},{"$f":"SUM(J357:J358)","v":0}]
[null,"D - ATIVIDADES AUXILIARES",null,"Quantidade","Unidade",null,"Custo Unitário","Custo Unitário"]
[null,4016096,"Escavação e carga de material de jazida com escavadeira hidráulica de 1,56 m³",1.1002700000000001,"m³",null,1.46,null,null,{"$f":"D361*G361","v":1.6063942}]
[null,"-",0,0,0,null,0,null,null,{"$f":"D362*G362","v":0}]
[null,null,null,"Custo total de atividades auxiliares",{"$nulls":5},{"$f":"SUM(J361:J362)","v":1.6063942}]
[{"$nulls":7},"Subtotal",null,{"$f":"J353+J359+J363+J354+J355","v":11.044473482975119}]
[null,"E - TEMPO FIXO",null,"Código","Quantidade","Unidade",null,"Custo Unitário","Custo Unitário"]
[null,4016096,"Escavação e carga de material de jazida com escavadeira hidráulica de 1,56 m³",5914354,2.0630099999999998,"t",null,1.82,null,{"$f":"ROUNDDOWN(E366*H366,4)","v":3.7545999999999999}]
[null,"-",0,"-",null,"t",null,0,null,{"$f":"ROUNDDOWN(E367*H367,4)","v":0}]
[null,null,null,"Custo unitário total de tempo fixo",{"$nulls":5},{"$f":"SUM(J366:J367)","v":3.7545999999999999}]
[null,"F - MOMENTO DE TRANSPORTE",null,"Quantidade","Unidade","DMT",null,null,null,"Custo Unitário"]
[{"$nulls":5},"LN","RP","P"]
[null,4016096,"Escavação e carga de material de jazida com escavadeira hidráulica de 1,56 m³",2.0630099999999998,"tkm","5914359","5914374","5914389"]
[null,"-",0,0,"tkm"]
[null,null,null,"Custo unitário total de transporte"]
[{"$nulls":5},"Custo unitário direto total",null,null,null,{"$f":"TRUNC(J364+J368,2)","v":14.79}]
[null,"Obs."]
[]
[12,"1ª/GRD",{"$nulls":8},{"$f":"J413","v":0.41}]
[null,"OBRA:","PAVIMENTAÇÃO ASFÁLTICA EM CBUQ - VIAS URBANAS DIVERSAS (MATO VERDE / MG)"]
[null,"Custo Unitário de Referência",null,null,"Minas Gerais"]
[{"$nulls":4}," Abril/2025 ",null,null,"Produção da equipe ",1038.46,{"$f":"VLOOKUP(A377,ORÇAMENTO!$A$10:$L$43,7,1)","v":"M2"}]
[null,4011352,"IMPRIMAÇÃO COM EMULSÃO ASFÁLTICA (EAI)",{"$nulls":5},"Valores em reais (R$)"]
[null,"A - EQUIPAMENTOS",null,"Quantidade","Utilização",null,"Custo Horário",null,null,"Custo"]
[{"$nulls":4},"Operativa","Improdutiva","Produtivo","Improdutivo",null,"Horário Total"]
[null,"E9509","Caminhão tanque distribuidor de asfalto com capacidade de 6.000 l - 7 kW/136 kW",1,1,0,267.51929999999999,74.644499999999994,null,{"$f":"D384*(E384*G384+F384*H384)","v":267.51929999999999}]
[null,"E9558","Tanque de estocagem de asfalto com capacidade de 30.000 l",2,1,0,57.98,39.604599999999998,null,{"$f":"D385*(E385*G385+F385*H385)","v":115.96}]
[{"$nulls":7},"Custo horário total de equipamentos",null,{"$f":"SUM(J384:J385)","v":383.47929999999997}]
[null,"B - MÃO DE OBRA",null,"Quantidade","Unidade",null,"Custo Horário","Custo Horário Total"]
[null,"P9824","Servente",2,"h",null,21.435400000000001,null,null,{"$f":"D388*G388","v":42.870800000000003}]
[null,"-",{"$nulls":7},{"$f":"D389*G389","v":0}]
[null,null,null,"Custo horário total de mão de obra",{"$nulls":5},{"$f":"SUM(J388:J389)","v":42.870800000000003}]
[null,null,null,"Custo horário total de execução",{"$nulls":5},{"$f":"J386+J390","v":426.3501}]
[null,null,null,"Custo unitário de execução",{"$nulls":5},{"$f":"J391/I380","v":0.41055996379253895}]
[{"$nulls":7},"Custo do FIC",null,1.4E-3]
[{"$nulls":7},"Custo do FIT",null,0]
[null,"C - MATERIAL",null,"Quantidade","Unidade",null,"Preço Unitário","Custo Unitário"]
[null,"M2092","Emulsão asfáltica para imprimação",1.2999999999999999E-3,"t",null,0,"FORNECIMENTO COM BDI DIFERENCIADO",null,{"$f":"D396*G396","v":0}]
[null,"-",0,0,0,null,0,null,null,{"$f":"D397*G397","v":0}]
[null,null,null,"Custo unitário total de material",{"$nulls":5},{"$f":"SUM(J396:J397)","v":0}]
[null,"D - ATIVIDADES AUXILIARES",null,"Quantidade","Unidade",null,"Custo Unitário","Custo Unitário"]
[null,"-",0,0,0,null,0,null,null,{"$f":"D400*G400","v":0}]
[null,"-",0,0,0,null,0,null,null,{"$f":"D401*G401","v":0}]
[null,null,null,"Custo total de atividades auxiliares",{"$nulls":5},{"$f":"SUM(J400:J401)","v":0}]
[{"$nulls":7},"Subtotal",null,{"$f":"J392+J398+J402+J393+J394","v":0.41195996379253896}]
[null,"E - TEMPO FIXO",null,"Código","Quantidade","Unidade",null,"Custo Unitário","Custo Unitário"]
[null,"-",0,"-",0,"t",null,0,null,{"$f":"ROUNDDOWN(E405*H405,4)","v":0}]
[null,"-",0,"-",0,"t",null,0,null,{"$f":"ROUNDDOWN(E406*H406,4)","v":0}]
[null,null,null,"Custo unitário total de tempo fixo",{"$nulls":5},{"$f":"SUM(J405:J406)","v":0}]
[null,"F - MOMENTO DE TRANSPORTE",null,"Quantidade","Unidade","DMT",null,null,null,"Custo Unitário"]
[{"$nulls":5},"LN","RP","P"]
[null,"-",0,null,"tkm"]
[null,"-",0,null,"tkm"]
[null,null,null,"Custo unitário total de transporte"]
[{"$nulls":5},"Custo unitário direto total",null,null,null,{"$f":"TRUNC(J403+J407,2)","v":0.41}]
[null,"Obs."]
[]
[{"$f":"A377+1","v":13},"1ª/GRD",{"$nulls":8},{"$f":"J452","v":0.28000000000000003}]
[null,"OBRA:","PAVIMENTAÇÃO ASFÁLTICA EM CBUQ - VIAS URBANAS DIVERSAS (MATO VERDE / MG)"]
[null,"Custo Unitário de Referência",null,null,"Minas Gerais"]
[{"$nulls":4}," Abril/2025 ",null,null,"Produção da equipe ",1500,{"$f":"VLOOKUP(A416,ORÇAMENTO!$A$10:$L$43,7,1)","v":"M2"}]
[null,4011353,"PINTURA DE LIGAÇÃO COM EMULSÃO ASFÁLTICA RR-1C",{"$nulls":5},"Valores em reais (R$)"]
[null,"A - EQUIPAMENTOS",null,"Quantidade","Utilização",null,"Custo Horário",null,null,"Custo"]
[{"$nulls":4},"Operativa","Improdutiva","Produtivo","Improdutivo",null,"Horário Total"]
[null,"E9509","Caminhão tanque distribuidor de asfalto com capacidade de 6.000 l - 7 kW/136 kW",1,1,0,267.51929999999999,74.644499999999994,null,{"$f":"D423*(E423*G423+F423*H423)","v":267.51929999999999}]
[null,"E9558","Tanque de estocagem de asfalto com capacidade de 30.000 l",2,1,0,57.98,39.604599999999998,null,{"$f":"D424*(E424*G424+F424*H424)","v":115.96}]
[{"$nulls":7},"Custo horário total de equipamentos",null,{"$f":"SUM(J423:J424)","v":383.47929999999997}]
[null,"B - MÃO DE OBRA",null,"Quantidade","Unidade",null,"Custo Horário","Custo Horário Total"]
[null,"P9824","Servente",2,"h",null,21.435400000000001,null,null,{"$f":"D427*G427","v":42.870800000000003}]
[null,"-",{"$nulls":7},{"$f":"D428*G428","v":0}]
[null,null,null,"Custo horário total de mão de obra",{"$nulls":5},{"$f":"SUM(J427:J428)","v":42.870800000000003}]
[null,null,null,"Custo horário total de execução",{"$nulls":5},{"$f":"J425+J429","v":426.3501}]
[null,null,null,"Custo unitário de execução",{"$nulls":5},{"$f":"J430/I419","v":0.28423340000000002}]
[{"$nulls":7},"Custo do FIC",null,1E-3]
[{"$nulls":7},"Custo do FIT",null,0]
[null,"C - MATERIAL",null,"Quantidade","Unidade",null,"Preço Unitário","Custo Unitário"]
[null,"M1946","Emulsão asfáltica - RR-1C",4.4999999999999999E-4,"t",null,0,"FORNECIMENTO COM BDI DIFERENCIADO",null,{"$f":"D435*G435","v":0}]
[null,"-",0,null,0,null,0,null,null,{"$f":"D436*G436","v":0}]
[null,null,null,"Custo unitário total de material",{"$nulls":5},{"$f":"SUM(J435:J436)","v":0}]
[null,"D - ATIVIDADES AUXILIARES",null,"Quantidade","Unidade",null,"Custo Unitário","Custo Unitário"]
[null,"-",0,0,0,null,0,null,null,{"$f":"D439*G439","v":0}]
[null,"-",0,0,0,null,0,null,null,{"$f":"D440*G440","v":0}]
[null,null,null,"Custo total de atividades auxiliares",{"$nulls":5},{"$f":"SUM(J439:J440)","v":0}]
[{"$nulls":7},"Subtotal",null,{"$f":"J431+J437+J441+J432+J433","v":0.28523340000000003}]
[null,"E - TEMPO FIXO",null,"Código","Quantidade","Unidade",null,"Custo Unitário","Custo Unitário"]
[null,"-",0,"-",0,"t",null,0,null,{"$f":"ROUNDDOWN(E444*H444,4)","v":0}]
[null,"-",0,"-",0,"t",null,0,null,{"$f":"ROUNDDOWN(E445*H445,4)","v":0}]
[null,null,null,"Custo unitário total de tempo fixo",{"$nulls":5},{"$f":"SUM(J444:J445)","v":0}]
[null,"F - MOMENTO DE TRANSPORTE",null,"Quantidade","Unidade","DMT",null,null,null,"Custo Unitário"]
[{"$nulls":5},"LN","RP","P"]
[null,"-",0,null,"tkm"]
[null,"-",0,null,"tkm"]
[null,null,null,"Custo unitário total de transporte"]
[{"$nulls":5},"Custo unitário direto total",null,null,null,{"$f":"TRUNC(J442+J446,2)","v":0.28000000000000003}]
[null,"Obs."]
[]
[{"$f":"A416+1","v":14},"1ª/GRD",{"$nulls":8},{"$f":"J492","v":174.07}]
[null,"OBRA:","PAVIMENTAÇÃO ASFÁLTICA EM CBUQ - VIAS URBANAS DIVERSAS (MATO VERDE / MG)"]
[null,"Custo Unitário de Referência",null,null,"Minas Gerais"]
[{"$nulls":4}," Abril/2025 ",null,null,"Produção da equipe ",99.6,{"$f":"VLOOKUP(A455,ORÇAMENTO!$A$10:$L$43,7,1)","v":"T"}]
[null,4011463,"EXECUÇÃO DE PAVIMENTO COM APLICAÇÃO DE CONCRETO ASFÁLTICO USINADO A QUENTE (CBUQ), CAMADA DE ROLAMENTO - EXCLUSIVE TRANSPORTE",{"$nulls":5},"Valores em reais (R$)"]
[null,"A - EQUIPAMENTOS",null,"Quantidade","Utilização",null,"Custo Horário",null,null,"Custo"]
[{"$nulls":4},"Operativa","Improdutiva","Produtivo","Improdutivo",null,"Horário Total"]
[null,"E9762","Rolo compactador de pneus autopropelido de 27 t - 85 kW",1,0.71,0.28999999999999998,257.48289999999997,125.15349999999999,null,{"$f":"D462*(E462*G462+F462*H462)","v":219.10737399999996}]
[null,"E9681","Rolo compactador liso tandem vibratório autopropelido de 10,4 t - 82 kW",1,0.82,0.18,299.81799999999998,113.9695,null,{"$f":"D463*(E463*G463+F463*H463)","v":266.36526999999995}]
[null,"E9545","Vibroacabadora de asfalto sobre esteiras - 97 kW",1,1,0,365.24360000000001,156.6223,null,{"$f":"D464*(E464*G464+F464*H464)","v":365.24360000000001}]
[{"$nulls":7},"Custo horário total de equipamentos",null,{"$f":"SUM(J462:J464)","v":850.71624399999996}]
[null,"B - MÃO DE OBRA",null,"Quantidade","Unidade",null,"Custo Horário","Custo Horário Total"]
[null,"P9824","Servente",8,"h",null,21.435400000000001,null,null,{"$f":"D467*G467","v":171.48320000000001}]
[null,"-",0,null,0,null,0,null,null,{"$f":"D468*G468","v":0}]
[null,null,null,"Custo horário total de mão de obra",{"$nulls":5},{"$f":"SUM(J467:J468)","v":171.48320000000001}]
[null,null,null,"Custo horário total de execução",{"$nulls":5},{"$f":"J465+J469","v":1022.199444}]
[null,null,null,"Custo unitário de execução",{"$nulls":5},{"$f":"J470/I458","v":10.263046626506025}]
[{"$nulls":7},"Custo do FIC",null,3.49E-2]
[{"$nulls":7},"Custo do FIT",null,0]
[null,"C - MATERIAL",null,"Quantidade","Unidade",null,"Preço Unitário","Custo Unitário"]
[null,"-",0,null,0,null,0,null,null,{"$f":"D475*G475","v":0}]
[null,"-",0,null,0,null,0,null,null,{"$f":"D476*G476","v":0}]
[null,null,null,"Custo unitário total de material",{"$nulls":5},{"$f":"SUM(J475:J476)","v":0}]
[null,"D - ATIVIDADES AUXILIARES",null,"Quantidade","Unidade",null,"Custo Unitário","Custo Unitário"]
[null,6416078,"Usinagem de concreto asfáltico - faixa C-12,5 - areia e brita comerciais",1,"t",null,156.08455153216869,null,null,{"$f":"D479*G479","v":156.08455153216869}]
[null,"-",0,0,0,null,0,null,null,{"$f":"D480*G480","v":0}]
[null,null,null,"Custo total de atividades auxiliares",{"$nulls":5},{"$f":"SUM(J479:J480)","v":156.08455153216869}]
[{"$nulls":7},"Subtotal",null,{"$f":"J471+J477+J481+J472+J473","v":166.38249815867471}]
[null,"E - TEMPO FIXO",null,"Código","Quantidade","Unidade",null,"Custo Unitário","Custo Unitário"]
[null,6416078,"Usinagem de concreto asfáltico - faixa C-12,5 - areia e brita comerciais",5914649,1,"t",null,7.69,null,{"$f":"ROUNDDOWN(E484*H484,4)","v":7.69}]
[null,"-",0,"-",0,"t",null,0,null,{"$f":"ROUNDDOWN(E485*H485,4)","v":0}]
[null,null,null,"Custo unitário total de tempo fixo",{"$nulls":5},{"$f":"SUM(J484:J485)","v":7.69}]
[null,"F - MOMENTO DE TRANSPORTE",null,"Quantidade","Unidade","DMT",null,null,null,"Custo Unitário"]
[{"$nulls":5},"LN","RP","P"]
[null,6416078,"Usinagem de concreto asfáltico - faixa C-12,5 - areia e brita comerciais",1.02,"tkm"]
[null,"-",0,0,"tkm"]
[null,null,null,"Custo unitário total de transporte"]
[{"$nulls":5},"Custo unitário direto total",null,null,null,{"$f":"TRUNC(J482+J486,2)","v":174.07}]
[null,"Obs."]
[]
[null,"1ª/GRD",{"$nulls":8},{"$f":"J546","v":156.08455153216869}]
[null,"OBRA:","PAVIMENTAÇÃO ASFÁLTICA EM CBUQ - VIAS URBANAS DIVERSAS (MATO VERDE / MG)"]
[null,"Custo Unitário de Referência - Auxiliar",null,null,"Minas Gerais"]
[{"$nulls":4}," Abril/2025 ",null,null,"Produção da equipe ",99.6,"t"]
[null,6416078,"Usinagem de concreto asfáltico - faixa C - areia e brita comerciais",{"$nulls":5},"Valores em reais (R$)"]
[null,"A - EQUIPAMENTOS",null,"Quantidade","Utilização",null,"Custo Horário",null,null,"Custo"]
[{"$nulls":4},"Operativa","Improdutiva","Produtivo","Improdutivo",null,"Horário Total"]
[null,"E9559","Aquecedor de fluido térmico - 12 kW",1,1,0,76.738399999999999,44.1357,null,{"$f":"D502*(E502*G502+F502*H502)","v":76.738399999999999}]
[null,"E9584","Carregadeira de pneus com capacidade de 1,72 m³ - 113 kW",1,0.86,0.14000000000000001,207.10550000000001,103.1602,null,{"$f":"D503*(E503*G503+F503*H503)","v":192.553158}]
[null,"E9021","Grupo gerador - 456 kVA",1,1,0,423.6705,22.1999,null,423.6705]
[null,"E9558","Tanque de estocagem de asfalto com capacidade de 30.000 l",2,1,0,57.98,39.604599999999998,null,115.96]
[null,"E9689","Usina de asfalto a quente gravimétrica com capacidade de 100/140 t/h - 260 kW",1,1,0,1240.8839,658.63800000000003,null,{"$f":"D506*(E506*G506+F506*H506)","v":1240.8839}]
[{"$nulls":7},"Custo horário total de equipamentos",null,{"$f":"SUM(J502:J506)","v":2049.8059579999999}]
[null,"B - MÃO DE OBRA",null,"Quantidade","Unidade",null,"Custo Horário","Custo Horário Total"]
[null,"P9824","Servente",4,"h",null,21.435400000000001,null,null,{"$f":"D509*G509","v":85.741600000000005}]
[null,null,null,"Custo horário total de mão de obra",{"$nulls":5},{"$f":"SUM(J509:J509)","v":85.741600000000005}]
[null,null,null,"Custo horário total de execução",{"$nulls":5},{"$f":"J507+J510","v":2135.5475579999998}]
[null,null,null,"Custo unitário de execução",{"$nulls":5},{"$f":"J511/I498","v":21.441240542168675}]
[{"$nulls":7},"Custo do FIC",null,0]
[{"$nulls":7},"Custo do FIT",null,0]
[null,"C - MATERIAL",null,"Quantidade","Unidade",null,"Preço Unitário","Custo Unitário"]
[null,"M0028","Areia média",2.7009999999999999E-2,"m³",null,107,null,null,{"$f":"D516*G516","v":2.8900700000000001}]
[null,"M0005","Brita 0",9.0029999999999999E-2,"m³",null,125,null,null,{"$f":"D517*G517","v":11.25375}]
[null,"M0191","Brita 1",3.2149999999999998E-2,"m³",null,117,null,null,3.7615499999999997]
[null,"M0344","Cal hidratada - a granel",14.4636,"kg",null,0.64459999999999995,null,null,9.3232365599999998]
[null,"M1943","Cimento asfáltico de petróleo - CAP 50/70",5.5449999999999999E-2,"t",null,0,"FORNECIMENTO COM BDI DIFERENCIADO",null,0]
[null,"M1941","Óleo tipo A1",8,"l",null,5.1599000000000004,null,null,41.279200000000003]
[null,"M1103","Pedrisco",0.1479,"m³",null,184.07169999999999,null,null,{"$f":"D522*G522","v":27.22420443}]
[null,"M1135","Pó de pedra",0.33631,"m³",null,110,null,null,36.994100000000003]
[null,null,null,"Custo unitário total de material",{"$nulls":5},{"$f":"SUM(J516:J523)","v":132.72611099}]
[null,"D - ATIVIDADES AUXILIARES",null,"Quantidade","Unidade",null,"Custo Unitário","Custo Unitário"]
[null,"-",0,0,0,null,0,null,null,{"$f":"D526*G526","v":0}]
[null,null,null,"Custo total de atividades auxiliares",{"$nulls":5},{"$f":"SUM(J526:J526)","v":0}]
[{"$nulls":7},"Subtotal",null,{"$f":"J512+J524+J527+J513+J514","v":154.16735153216868}]
[null,"E - TEMPO FIXO",null,"Código","Quantidade","Unidade",null,"Custo Unitário","Custo Unitário"]
[null,"M0028","Areia média",5914647,4.052E-2,"t",null,1.75,null,{"$f":"ROUNDDOWN(E530*H530,4)","v":7.0900000000000005E-2}]
[null,"M0005","Brita 0",5914647,0.13505,"t",null,1.75,null,0.23630000000000001]
[null,"M0191","Brita 1",5914647,4.8230000000000002E-2,"t",null,1.75,null,8.4400000000000003E-2]
[null,"M0344","Cal hidratada - a granel",5914363,1.4460000000000001E-2,"t",null,17.61,null,0.25459999999999999]
[null,"M1103","Pedrisco",5914647,0.22184999999999999,"t",null,1.75,null,0.38819999999999999]
[null,"M1135","Pó de pedra",5914647,0.50446999999999997,"t",null,1.75,null,{"$f":"ROUNDDOWN(E535*H535,4)","v":0.88280000000000003}]
[null,null,null,"Custo unitário total de tempo fixo",{"$nulls":5},{"$f":"SUM(J530:J535)","v":1.9172000000000002}]
[null,"F - MOMENTO DE TRANSPORTE",null,"Quantidade","Unidade","DMT",null,null,null,"Custo Unitário"]
[{"$nulls":5},"LN","RP","P"]
[null,"M0028","Areia média",4.052E-2,"tkm"]
[null,"M0005","Brita 0",0.13505,"tkm"]
[null,"M0191","Brita 1",4.8230000000000002E-2,"tkm"]
[null,"M0344","Cal hidratada - a granel",1.4460000000000001E-2,"tkm"]
[null,"M1103","Pedrisco",0.22184999999999999,"tkm"]
[null,"M1135","Pó de pedra",0.50446999999999997,"tkm"]
[null,null,null,"Custo unitário total de transporte"]
[{"$nulls":5},"Custo unitário direto total",null,null,null,{"$f":"J528+J536","v":156.08455153216869}]
[]
[{"$f":"A455+1","v":15},"1ª/GRD",{"$nulls":8},{"$f":"J584","v":0.66}]
[null,"OBRA:","PAVIMENTAÇÃO ASFÁLTICA EM CBUQ - VIAS URBANAS DIVERSAS (MATO VERDE / MG)"]
[null,"Custo Unitário de Referência",null,null,"Minas Gerais"]
[{"$nulls":4}," Abril/2025 ",null,null,"Produção da equipe ",470.61,{"$f":"VLOOKUP(A548,ORÇAMENTO!$A$10:$L$43,7,1)","v":"TXKM"}]
[null,5915321,"TRANSPORTE COM CAMINHÃO BASCULANTE, EM RODOVIA PAVIMENTADA",{"$nulls":5},"Valores em reais (R$)"]
[null,"A - EQUIPAMENTOS",null,"Quantidade","Utilização",null,"Custo Horário",null,null,"Custo"]
[{"$nulls":4},"Operativa","Improdutiva","Produtivo","Improdutivo",null,"Horário Total"]
[null,"E9667","Caminhão basculante com capacidade de 14 m³ - 210 kW",1,1,0,313.74529999999999,91.048100000000005,null,{"$f":"D555*(E555*G555+F555*H555)","v":313.74529999999999}]
[null,"-",0,null,null,null,0,0,null,{"$f":"D556*(E556*G556+F556*H556)","v":0}]
[{"$nulls":7},"Custo horário total de equipamentos",null,{"$f":"SUM(J555:J556)","v":313.74529999999999}]
[null,"B - MÃO DE OBRA",null,"Quantidade","Unidade",null,"Custo Horário","Custo Horário Total"]
[null,"-",0,null,0,null,0,null,null,{"$f":"D559*G559","v":0}]
[null,"-",0,null,0,null,0,null,null,{"$f":"D560*G560","v":0}]
[null,null,null,"Custo horário total de mão de obra",{"$nulls":5},{"$f":"SUM(J559:J560)","v":0}]
[null,null,null,"Custo horário total de execução",{"$nulls":5},{"$f":"J557+J561","v":313.74529999999999}]
[null,null,null,"Custo unitário de execução",{"$nulls":5},{"$f":"J562/I551","v":0.66667792864580011}]
[{"$nulls":7},"Custo do FIC",null,0]
[{"$nulls":7},"Custo do FIT",null,0]
[null,"C - MATERIAL",null,"Quantidade","Unidade",null,"Preço Unitário","Custo Unitário"]
[null,"-",0,0,0,null,0,null,null,{"$f":"D567*G567","v":0}]
[null,"-",0,0,0,null,0,null,null,{"$f":"D568*G568","v":0}]
[null,null,null,"Custo unitário total de material",{"$nulls":5},{"$f":"SUM(J567:J568)","v":0}]
[null,"D - ATIVIDADES AUXILIARES",null,"Quantidade","Unidade",null,"Custo Unitário","Custo Unitário"]
[null,"-",0,0,0,null,0,null,null,{"$f":"D571*G571","v":0}]
[null,"-",0,0,0,null,0,null,null,{"$f":"D572*G572","v":0}]
[null,null,null,"Custo total de atividades auxiliares",{"$nulls":5},{"$f":"SUM(J571:J572)","v":0}]
[{"$nulls":7},"Subtotal",null,{"$f":"J563+J569+J573+J564+J565","v":0.66667792864580011}]
[null,"E - TEMPO FIXO",null,"Código","Quantidade","Unidade",null,"Custo Unitário","Custo Unitário"]
[null,"-",0,"-",0,"t",null,0,null,{"$f":"ROUNDDOWN(E576*H576,4)","v":0}]
[null,"-",0,"-",0,"t",null,0,null,{"$f":"ROUNDDOWN(E577*H577,4)","v":0}]
[null,null,null,"Custo unitário total de tempo fixo",{"$nulls":5},{"$f":"SUM(J576:J577)","v":0}]
[null,"F - MOMENTO DE TRANSPORTE",null,"Quantidade","Unidade","DMT",null,null,null,"Custo Unitário"]
[{"$nulls":5},"LN","RP","P"]
[null,"-",0,0,"tkm"]
[null,"-",0,0,"tkm"]
[null,null,null,"Custo unitário total de transporte"]
[{"$nulls":5},"Custo unitário direto total",null,null,null,{"$f":"TRUNC(J574+J578,2)","v":0.66}]
[null,"Obs."]
[]
[16,"1ª/GRD",{"$nulls":8},{"$f":"J623","v":0.73}]
[null,"OBRA:","PAVIMENTAÇÃO ASFÁLTICA EM CBUQ - VIAS URBANAS DIVERSAS (MATO VERDE / MG)"]
[null,"Custo Unitário de Referência",null,null,"Minas Gerais"]
[{"$nulls":4}," Abril/2025 ",null,null,"Produção da equipe ",435.75,{"$f":"VLOOKUP(A587,ORÇAMENTO!$A$10:$L$43,7,1)","v":"TXKM"}]
[null,5915320,"TRANSPORTE COM CAMINHÃO BASCULANTE, RODOVIA EM REVESTIMENTO PRIMÁRIO",{"$nulls":5},"Valores em reais (R$)"]
[null,"A - EQUIPAMENTOS",null,"Quantidade","Utilização",null,"Custo Horário",null,null,"Custo"]
[{"$nulls":4},"Operativa","Improdutiva","Produtivo","Improdutivo",null,"Horário Total"]
[null,"E9667","Caminhão basculante com capacidade de 14 m³ - 210 kW",1,1,0,313.74529999999999,91.048100000000005,null,{"$f":"D594*(E594*G594+F594*H594)","v":313.74529999999999}]
[null,"-",0,null,null,null,0,0,null,{"$f":"D595*(E595*G595+F595*H595)","v":0}]
[{"$nulls":7},"Custo horário total de equipamentos",null,{"$f":"SUM(J594:J595)","v":313.74529999999999}]
[null,"B - MÃO DE OBRA",null,"Quantidade","Unidade",null,"Custo Horário","Custo Horário Total"]
[null,"-",0,null,0,null,0,null,null,{"$f":"D598*G598","v":0}]
[null,"-",0,null,0,null,0,null,null,{"$f":"D599*G599","v":0}]
[null,null,null,"Custo horário total de mão de obra",{"$nulls":5},{"$f":"SUM(J598:J599)","v":0}]
[null,null,null,"Custo horário total de execução",{"$nulls":5},{"$f":"J596+J600","v":313.74529999999999}]
[null,null,null,"Custo unitário de execução",{"$nulls":5},{"$f":"J601/I590","v":0.72001216293746406}]
[{"$nulls":7},"Custo do FIC",null,1.4E-2]
[{"$nulls":7},"Custo do FIT",null,0]
[null,"C - MATERIAL",null,"Quantidade","Unidade",null,"Preço Unitário","Custo Unitário"]
[null,"-",0,0,0,null,0,null,null,{"$f":"D606*G606","v":0}]
[null,"-",0,0,0,null,0,null,null,{"$f":"D607*G607","v":0}]
[null,null,null,"Custo unitário total de material",{"$nulls":5},{"$f":"SUM(J606:J607)","v":0}]
[null,"D - ATIVIDADES AUXILIARES",null,"Quantidade","Unidade",null,"Custo Unitário","Custo Unitário"]
[null,"-",0,0,0,null,0,null,null,{"$f":"D610*G610","v":0}]
[null,"-",0,0,0,null,0,null,null,{"$f":"D611*G611","v":0}]
[null,null,null,"Custo total de atividades auxiliares",{"$nulls":5},{"$f":"SUM(J610:J611)","v":0}]
[{"$nulls":7},"Subtotal",null,{"$f":"J602+J608+J612+J603+J604","v":0.73401216293746407}]
[null,"E - TEMPO FIXO",null,"Código","Quantidade","Unidade",null,"Custo Unitário","Custo Unitário"]
[null,"-",0,"-",0,"t",null,0,null,{"$f":"ROUNDDOWN(E615*H615,4)","v":0}]
[null,"-",0,"-",0,"t",null,0,null,{"$f":"ROUNDDOWN(E616*H616,4)","v":0}]
[null,null,null,"Custo unitário total de tempo fixo",{"$nulls":5},{"$f":"SUM(J615:J616)","v":0}]
[null,"F - MOMENTO DE TRANSPORTE",null,"Quantidade","Unidade","DMT",null,null,null,"Custo Unitário"]
[{"$nulls":5},"LN","RP","P"]
[null,"-",0,0,"tkm"]
[null,"-",0,0,"tkm"]
[null,null,null,"Custo unitário total de transporte"]
[{"$nulls":5},"Custo unitário direto total",null,null,null,{"$f":"TRUNC(J613+J617,2)","v":0.73}]
[null,"Obs."]
[]
[{"$f":"A587+1","v":17},"1ª/GRD",{"$nulls":8},{"$f":"J662","v":0.79}]
[null,"OBRA:","PAVIMENTAÇÃO ASFÁLTICA EM CBUQ - VIAS URBANAS DIVERSAS (MATO VERDE / MG)"]
[null,"Custo Unitário de Referência",null,null,"Minas Gerais"]
[{"$nulls":4}," Abril/2025 ",null,null,"Produção da equipe ",231.3,{"$f":"VLOOKUP(A626,ORÇAMENTO!$A$10:$L$43,7,1)","v":"TXKM"}]
[null,5914434,"TRANSPORTE COM CAMINHÃO CARROCERIA 9T, EM VIA URBANA PAVIMENTADA",{"$nulls":5},"Valores em reais (R$)"]
[null,"A - EQUIPAMENTOS",null,"Quantidade","Utilização",null,"Custo Horário",null,null,"Custo"]
[{"$nulls":4},"Operativa","Improdutiva","Produtivo","Improdutivo",null,"Horário Total"]
[null,"E9508","Caminhão carroceria com capacidade de 9 t - 136 kW",1,1,0,183.48670000000001,69.869600000000005,null,{"$f":"D633*(E633*G633+F633*H633)","v":183.48670000000001}]
[null,"-",0,null,null,null,0,0,null,{"$f":"D634*(E634*G634+F634*H634)","v":0}]
[{"$nulls":7},"Custo horário total de equipamentos",null,{"$f":"SUM(J633:J634)","v":183.48670000000001}]
[null,"B - MÃO DE OBRA",null,"Quantidade","Unidade",null,"Custo Horário","Custo Horário Total"]
[null,"-",0,0,0,null,0,null,null,{"$f":"D637*G637","v":0}]
[null,"-",0,0,0,null,0,null,null,{"$f":"D638*G638","v":0}]
[null,null,null,"Custo horário total de mão de obra",{"$nulls":5},{"$f":"SUM(J637:J638)","v":0}]
[null,null,null,"Custo horário total de execução",{"$nulls":5},{"$f":"J635+J639","v":183.48670000000001}]
[null,null,null,"Custo unitário de execução",{"$nulls":5},{"$f":"J640/I629","v":0.79328447903156074}]
[{"$nulls":7},"Custo do FIC",null,0]
[{"$nulls":7},"Custo do FIT",null,0]
[null,"C - MATERIAL",null,"Quantidade","Unidade",null,"Preço Unitário","Custo Unitário"]
[null,"-",0,0,0,null,0,null,null,{"$f":"D645*G645","v":0}]
[null,"-",0,0,0,null,0,null,null,{"$f":"D646*G646","v":0}]
[null,null,null,"Custo unitário total de material",{"$nulls":5},{"$f":"SUM(J645:J646)","v":0}]
[null,"D - ATIVIDADES AUXILIARES",null,"Quantidade","Unidade",null,"Custo Unitário","Custo Unitário"]
[null,"-",0,0,0,null,0,null,null,{"$f":"D649*G649","v":0}]
[null,"-",0,0,0,null,0,null,null,{"$f":"D650*G650","v":0}]
[null,null,null,"Custo total de atividades auxiliares",{"$nulls":5},{"$f":"SUM(J649:J650)","v":0}]
[{"$nulls":7},"Subtotal",null,{"$f":"J641+J647+J651+J642+J643","v":0.79328447903156074}]
[null,"E - TEMPO FIXO",null,"Código","Quantidade","Unidade",null,"Custo Unitário","Custo Unitário"]
[null,"-",0,"-",0,"t",null,0,null,{"$f":"ROUNDDOWN(E654*H654,4)","v":0}]
[null,"-",0,"-",0,"t",null,0,null,{"$f":"ROUNDDOWN(E655*H655,4)","v":0}]
[null,null,null,"Custo unitário total de tempo fixo",{"$nulls":5},{"$f":"SUM(J654:J655)","v":0}]
[null,"F - MOMENTO DE TRANSPORTE",null,"Quantidade","Unidade","DMT",null,null,null,"Custo Unitário"]
[{"$nulls":5},"LN","RP","P"]
[null,"-",0,0,"tkm"]
[null,"-",0,0,"tkm"]
[null,null,null,"Custo unitário total de transporte"]
[{"$nulls":5},"Custo unitário direto total",null,null,null,{"$f":"TRUNC(J652+J656,2)","v":0.79}]
[null,"Obs."]
[]
[{"$f":"A626+1","v":18},"1ª/GRD",{"$nulls":8},{"$f":"J701","v":0.81}]
[null,"OBRA:","PAVIMENTAÇÃO ASFÁLTICA EM CBUQ - VIAS URBANAS DIVERSAS (MATO VERDE / MG)"]
[null,"Custo Unitário de Referência",null,null,"Minas Gerais"]
[{"$nulls":4}," Abril/2025 ",null,null,"Produção da equipe ",224.1,{"$f":"VLOOKUP(A665,ORÇAMENTO!$A$10:$L$43,7,1)","v":"TXKM"}]
[null,5914612,"TRANSPORTE DE MASSA ASFÁLTICA COM CAMINHÃO BASCULANTE, EM VIA URBANA PAVIMENTADA",{"$nulls":5},"Valores em reais (R$)"]
[null,"A - EQUIPAMENTOS",null,"Quantidade","Utilização",null,"Custo Horário",null,null,"Custo"]
[{"$nulls":4},"Operativa","Improdutiva","Produtivo","Improdutivo",null,"Horário Total"]
[null,"E9520","Caminhão com caçamba térmica com capacidade de 6 m³ - 136 kW",1,1,0,183.2457,69.798699999999997,null,{"$f":"D672*(E672*G672+F672*H672)","v":183.2457}]
[null,"-",0,null,null,null,0,0,null,{"$f":"D673*(E673*G673+F673*H673)","v":0}]
[{"$nulls":7},"Custo horário total de equipamentos",null,{"$f":"SUM(J672:J673)","v":183.2457}]
[null,"B - MÃO DE OBRA",null,"Quantidade","Unidade",null,"Custo Horário","Custo Horário Total"]
[null,"-",0,0,0,null,0,null,null,{"$f":"D676*G676","v":0}]
[null,"-",0,0,0,null,0,null,null,{"$f":"D677*G677","v":0}]
[null,null,null,"Custo horário total de mão de obra",{"$nulls":5},{"$f":"SUM(J676:J677)","v":0}]
[null,null,null,"Custo horário total de execução",{"$nulls":5},{"$f":"J674+J678","v":183.2457}]
[null,null,null,"Custo unitário de execução",{"$nulls":5},{"$f":"J679/I668","v":0.81769611780455154}]
[{"$nulls":7},"Custo do FIC",null,0]
[{"$nulls":7},"Custo do FIT",null,0]
[null,"C - MATERIAL",null,"Quantidade","Unidade",null,"Preço Unitário","Custo Unitário"]
[null,"-",0,0,0,null,0,null,null,{"$f":"D684*G684","v":0}]
[null,"-",0,0,0,null,0,null,null,{"$f":"D685*G685","v":0}]
[null,null,null,"Custo unitário total de material",{"$nulls":5},{"$f":"SUM(J684:J685)","v":0}]
[null,"D - ATIVIDADES AUXILIARES",null,"Quantidade","Unidade",null,"Custo Unitário","Custo Unitário"]
[null,"-",0,0,0,null,0,null,null,{"$f":"D688*G688","v":0}]
[null,"-",0,0,0,null,0,null,null,{"$f":"D689*G689","v":0}]
[null,null,null,"Custo total de atividades auxiliares",{"$nulls":5},{"$f":"SUM(J688:J689)","v":0}]
[{"$nulls":7},"Subtotal",null,{"$f":"J680+J686+J690+J681+J682","v":0.81769611780455154}]
[null,"E - TEMPO FIXO",null,"Código","Quantidade","Unidade",null,"Custo Unitário","Custo Unitário"]
[null,"-",0,"-",0,"t",null,0,null,{"$f":"ROUNDDOWN(E693*H693,4)","v":0}]
[null,"-",0,"-",0,"t",null,0,null,{"$f":"ROUNDDOWN(E694*H694,4)","v":0}]
[null,null,null,"Custo unitário total de tempo fixo",{"$nulls":5},{"$f":"SUM(J693:J694)","v":0}]
[null,"F - MOMENTO DE TRANSPORTE",null,"Quantidade","Unidade","DMT",null,null,null,"Custo Unitário"]
[{"$nulls":5},"LN","RP","P"]
[null,"-",0,0,"tkm"]
[null,"-",0,0,"tkm"]
[null,null,null,"Custo unitário total de transporte"]
[{"$nulls":5},"Custo unitário direto total",null,null,null,{"$f":"TRUNC(J691+J695,2)","v":0.81}]
[null,"Obs."]
[]
[{"$f":"A665+1","v":19},"1ª/GRD",{"$nulls":8},{"$f":"J740","v":1.79}]
[null,"OBRA:","PAVIMENTAÇÃO ASFÁLTICA EM CBUQ - VIAS URBANAS DIVERSAS (MATO VERDE / MG)"]
[null,"Custo Unitário de Referência",null,null,"Minas Gerais"]
[{"$nulls":4}," Abril/2025 ",null,null,"Produção da equipe ",149.4,{"$f":"VLOOKUP(A704,ORÇAMENTO!$A$10:$L$43,7,1)","v":"TXKM"}]
[null,5914622,"TRANSPORTE COM CAMINHÃO TANQUE DE TRANSPORTE DE MATERIAL ASFÁLTICO DE 30000 L, EM VIA URBANA PAVIMENTADA",{"$nulls":5},"Valores em reais (R$)"]
[null,"A - EQUIPAMENTOS",null,"Quantidade","Utilização",null,"Custo Horário",null,null,"Custo"]
[{"$nulls":4},"Operativa","Improdutiva","Produtivo","Improdutivo",null,"Horário Total"]
[null,"E9509","Caminhão tanque distribuidor de asfalto com capacidade de 6.000 l - 7 kW/136 kW",1,1,0,267.51929999999999,74.644499999999994,null,{"$f":"D711*(E711*G711+F711*H711)","v":267.51929999999999}]
[null,"-",0,null,null,null,0,0,null,{"$f":"D712*(E712*G712+F712*H712)","v":0}]
[{"$nulls":7},"Custo horário total de equipamentos",null,{"$f":"SUM(J711:J712)","v":267.51929999999999}]
[null,"B - MÃO DE OBRA",null,"Quantidade","Unidade",null,"Custo Horário","Custo Horário Total"]
[null,"-",0,0,0,null,0,null,null,{"$f":"D715*G715","v":0}]
[null,"-",0,0,0,null,0,null,null,{"$f":"D716*G716","v":0}]
[null,null,null,"Custo horário total de mão de obra",{"$nulls":5},{"$f":"SUM(J715:J716)","v":0}]
[null,null,null,"Custo horário total de execução",{"$nulls":5},{"$f":"J713+J717","v":267.51929999999999}]
[null,null,null,"Custo unitário de execução",{"$nulls":5},{"$f":"J718/I707","v":1.7906244979919677}]
[{"$nulls":7},"Custo do FIC",null,0]
[{"$nulls":7},"Custo do FIT",null,0]
[null,"C - MATERIAL",null,"Quantidade","Unidade",null,"Preço Unitário","Custo Unitário"]
[null,"-",0,996,0,null,0,null,null,{"$f":"D723*G723","v":0}]
[null,"-",0,89.28,0,null,0,null,null,{"$f":"D724*G724","v":0}]
[null,null,null,"Custo unitário total de material",{"$nulls":5},{"$f":"SUM(J723:J724)","v":0}]
[null,"D - ATIVIDADES AUXILIARES",null,"Quantidade","Unidade",null,"Custo Unitário","Custo Unitário"]
[null,"-",0,0,0,null,0,null,null,{"$f":"D727*G727","v":0}]
[null,"-",0,0,0,null,0,null,null,{"$f":"D728*G728","v":0}]
[null,null,null,"Custo total de atividades auxiliares",{"$nulls":5},{"$f":"SUM(J727:J728)","v":0}]
[{"$nulls":7},"Subtotal",null,{"$f":"J719+J725+J729+J720+J721","v":1.7906244979919677}]
[null,"E - TEMPO FIXO",null,"Código","Quantidade","Unidade",null,"Custo Unitário","Custo Unitário"]
[null,"-",0,"-",0,"t",null,0,null,{"$f":"ROUNDDOWN(E732*H732,4)","v":0}]
[null,"-",0,"-",0,"t",null,0,null,{"$f":"ROUNDDOWN(E733*H733,4)","v":0}]
[null,null,null,"Custo unitário total de tempo fixo",{"$nulls":5},{"$f":"SUM(J732:J733)","v":0}]
[null,"F - MOMENTO DE TRANSPORTE",null,"Quantidade","Unidade","DMT",null,null,null,"Custo Unitário"]
[{"$nulls":5},"LN","RP","P"]
[null,"-",0,0,"tkm"]
[null,"-",0,0,"tkm"]
[null,null,null,"Custo unitário total de transporte"]
[{"$nulls":5},"Custo unitário direto total",null,null,null,{"$f":"TRUNC(J730+J734,2)","v":1.79}]
[null,"Obs."]
[]
[{"$f":"A704+1","v":20},"1ª/GRD",{"$nulls":8},{"$f":"J779","v":57.96}]
[null,"OBRA:","PAVIMENTAÇÃO ASFÁLTICA EM CBUQ - VIAS URBANAS DIVERSAS (MATO VERDE / MG)"]
[null,"Custo Unitário de Referência",null,null,"Minas Gerais"]
[{"$nulls":4}," Abril/2025 ",null,null,"Produção da equipe ",4.3554006968641117,{"$f":"VLOOKUP(A743,ORÇAMENTO!$A$10:$L$43,7,1)","v":"M"}]
[null,94273,"ASSENTAMENTO DE GUIA (MEIO-FIO) PRÉ-MOLDADO DE CONCRETO - 100X15X13X30 CM (COMPRIMENTO X BASE INFERIOR X BASE SUPERIOR X ALTURA) - USO VIÁRIO",{"$nulls":5},"Valores em reais (R$)"]
[null,"A - EQUIPAMENTOS",null,"Quantidade","Utilização",null,"Custo Horário",null,null,"Custo"]
[{"$nulls":4},"Operativa","Improdutiva","Produtivo","Improdutivo",null,"Horário Total"]
[null,"-",0,null,null,null,0,0,null,{"$f":"D750*(E750*G750+F750*H750)","v":0}]
[null,"-",0,null,null,null,0,0,null,{"$f":"D751*(E751*G751+F751*H751)","v":0}]
[{"$nulls":7},"Custo horário total de equipamentos",null,{"$f":"SUM(J750:J751)","v":0}]
[null,"B - MÃO DE OBRA",null,"Quantidade","Unidade",null,"Custo Horário","Custo Horário Total"]
[null,"P9824","Servente",1,"h",null,21.435400000000001,null,null,{"$f":"D754*G754","v":21.435400000000001}]
[null,"P9821","Pedreiro",1,"h",null,27.132200000000001,null,null,{"$f":"D755*G755","v":27.132200000000001}]
[null,null,null,"Custo horário total de mão de obra",{"$nulls":5},{"$f":"SUM(J754:J755)","v":48.567599999999999}]
[null,null,null,"Custo horário total de execução",{"$nulls":5},{"$f":"J752+J756","v":48.567599999999999}]
[null,null,null,"Custo unitário de execução",{"$nulls":5},{"$f":"J757/I746","v":11.15112096}]
[{"$nulls":7},"Custo do FIC",null,0]
[{"$nulls":7},"Custo do FIT",null,0]
[null,"C - MATERIAL",null,"Quantidade","Unidade",null,"Preço Unitário","Custo Unitário"]
[null,"M0082","Areia média lavada",6.6E-3,"m³",null,107,null,null,{"$f":"D762*G762","v":0.70620000000000005}]
[null,4059,"Meio-fio ou guia de concreto, pré-moldado, comp.1,0m x 30 x 12/15 cm (H X L1/L2)",1.0049999999999999,"m",null,45,"COTAÇÃO",null,45.224999999999994]
[null,null,null,"Custo unitário total de material",{"$nulls":5},{"$f":"SUM(J762:J763)","v":45.931199999999997}]
[null,"D - ATIVIDADES AUXILIARES",null,"Quantidade","Unidade",null,"Custo Unitário","Custo Unitário"]
[null,1109669,"Argamassa de cimento e areia 1:3 - confecção em betoneira e lançamento manual - areia comercial",1.8E-3,"m³",null,488.89,null,null,{"$f":"D766*G766","v":0.88000199999999995}]
[null,"-",0,0,0,null,0,null,null,{"$f":"D767*G767","v":0}]
[null,null,null,"Custo total de atividades auxiliares",{"$nulls":5},{"$f":"SUM(J766:J767)","v":0.88000199999999995}]
[{"$nulls":7},"Subtotal",null,{"$f":"J758+J764+J768+J759+J760","v":57.962322959999995}]
[null,"E - TEMPO FIXO",null,"Código","Quantidade","Unidade",null,"Custo Unitário","Custo Unitário"]
[null,"-",0,"-",0,"t",null,0,null,{"$f":"ROUNDDOWN(E771*H771,4)","v":0}]
[null,"-",0,"-",0,"t",null,0,null,{"$f":"ROUNDDOWN(E772*H772,4)","v":0}]
[null,null,null,"Custo unitário total de tempo fixo",{"$nulls":5},{"$f":"SUM(J771:J772)","v":0}]
[null,"F - MOMENTO DE TRANSPORTE",null,"Quantidade","Unidade","DMT",null,null,null,"Custo Unitário"]
[{"$nulls":5},"LN","RP","P"]
[null,"-",0,0,"tkm","5914449","5914464","5914479"]
[null,"-",0,0,"tkm","5914449","5914464","5914479"]
[null,null,null,"Custo unitário total de transporte"]
[{"$nulls":5},"Custo unitário direto total",null,null,null,{"$f":"TRUNC(J769+J773,2)","v":57.96}]
[null,"Obs."]
[]
[23,"1ª/GRD",{"$nulls":8},{"$f":"J820","v":24.41}]
[null,"OBRA:","PAVIMENTAÇÃO ASFÁLTICA EM CBUQ - VIAS URBANAS DIVERSAS (MATO VERDE / MG)"]
[null,"Custo Unitário de Referência",null,null,"Minas Gerais"]
[{"$nulls":4}," Abril/2025 ",null,null,"Produção da equipe ",4.2992261392949267,{"$f":"VLOOKUP(A782,ORÇAMENTO!$A$10:$L$43,7,1)","v":"M"}]
[null,"94287a","EXECUÇÃO DE SARJETA EM CONCRETO USINADO, MOLDADO IN LOCO - 30CM DE BASE X 5CM DE ALTURA",{"$nulls":5},"Valores em reais (R$)"]
[null,"A - EQUIPAMENTOS",null,"Quantidade","Utilização",null,"Custo Horário",null,null,"Custo"]
[{"$nulls":4},"Operativa","Improdutiva","Produtivo","Improdutivo",null,"Horário Total"]
[null,"-",0,null,null,null,0,0,null,{"$f":"D789*(E789*G789+F789*H789)","v":0}]
[null,"-",0,null,null,null,0,0,null,{"$f":"D790*(E790*G790+F790*H790)","v":0}]
[{"$nulls":7},"Custo horário total de equipamentos",null,{"$f":"SUM(J789:J790)","v":0}]
[null,"B - MÃO DE OBRA",null,"Quantidade","Unidade",null,"Custo Horário","Custo Horário Total"]
[null,"P9821","Pedreiro",1,"h",null,27.132200000000001,null,null,{"$f":"D793*G793","v":27.132200000000001}]
[null,"P9824","Servente",1,"h",null,21.435400000000001,null,null,{"$f":"D794*G794","v":21.435400000000001}]
[null,null,null,"Custo horário total de mão de obra",{"$nulls":5},{"$f":"SUM(J793:J794)","v":48.567599999999999}]
[null,null,null,"Custo horário total de execução",{"$nulls":5},{"$f":"J791+J795","v":48.567599999999999}]
[null,null,null,"Custo unitário de execução",{"$nulls":5},{"$f":"J796/I785","v":11.296823760000001}]
[{"$nulls":7},"Custo do FIC",null,0]
[{"$nulls":7},"Custo do FIT",null,0]
[null,"C - MATERIAL",null,"Quantidade","Unidade",null,"Preço Unitário","Custo Unitário"]
[null,"M0082","Areia média lavada",9.9000000000000008E-3,"m³",null,107,null,null,{"$f":"D801*G801","v":1.0593000000000001}]
[null,"M0286","Tábua - E = 2,5 cm e L = 30 cm",8.3299999999999999E-2,"m",null,15.813599999999999,null,null,{"$f":"D802*G802","v":1.31727288}]
[null,"M0451","Concreto usinado - fck = 20 MPa (comercial)",1.8800000000000001E-2,"m³",null,550,"SINAPI-34492",null,10.34]
[null,"M1358","Sarrafo em madeira de terceira - E = 2,5 cm e L = 5 cm",0.2,"m",null,2.0291000000000001,null,null,0.40582000000000007]
[null,null,null,"Custo unitário total de material",{"$nulls":5},{"$f":"SUM(J801:J804)","v":13.122392880000001}]
[null,"D - ATIVIDADES AUXILIARES",null,"Quantidade","Unidade",null,"Custo Unitário","Custo Unitário"]
[null,"-",0,null,0,null,0,null,null,{"$f":"D807*G807","v":0}]
[null,"-",0,null,0,null,0,null,null,{"$f":"D808*G808","v":0}]
[null,null,null,"Custo total de atividades auxiliares",{"$nulls":5},{"$f":"SUM(J807:J808)","v":0}]
[{"$nulls":7},"Subtotal",null,{"$f":"J797+J805+J809+J798+J799","v":24.419216640000002}]
[null,"E - TEMPO FIXO",null,"Código","Quantidade","Unidade",null,"Custo Unitário","Custo Unitário"]
[null,"-",0,"-",0,"t",null,0,null,{"$f":"ROUNDDOWN(E812*H812,4)","v":0}]
[null,"-",0,"-",0,"t",null,0,null,{"$f":"ROUNDDOWN(E813*H813,4)","v":0}]
[null,null,null,"Custo unitário total de tempo fixo",{"$nulls":5},{"$f":"SUM(J812:J813)","v":0}]
[null,"F - MOMENTO DE TRANSPORTE",null,"Quantidade","Unidade","DMT",null,null,null,"Custo Unitário"]
[{"$nulls":5},"LN","RP","P"]
[null,"-",0,0,"tkm"]
[null,"-",0,0,"tkm"]
[null,null,null,"Custo unitário total de transporte"]
[{"$nulls":5},"Custo unitário direto total",null,null,null,{"$f":"TRUNC(J810+J814,2)","v":24.41}]
[null,"Obs."]
[]
[46,"1ª/GRD",{"$nulls":8},{"$f":"J859","v":271.87}]
[null,"OBRA:","PAVIMENTAÇÃO ASFÁLTICA EM CBUQ - VIAS URBANAS DIVERSAS (MATO VERDE / MG)"]
[null,"Custo Unitário de Referência",null,null,"Minas Gerais"]
[{"$nulls":4}," Abril/2025 ",null,null,"Produção da equipe ",3,{"$f":"VLOOKUP(A823,ORÇAMENTO!$A$10:$L$43,7,1)","v":"UN."}]
[null,5213440,"PLACA DE REGULAMENTAÇÃO EM AÇO, D=60CM - PELÍCULA RETRORREFLETIVA - FORNECIMENTO E INSTALAÇÃO, INCLUSIVE  SUPORTE",{"$nulls":5},"Valores em reais (R$)"]
[null,"A - EQUIPAMENTOS",null,"Quantidade","Utilização",null,"Custo Horário",null,null,"Custo"]
[{"$nulls":4},"Operativa","Improdutiva","Produtivo","Improdutivo",null,"Horário Total"]
[null,"E9687","Caminhão carroceria com capacidade de 5 t - 120 kW",1,0.3,0.7,154.82689999999999,59.719900000000003,null,{"$f":"D830*(E830*G830+F830*H830)","v":88.251999999999995}]
[null,"-",0,null,null,null,0,0,null,{"$f":"D831*(E831*G831+F831*H831)","v":0}]
[{"$nulls":7},"Custo horário total de equipamentos",null,{"$f":"SUM(J830:J831)","v":88.251999999999995}]
[null,"B - MÃO DE OBRA",null,"Quantidade","Unidade",null,"Custo Horário","Custo Horário Total"]
[null,"P9830","Montador",1,"h",null,38.260300000000001,null,null,{"$f":"D834*G834","v":38.260300000000001}]
[null,"P9824","Servente",2,"h",null,21.435400000000001,null,null,{"$f":"D835*G835","v":42.870800000000003}]
[null,null,null,"Custo horário total de mão de obra",{"$nulls":5},{"$f":"SUM(J834:J835)","v":81.131100000000004}]
[null,null,null,"Custo horário total de execução",{"$nulls":5},{"$f":"J832+J836","v":169.38310000000001}]
[null,null,null,"Custo unitário de execução",{"$nulls":5},{"$f":"J837/I826","v":56.46103333333334}]
[{"$nulls":7},"Custo do FIC",null,0]
[{"$nulls":7},"Custo do FIT",null,0]
[null,"C - MATERIAL",null,"Quantidade","Unidade",null,"Preço Unitário","Custo Unitário"]
[null,"-",0,null,0,null,0,null,null,{"$f":"D842*G842","v":0}]
[null,"-",0,null,0,null,0,null,null,{"$f":"D843*G843","v":0}]
[null,null,null,"Custo unitário total de material",{"$nulls":5},{"$f":"SUM(J842:J843)","v":0}]
[null,"D - ATIVIDADES AUXILIARES",null,"Quantidade","Unidade",null,"Custo Unitário","Custo Unitário"]
[null,5213414,"Placa em aço nº 16 galvanizado com película retrorrefletiva tipo I + SI - confecção",0.35993999999999998,"m²",null,598.48,null,null,{"$f":"D846*G846","v":215.41689120000001}]
[null,"-",0,null,0,null,0,null,null,{"$f":"D847*G847","v":0}]
[null,null,null,"Custo total de atividades auxiliares",{"$nulls":5},{"$f":"SUM(J846:J847)","v":215.41689120000001}]
[{"$nulls":7},"Subtotal",null,{"$f":"J838+J844+J848+J839+J840","v":271.87792453333333}]
[null,"E - TEMPO FIXO",null,"Código","Quantidade","Unidade",null,"Custo Unitário","Custo Unitário"]
[null,"-",0,"-",null,"t",null,0,null,{"$f":"ROUNDDOWN(E851*H851,4)","v":0}]
[null,"-",0,"-",null,"t",null,0,null,{"$f":"ROUNDDOWN(E852*H852,4)","v":0}]
[null,null,null,"Custo unitário total de tempo fixo",{"$nulls":5},{"$f":"SUM(J851:J852)","v":0}]
[null,"F - MOMENTO DE TRANSPORTE",null,"Quantidade","Unidade","DMT",null,null,null,"Custo Unitário"]
[{"$nulls":5},"LN","RP","P"]
[null,"-",0,null,"tkm"]
[null,"-",0,null,"tkm"]
[null,null,null,"Custo unitário total de transporte"]
[{"$nulls":5},"Custo unitário direto total",null,null,null,{"$f":"TRUNC(J849+J853,2)","v":271.87}]
[null,"Obs."]
[]
[49,"1ª/GRD",{"$nulls":8},{"$f":"J905","v":27.24}]
[null,"OBRA:","PAVIMENTAÇÃO ASFÁLTICA EM CBUQ - VIAS URBANAS DIVERSAS (MATO VERDE / MG)"]
[null,"Custo Unitário de Referência",null,null,"Minas Gerais"]
[{"$nulls":4}," Abril/2025 ",null,null,"Produção da equipe ",149.4,{"$f":"VLOOKUP(A862,ORÇAMENTO!$A$10:$L$43,7,1)","v":"M2"}]
[null,5213401,"PINTURA DE EIXO VIÁRIO SOBRE ASFALTO COM TINTA RETRORREFLETIVA A BASE DE RESINA ACRÍLICA COM MICROESFERAS DE VIDRO, APLICAÇÃO MECÂNICA COM DEMARCADORA AUTOPROPELIDA",{"$nulls":5},"Valores em reais (R$)"]
[null,"A - EQUIPAMENTOS",null,"Quantidade","Utilização",null,"Custo Horário",null,null,"Custo"]
[{"$nulls":4},"Operativa","Improdutiva","Produtivo","Improdutivo",null,"Horário Total"]
[null,"E9644","Caminhão demarcador de faixas com sistema de pintura a frio - 28 kW/129 kW",1,1,0,403.09390000000002,159.4639,null,{"$f":"D869*(E869*G869+F869*H869)","v":403.09390000000002}]
[null,"-",0,null,null,null,0,0,null,{"$f":"D870*(E870*G870+F870*H870)","v":0}]
[{"$nulls":7},"Custo horário total de equipamentos",null,{"$f":"SUM(J869:J870)","v":403.09390000000002}]
[null,"B - MÃO DE OBRA",null,"Quantidade","Unidade",null,"Custo Horário","Custo Horário Total"]
[null,"P9853","Pré-marcador",1,"h",null,23.213999999999999,null,null,{"$f":"D873*G873","v":23.213999999999999}]
[null,"P9824","Servente",4,"h",null,21.435400000000001,null,null,{"$f":"D874*G874","v":85.741600000000005}]
[null,null,null,"Custo horário total de mão de obra",{"$nulls":5},{"$f":"SUM(J873:J874)","v":108.9556}]
[null,null,null,"Custo horário total de execução",{"$nulls":5},{"$f":"J871+J875","v":512.04950000000008}]
[null,null,null,"Custo unitário de execução",{"$nulls":5},{"$f":"J876/I865","v":3.4273728246318611}]
[{"$nulls":7},"Custo do FIC",null,0]
[{"$nulls":7},"Custo do FIT",null,0]
[null,"C - MATERIAL",null,"Quantidade","Unidade",null,"Preço Unitário","Custo Unitário"]
[null,"M2037","Microesferas refletivas de vidro tipo I-B",0.12,"kg",null,8.7142999999999997,null,null,{"$f":"D881*G881","v":1.0457159999999999}]
[null,"M2038","Microesferas refletivas de vidro tipo II-A",0.35,"kg",null,8.8077000000000005,null,null,{"$f":"D882*G882","v":3.0826950000000002}]
[null,"M2034","Solvente para tinta à base de resina acrílica",0.03,"l",null,16.6828,null,null,0.50048400000000004]
[null,"M2044","Tinta à base de resina acrílica emulsionada em água para pré-marcação viária",9.7000000000000005E-4,"l",null,19.888300000000001,null,null,1.9291651000000003E-2]
[null,"M2027","Tinta à base de resina acrílica estirenada para demarcação viária",0.6,"l",null,31.8858,null,null,19.13148]
[null,null,null,"Custo unitário total de material",{"$nulls":5},{"$f":"SUM(J881:J885)","v":23.779666650999999}]
[null,"D - ATIVIDADES AUXILIARES",null,"Quantidade","Unidade",null,"Custo Unitário","Custo Unitário"]
[null,"-",0,null,0,null,0,null,null,{"$f":"D888*G888","v":0}]
[null,"-",0,null,0,null,0,null,null,{"$f":"D889*G889","v":0}]
[null,null,null,"Custo total de atividades auxiliares",{"$nulls":5},{"$f":"SUM(J888:J889)","v":0}]
[{"$nulls":7},"Subtotal",null,{"$f":"J877+J886+J890+J878+J879","v":27.207039475631859}]
[null,"E - TEMPO FIXO",null,"Código","Quantidade","Unidade",null,"Custo Unitário","Custo Unitário"]
[null,"M2037","Microesferas refletivas de vidro tipo I-B",5914655,1.2E-4,"t",null,32.39,null,{"$f":"ROUNDDOWN(E893*H893,4)","v":3.8E-3}]
[null,"M2038","Microesferas refletivas de vidro tipo II-A",5914655,3.5E-4,"t",null,32.39,null,{"$f":"ROUNDDOWN(E894*H894,4)","v":1.1299999999999999E-2}]
[null,"M2034","Solvente para tinta à base de resina acrílica",5914655,3.0000000000000001E-5,"t",null,32.39,null,8.9999999999999998E-4]
[null,"M2027","Tinta à base de resina acrílica estirenada para demarcação viária",5914655,8.3000000000000001E-4,"t",null,32.39,null,2.6800000000000001E-2]
[null,null,null,"Custo unitário total de tempo fixo",{"$nulls":5},{"$f":"SUM(J893:J896)","v":4.2800000000000005E-2}]
[null,"F - MOMENTO DE TRANSPORTE",null,"Quantidade","Unidade","DMT",null,null,null,"Custo Unitário"]
[{"$nulls":5},"LN","RP","P"]
[null,"M2037","Microesferas refletivas de vidro tipo I-B",1.2E-4,"tkm"]
[null,"M2038","Microesferas refletivas de vidro tipo II-A",3.5E-4,"tkm"]
[null,"M2034","Solvente para tinta à base de resina acrílica",3.0000000000000001E-5,"tkm"]
[null,"M2027","Tinta à base de resina acrílica estirenada para demarcação viária",8.3000000000000001E-4,"tkm"]
[null,null,null,"Custo unitário total de transporte"]
[{"$nulls":5},"Custo unitário direto total",null,null,null,{"$f":"TRUNC(J891+J897,2)","v":27.24}]
[null,"Obs."]
[]
[51,"1ª/GRD",{"$nulls":8},{"$f":"J951","v":40.78}]
[null,"OBRA:","PAVIMENTAÇÃO ASFÁLTICA EM CBUQ - VIAS URBANAS DIVERSAS (MATO VERDE / MG)"]
[null,"Custo Unitário de Referência",null,null,"Minas Gerais"]
[{"$nulls":4}," Abril/2025 ",null,null,"Produção da equipe ",30.18,{"$f":"VLOOKUP(A908,ORÇAMENTO!$A$10:$L$43,7,1)","v":"M2"}]
[null,5213405,"PINTURA DE FAIXA DE PEDESTRE OU ZEBRADA TINTA RETRORREFLETIVA A BASE DE RESINA ACRÍLICA COM MICROESFERAS DE VIDRO, APLICAÇÃO MANUAL",{"$nulls":5},"Valores em reais (R$)"]
[null,"A - EQUIPAMENTOS",null,"Quantidade","Utilização",null,"Custo Horário",null,null,"Custo"]
[{"$nulls":4},"Operativa","Improdutiva","Produtivo","Improdutivo",null,"Horário Total"]
[null,"E9644","Caminhão demarcador de faixas com sistema de pintura a frio - 28 kW/129 kW",1,1,0,403.09390000000002,159.4639,null,{"$f":"D915*(E915*G915+F915*H915)","v":403.09390000000002}]
[null,"-",0,null,null,null,0,0,null,{"$f":"D916*(E916*G916+F916*H916)","v":0}]
[{"$nulls":7},"Custo horário total de equipamentos",null,{"$f":"SUM(J915:J916)","v":403.09390000000002}]
[null,"B - MÃO DE OBRA",null,"Quantidade","Unidade",null,"Custo Horário","Custo Horário Total"]
[null,"P9853","Pré-marcador",1,"h",null,23.213999999999999,null,null,{"$f":"D919*G919","v":23.213999999999999}]
[null,"P9824","Servente",4,"h",null,21.435400000000001,null,null,{"$f":"D920*G920","v":85.741600000000005}]
[null,null,null,"Custo horário total de mão de obra",{"$nulls":5},{"$f":"SUM(J919:J920)","v":108.9556}]
[null,null,null,"Custo horário total de execução",{"$nulls":5},{"$f":"J917+J921","v":512.04950000000008}]
[null,null,null,"Custo unitário de execução",{"$nulls":5},{"$f":"J922/I911","v":16.966517561298875}]
[{"$nulls":7},"Custo do FIC",null,0]
[{"$nulls":7},"Custo do FIT",null,0]
[null,"C - MATERIAL",null,"Quantidade","Unidade",null,"Preço Unitário","Custo Unitário"]
[null,"M2037","Microesferas refletivas de vidro tipo I-B",0.12,"kg",null,8.7142999999999997,null,null,{"$f":"D927*G927","v":1.0457159999999999}]
[null,"M2038","Microesferas refletivas de vidro tipo II-A",0.35,"kg",null,8.8077000000000005,null,null,{"$f":"D928*G928","v":3.0826950000000002}]
[null,"M2034","Solvente para tinta à base de resina acrílica",0.03,"l",null,16.6828,null,null,0.50048400000000004]
[null,"M2044","Tinta à base de resina acrílica emulsionada em água para pré-marcação viária",9.7000000000000005E-4,"l",null,19.888300000000001,null,null,1.9291651000000003E-2]
[null,"M2027","Tinta à base de resina acrílica estirenada para demarcação viária",0.6,"l",null,31.8858,null,null,19.13148]
[null,null,null,"Custo unitário total de material",{"$nulls":5},{"$f":"SUM(J927:J931)","v":23.779666650999999}]
[null,"D - ATIVIDADES AUXILIARES",null,"Quantidade","Unidade",null,"Custo Unitário","Custo Unitário"]
[null,"-",0,null,0,null,0,null,null,{"$f":"D934*G934","v":0}]
[null,"-",0,null,0,null,0,null,null,{"$f":"D935*G935","v":0}]
[null,null,null,"Custo total de atividades auxiliares",{"$nulls":5},{"$f":"SUM(J934:J935)","v":0}]
[{"$nulls":7},"Subtotal",null,{"$f":"J923+J932+J936+J924+J925","v":40.746184212298871}]
[null,"E - TEMPO FIXO",null,"Código","Quantidade","Unidade",null,"Custo Unitário","Custo Unitário"]
[null,"M2037","Microesferas refletivas de vidro tipo I-B",5914655,1.2E-4,"t",null,32.39,null,{"$f":"ROUNDDOWN(E939*H939,4)","v":3.8E-3}]
[null,"M2038","Microesferas refletivas de vidro tipo II-A",5914655,3.5E-4,"t",null,32.39,null,{"$f":"ROUNDDOWN(E940*H940,4)","v":1.1299999999999999E-2}]
[null,"M2034","Solvente para tinta à base de resina acrílica",5914655,3.0000000000000001E-5,"t",null,32.39,null,8.9999999999999998E-4]
[null,"M2027","Tinta à base de resina acrílica estirenada para demarcação viária",5914655,8.3000000000000001E-4,"t",null,32.39,null,2.6800000000000001E-2]
[null,null,null,"Custo unitário total de tempo fixo",{"$nulls":5},{"$f":"SUM(J939:J942)","v":4.2800000000000005E-2}]
[null,"F - MOMENTO DE TRANSPORTE",null,"Quantidade","Unidade","DMT",null,null,null,"Custo Unitário"]
[{"$nulls":5},"LN","RP","P"]
[null,"M2037","Microesferas refletivas de vidro tipo I-B",1.2E-4,"tkm"]
[null,"M2038","Microesferas refletivas de vidro tipo II-A",3.5E-4,"tkm"]
[null,"M2034","Solvente para tinta à base de resina acrílica",3.0000000000000001E-5,"tkm"]
[null,"M2027","Tinta à base de resina acrílica estirenada para demarcação viária",8.3000000000000001E-4,"tkm"]
[null,null,null,"Custo unitário total de transporte"]
[{"$nulls":5},"Custo unitário direto total",null,null,null,{"$f":"TRUNC(J937+J943,2)","v":40.78}]
[null,"Obs."]

{"sheet":"CPU-FORNEC","index":2,"n_rows":92,"n_cols":14,"rows_kept":92,"cut":false,"hidden":false,"merged":[[81,1,81,7],[82,0,91,0],[82,1,82,3],[82,4,82,7],[83,2,83,5],[84,2,84,3],[85,1,85,7],[88,1,88,3],[88,5,88,6],[89,1,89,6],[90,1,90,6],[91,1,91,6],[60,0,69,0],[60,1,60,3],[60,4,60,7],[61,2,61,5],[62,2,62,3],[63,1,63,7],[66,1,66,3],[66,5,66,6],[67,1,67,6],[68,1,68,6],[69,1,69,6],[38,0,47,0],[38,1,38,3],[38,4,38,7],[39,2,39,5],[40,2,40,3],[41,1,41,7],[44,1,44,3],[44,5,44,6],[45,1,45,6],[46,1,46,6],[47,1,47,6],[22,5,22,6],[23,1,23,6],[24,1,24,6],[25,1,25,6],[5,1,5,7],[9,1,9,7],[13,1,13,7],[17,1,17,7],[0,10,0,11],[1,2,1,5],[1,10,1,11],[2,2,2,3],[3,1,3,7],[27,4,27,7],[28,2,28,5],[27,0,36,0],[29,2,29,3],[30,1,30,7],[33,1,33,3],[33,5,33,6],[34,1,34,6],[35,1,35,6],[36,1,36,6],[0,0,26,0],[0,1,0,3],[0,4,0,7],[22,1,22,3],[49,0,58,0],[49,1,49,3],[49,4,49,7],[50,2,50,5],[51,2,51,3],[52,1,52,7],[55,1,55,3],[55,5,55,6],[56,1,56,6],[57,1,57,6],[58,1,58,6],[27,1,27,3],[71,0,80,0],[71,1,71,3],[71,4,71,7],[72,2,72,5],[73,2,73,3],[74,1,74,7],[77,1,77,3],[77,5,77,6],[78,1,78,6],[79,1,79,6],[80,1,80,6]]}
[1,"CODEVASF",null,null," COMPOSIÇÃO DE PREÇO UNITÁRIO",null,null,null,{"$f":"H24","v":0},{"$f":"H26","v":0},"BDI CALCULADO:",null,{"$f":"ORÇAMENTO!L6","v":15}]
[null,"OBRA:  ","PAVIMENTAÇÃO ASFÁLTICA EM CBUQ - VIAS URBANAS DIVERSAS (MATO VERDE / MG)",null,null,null,"DATA: ",{"$f":"ORÇAMENTO!C6","v":" AGOSTO / 2025"},null,null,"BDI DIFERENCIADO:",null,{"$f":"'BDI FORN'!D31/100","v":0.15}]
[null,"SERVIÇO:  ","CPU.1",null,"Referência:","SICRO","UNIDADE: ",{"$f":"VLOOKUP(A1,ORÇAMENTO!A11:L31,5)","v":"MOBILIZAÇÃO E DESMOBILIZAÇÃO"}]
[]
[null,"TIPO ITEM","CODIGO ITEM","DESCRIÇÃO ITEM","UNIDADE ITEM","COEFICIENTE","PRECO UNITARIO","CUSTO TOTAL",null,"distancia =",90,"B.DESPACHO"]
[null,"EQUIPAMENTOS",{"$nulls":7},"Pá carregadeira ",null,null,10.1," ton"]
[null,null,"E9001","E9001","E9001",null,"E9001"]
[]
[]
[null,"MÃO DE OBRA"]
[]
[]
[]
[null,"MATERIAIS"]
[]
[]
[{"$nulls":7},{"$f":"ROUNDDOWN(F17*G17,2)","v":0},null,"Motoniveladora ",null,null,12.47," ton"]
[null,"ATIVIDADES AUXILIARES",{"$nulls":7},"Trator de pneus",null,null,2.8," ton"]
[{"$nulls":7},{"$f":"ROUNDDOWN(F19*G19,2)","v":0}]
[{"$nulls":7},0]
[{"$nulls":7},0]
[{"$nulls":7},{"$f":"ROUNDDOWN(F22*G22,2)","v":0},null,"Rolo Compactador ",null,null,15.33," ton"]
[null,"PRODUÇÃO DA EQUIPE",null,null,1,"CUSTO ",null,{"$f":"SUM(H6:H22)","v":0},null,"Grade de disco",null,null,1," ton"]
[null,"TOTAL",{"$nulls":5},{"$f":"H23/E23","v":0},"OK","RETROESCAVADEIRA",null,null,6.67," ton"]
[null,"BDI                %",{"$nulls":5},{"$f":"1+$M$1","v":16}]
[null,"TOTAL DO SERVIÇO - R$",{"$nulls":5},{"$f":"ROUND(H24*H25,2)","v":0}]
[]
["F1","CODEVASF",null,null," COMPOSIÇÃO DE PREÇO UNITÁRIO",null,null,null,{"$f":"H35","v":2723.1},{"$f":"H37","v":3131.57}]
[null,"OBRA:  ","PAVIMENTAÇÃO ASFÁLTICA EM CBUQ - VIAS URBANAS DIVERSAS (MATO VERDE / MG)",null,null,null,"DATA: ",{"$f":"$H$2","v":" AGOSTO / 2025"}]
[null,"SERVIÇO:  ","AQUISIÇÃO DE EMULSÃO ASFÁLTICA PARA IMPRIMAÇÃO (EAI) - EXCLUSIVE TRANSPORTE",null,"SEINFRA","CPU.7","UNIDADE: ",{"$f":"VLOOKUP(A28,ORÇAMENTO!$A$11:$L$50,7)","v":"T"}]
[]
[null,"TIPO ITEM","CODIGO ITEM","DESCRIÇÃO ITEM","UNIDADE ITEM","COEFICIENTE","PRECO UNITARIO","CUSTO TOTAL"]
[null,"INSUMO","ANP","EMULSÃO ASFÁLTICA PARA SERVIÇO DE IMPRIMAÇÃO (MEMÓRIA EM ANEXO)","T",1,2723.1013152761834,{"$f":"ROUNDDOWN(F33*G33,2)","v":2723.1}]
[null,"PRODUÇÃO DA EQUIPE",null,null,1,"CUSTO ",null,{"$f":"SUM(H33:H33)","v":2723.1}]
[null,"TOTAL",{"$nulls":5},{"$f":"H34/E34","v":2723.1}]
[null,"BDI                %",{"$nulls":5},{"$f":"1+$M$2","v":1.1499999999999999}]
[null,"TOTAL DO SERVIÇO - R$",{"$nulls":5},{"$f":"ROUND(H35*H36,2)","v":3131.57},"OK"]
[]
["F2","CODEVASF",null,null," COMPOSIÇÃO DE PREÇO UNITÁRIO",null,null,null,{"$f":"H46","v":527.96},{"$f":"H48","v":607.15}]
[null,"OBRA:  ","PAVIMENTAÇÃO ASFÁLTICA EM CBUQ - VIAS URBANAS DIVERSAS (MATO VERDE / MG)",null,null,null,"DATA: ",{"$f":"$H$2","v":" AGOSTO / 2025"}]
[null,"SERVIÇO:  ","TRANSPORTE DE EMULSÃO ASFÁLTICA PARA IMPRIMAÇÃO (EAI)",null,"SEINFRA","CPU.8","UNIDADE: ",{"$f":"VLOOKUP(A39,ORÇAMENTO!$A$11:$L$50,7)","v":"T"}]
[]
[null,"TIPO ITEM","CODIGO ITEM","DESCRIÇÃO ITEM","UNIDADE ITEM","COEFICIENTE","PRECO UNITARIO","CUSTO TOTAL"]
[null,"INSUMO"," - ","TRANSPORTE DE EMULSÃO ASFÁLTICA PARA IMPRIMAÇÃO (EAI), INCLUINDO CUSTO TOTAL DO TRANSPORTE (COMBUSTÍVEL, PEDÁGIOS, ETC.) E ICMS - MEMÓRIA ANEXA","T",1,527.9671428571429,{"$f":"ROUNDDOWN(F44*G44,2)","v":527.96}]
[null,"PRODUÇÃO DA EQUIPE",null,null,1,"CUSTO ",null,{"$f":"SUM(H44:H44)","v":527.96}]
[null,"TOTAL",{"$nulls":5},{"$f":"H45/E45","v":527.96}]
[null,"BDI                %",{"$nulls":5},{"$f":"1+$M$2","v":1.1499999999999999}]
[null,"TOTAL DO SERVIÇO - R$",{"$nulls":5},{"$f":"ROUND(H46*H47,2)","v":607.15},"OK"]
[]
["F3","CODEVASF",null,null," COMPOSIÇÃO DE PREÇO UNITÁRIO",null,null,null,{"$f":"H57","v":3456.95},{"$f":"H59","v":3975.49}]
[null,"OBRA:  ","PAVIMENTAÇÃO ASFÁLTICA EM CBUQ - VIAS URBANAS DIVERSAS (MATO VERDE / MG)",null,null,null,"DATA: ",{"$f":"$H$2","v":" AGOSTO / 2025"}]
[null,"SERVIÇO:  ","AQUISIÇÃO DE EMULSAO ASFALTICA CATIONICA RR-1C - EXCLUSIVE TRANSPORTE",null,"SINAPI","CPU.9","UNIDADE: ",{"$f":"VLOOKUP(A50,ORÇAMENTO!$A$11:$L$50,7)","v":"T"}]
[]
[null,"TIPO ITEM","CODIGO ITEM","DESCRIÇÃO ITEM","UNIDADE ITEM","COEFICIENTE","PRECO UNITARIO","CUSTO TOTAL"]
[null,"INSUMO","ANP","EMULSÃO ASFÁLTICA CATIÔNICA RR-1C(MEMÓRIA EM ANEXO)","T",1,3456.9562255014889,{"$f":"ROUNDDOWN(F55*G55,2)","v":3456.95}]
[null,"PRODUÇÃO DA EQUIPE",null,null,1,"CUSTO ",null,{"$f":"SUM(H55:H55)","v":3456.95}]
[null,"TOTAL",{"$nulls":5},{"$f":"H56/E56","v":3456.95},"OK"]
[null,"BDI                %",{"$nulls":5},{"$f":"1+$M$2","v":1.1499999999999999}]
[null,"TOTAL DO SERVIÇO - R$",{"$nulls":5},{"$f":"ROUND(H57*H58,2)","v":3975.49}]
[]
["F4","CODEVASF",null,null," COMPOSIÇÃO DE PREÇO UNITÁRIO",null,null,null,{"$f":"H68","v":590.29},{"$f":"H70","v":678.83}]
[null,"OBRA:  ","PAVIMENTAÇÃO ASFÁLTICA EM CBUQ - VIAS URBANAS DIVERSAS (MATO VERDE / MG)",null,null,null,"DATA: ",{"$f":"$H$2","v":" AGOSTO / 2025"}]
[null,"SERVIÇO:  ","TRANSPORTE DE EMULSÃO ASFÁLTICA CATIONICA RR-1C",null,"SINAPI","CPU.10","UNIDADE: ",{"$f":"VLOOKUP(A61,ORÇAMENTO!$A$11:$L$50,7)","v":"T"}]
[]
[null,"TIPO ITEM","CODIGO ITEM","DESCRIÇÃO ITEM","UNIDADE ITEM","COEFICIENTE","PRECO UNITARIO","CUSTO TOTAL"]
[null,"INSUMO"," - ","TRANSPORTE DE EMULSÃO ASFÁLTICA CATIONICA TIPO RR-1C, INCLUINDO CUSTO TOTAL DO TRANSPORTE (COMBUSTÍVEL, PEDÁGIOS, ETC.) E ICMS - MEMÓRIA ANEXA","T",1,590.29,{"$f":"ROUNDDOWN(F66*G66,2)","v":590.29}]
[null,"PRODUÇÃO DA EQUIPE",null,null,1,"CUSTO ",null,{"$f":"SUM(H66:H66)","v":590.29}]
[null,"TOTAL",{"$nulls":5},{"$f":"H67/E67","v":590.29},"OK"]
[null,"BDI                %",{"$nulls":5},{"$f":"1+$M$2","v":1.1499999999999999}]
[null,"TOTAL DO SERVIÇO - R$",{"$nulls":5},{"$f":"ROUND(H68*H69,2)","v":678.83}]
[]
["F5","CODEVASF",null,null," COMPOSIÇÃO DE PREÇO UNITÁRIO",null,null,null,{"$f":"H79","v":4496.7700000000004},{"$f":"H81","v":5171.29}]
[null,"OBRA:  ","PAVIMENTAÇÃO ASFÁLTICA EM CBUQ - VIAS URBANAS DIVERSAS (MATO VERDE / MG)",null,null,null,"DATA: ",{"$f":"$H$2","v":" AGOSTO / 2025"}]
[null,"SERVIÇO:  ","AQUISIÇÃO DE CONCRETO ASFÁLTICO DE PETRÓLEO - CAP 50/70 - EXCLUSIVE TRANSPORTE",null,"SINAPI","CPU.11","UNIDADE: ",{"$f":"VLOOKUP(A72,ORÇAMENTO!$A$11:$L$50,7)","v":"T"}]
[]
[null,"TIPO ITEM","CODIGO ITEM","DESCRIÇÃO ITEM","UNIDADE ITEM","COEFICIENTE","PRECO UNITARIO","CUSTO TOTAL"]
[null,"INSUMO",1518,"CIMENTOS ASFÁLTICO DE PETRÓLEO TIPO CAP 50/70 (MEMÓRIA EM ANEXO)","T",1,4496.7700022636054,{"$f":"ROUNDDOWN(F77*G77,2)","v":4496.7700000000004}]
[null,"PRODUÇÃO DA EQUIPE",null,null,1,"CUSTO ",null,{"$f":"SUM(H77:H77)","v":4496.7700000000004}]
[null,"TOTAL",{"$nulls":5},{"$f":"H78/E78","v":4496.7700000000004}]
[null,"BDI                %",{"$nulls":5},{"$f":"1+$M$2","v":1.1499999999999999}]
[null,"TOTAL DO SERVIÇO - R$",{"$nulls":5},{"$f":"ROUND(H79*H80,2)","v":5171.29}]
[]
["F6","CODEVASF",null,null," COMPOSIÇÃO DE PREÇO UNITÁRIO",null,null,null,{"$f":"H90","v":838.06},{"$f":"H92","v":963.77}]
[null,"OBRA:  ","PAVIMENTAÇÃO ASFÁLTICA EM CBUQ - VIAS URBANAS DIVERSAS (MATO VERDE / MG)",null,null,null,"DATA: ",{"$f":"$H$2","v":" AGOSTO / 2025"}]
[null,"SERVIÇO:  ","TRANSPORTE DE CONCRETO ASFÁLTICO DE PETRÓLEO - CAP 50/70",null,"SINAPI","CPU.12","UNIDADE: ",{"$f":"VLOOKUP(A83,ORÇAMENTO!$A$11:$L$50,7)","v":"T"}]
[]
[null,"TIPO ITEM","CODIGO ITEM","DESCRIÇÃO ITEM","UNIDADE ITEM","COEFICIENTE","PRECO UNITARIO","CUSTO TOTAL"]
[null,"INSUMO"," - ","TRANSPORTE DE CIMENTO ASFÁLTICO DE PETRÓLEO TIPO CAP 50-70, INCLUINDO CUSTO TOTAL DO TRANSPORTE (COMBUSTÍVEL, PEDÁGIOS, ETC.) E ICMS - MEMÓRIA ANEXA","T",1,838.06200000000001,{"$f":"ROUNDDOWN(F88*G88,2)","v":838.06}]
[null,"PRODUÇÃO DA EQUIPE",null,null,1,"CUSTO ",null,{"$f":"SUM(H88:H88)","v":838.06}]
[null,"TOTAL",{"$nulls":5},{"$f":"H89/E89","v":838.06}]
[null,"BDI                %",{"$nulls":5},{"$f":"1+$M$2","v":1.1499999999999999}]
[null,"TOTAL DO SERVIÇO - R$",{"$nulls":5},{"$f":"ROUND(H90*H91,2)","v":963.77}]

{"sheet":"AUX-VEIC.","index":3,"n_rows":31,"n_cols":5,"rows_kept":31,"cut":false,"hidden":false,"merged":[[26,2,26,3],[27,2,27,3],[28,2,28,3],[29,1,30,1],[29,2,29,3],[30,2,30,3],[25,2,25,3],[1,1,1,4],[2,1,2,2],[3,1,3,4],[17,1,17,4],[18,2,18,3],[19,2,19,3],[20,2,20,3],[21,2,21,3],[22,2,22,3],[23,2,23,3],[24,2,24,3]]}
[]
[null,"CÁLCULO DO CUSTO POR MÊS DE VEÍCULOS"]
[null,"Veículo: Polo TSI, Onix Turbo, Argo 1.3, HB-20 Turbo",null,"Data:","2025-07-28"]
[null,"DADOS ELEMENTARES DO VEÍCULO"]
[null,"Dados Básicos","Preço (R$)","Quantidade","Vida Útil"]
[null,"Quilometragem média mensal",null,3000]
[null,"Valor de Aquisição (VA)",103900]
[null,"Taxa de Juros (i)%",null,14.75]
[null,"IPVA e Seguro Obrigatório (4%)",4156]
[null,"Lavagem",50,2]
[null,"Pneus",479.9,4,50000]
[null,"Combustível",6.01,14]
[null,"Óleo Lubrificante + Filtros (revisão)",846.74400000000003,1,10000]
[null,"Seguro Total Anual",3378.94]
[null,"Jogo de Amortecedores",1287,null,50000]
[null,"Coeficiente de Manutenção",null,4.7999999999999998E-6]
[null,"Motorista",3038.2740182832176,1]
[null,"CÁLCULO DO CUSTO POR MÊS"]
[null,"DEPRECIAÇÃO","D = (VA-0,60xVA) / 12 x 5",null,692.66666666666663]
[null,"JUROS","J = (VA-0,60xVA) x i / 12",null,510.84]
[null,"LICENCIAMENTO","L = (IPVA=SEG.OBRIG.)/12",null,346.33]
[null,"SEGURO TOTAL","ST = SEGURO ANUAL/12",null,281.58]
[null,"COMBUSTÍVEL","OD = (Comb./Consu)x Km.mês",null,1287.8599999999999]
[null,"ÓLEO LUBRIFICANTE","OL = ((Ol. X Quant)/Vida Útil)xKm.mês)",null,254.02]
[null,"LAVAGEM","LL = Preço Lavagem x Quantidade",null,100]
[null,"PNEUS","P = ((P. PneusxQuant)/Vida Útil)xkm.mês)",null,115.18]
[null,"AMORTECEDORES","AM = (P. Amort/Vida Útil)xkm.mês",null,77.22]
[null,"MANUTENÇÃO","M = (VA-VPxK)xkm.mês",null,598.46]
[null,"MOTORISTA","MOT = SALÁRIO+LEIS SOCIAIS",null,5276.87]
[null,"CUSTO POR MÊS","SEM MOTORISTA",null,4264.1566666666658]
[null,null,"COM MOTORISTA",null,9541.0266666666648]

{"sheet":"BDI SERV","index":4,"n_rows":60,"n_cols":5,"rows_kept":60,"cut":false,"hidden":false,"merged":[[35,0,35,5],[36,0,36,5],[38,1,38,4],[39,2,39,3],[0,1,2,4],[25,1,25,3],[26,1,26,2],[26,3,26,4],[27,3,27,4]]}
[null,"DETALHAMENTO DO BDI - SERVIÇOS"]
[]
[]
[null,"Item","Descrição dos Serviços","% - PV","% - CD"]
[]
[null,1,"ADMINISTRAÇÃO CENTRAL"," ",{"$f":"SUM(E7:E9)","v":4.01}]
[null,"1.1","ESCRITÓRIO CENTRAL",null,4.01]
[null,"1.2","VIAGENS"]
[null,"1.3","OUTROS"]
[null," "," "," "," "]
[null,2,"IMPOSTOS E TAXAS",{"$f":"SUM(D12:D15)","v":5.75},{"$f":"SUM(E12:E15)","v":0}]
[null,"2.1","ISS - Proposta",{"$f":"D34*100","v":2.1}]
[null,"2.2","PIS",0.65]
[null,"2.3","Cofins",3]
[null,"2.4","Contribuição Previdenciaria (CPRB)"]
[]
[null,3,"TAXA DE RISCO",null,{"$f":"SUM(E18:E20)","v":0.96}]
[null,"3.1","SEGURO",null,0.2]
[null,"3.2","RISCO",null,0.56000000000000005]
[null,"3.3","GARANTIA",null,0.2]
[]
[null,4,"DESPESAS FINANCEIRAS",null,1.1100000000000001]
[]
[null,5,"LUCRO",null,8]
[]
[null,"BDI APRESENTADO:",null,null,{"$f":"IF($D$41=$C$43,$D$43,IF($D$41=$C$44,$D$44,IF($D$41=$C$44,$D$44,IF($D$41=$C$45,$D$45,0))))","v":21.62}]
[]
[null,null,"Legislação Municipal:"," Lei Complementar nº 003/2005"]
[null,null,"Município:","Mato Verde"]
[null,null,"Alíquota ISSQN:",0.03,"Município"]
[null,null,"Base de Cálculo:","Dedução - Material","Art.106 - § 2º"]
[null,null,"Valor Serviço:",1717415.62]
[null,null,"Dedução - Material (estimado):",{"$f":"0.3*D32","v":515224.68599999999},{"$f":"D33/D32","v":0.3}]
[null,null,"ISSQN BDI:",{"$f":"IF(D32=\"\",0,ROUND(IF(D31=D49,((1-(D33/D32))*D30),D30*D31),4))","v":2.1000000000000001E-2},"(*)"]
[]
["Acórdão nº 2.622/2013 - TCU Plenário"]
["BDI = ARRED((((((1+(AC+TR)/100)*(1+DF/100)*(1+L/100))/(1-IMP/100))-1)*100);2)"]
[]
[null,"(*) É obrigação da licitante a verificação da Legislação Tributária vigente no município, bem como o cálculo dos valores totais de serviços e materiais estimados, para apresentação de sua proposta."]
[]
[null,null,"Forma de Cálculo do BDI:","BDI - Acórdão nº 2.622/2013 - TCU"]
[]
[null,null,"BDI - Digitado",{"$f":"ROUND(E6+E11+E17+E22+E24,2)","v":14.08}]
[null,null,"BDI - Calculado",{"$f":"ROUND((((1+(E6/100+E22/100+E17/100))/(1-(D11/100+E24/100)))-1)*100,2)","v":22.99}]
[null,null,"BDI - Acórdão nº 2.622/2013 - TCU",{"$f":"ROUND((((((1+(E6+E17)/100)*(1+E22/100)*(1+E24/100))/(1-D11/100))-1)*100),2)","v":21.62}]
[]
[]
[]
[null,null,null,"Dedução - Material","Município"]
[null,null,null,0.1,"Simples Nacional"]
[null,null,null,0.2,"Municípios Indefinidos"]
[null,null,null,0.3]
[null,null,null,0.4]
[null,null,null,0.5]
[null,null,null,0.6]
[null,null,null,0.7]
[null,null,null,0.8]
[null,null,null,0.9]
[null,null,null,1]
[null,null,null,{"$f":"E31","v":"Art.106 - § 2º"}]

{"sheet":"BDI FORN","index":5,"n_rows":37,"n_cols":5,"rows_kept":37,"cut":false,"hidden":false,"merged":[[31,1,31,2],[32,0,34,5],[36,0,36,5],[0,1,2,4],[3,1,4,1],[3,2,4,2],[28,0,28,5],[30,1,30,2]]}
[null,"DETALHAMENTO DO BDI - FORNECIMENTO \n(MATERIAL ASFÁLTICO)"]
[]
[]
[null,"Item","Descrição dos Serviços","%","%"]
[null,null,null,"PV","CD"]
[]
[null,1,"ADMINISTRAÇÃO CENTRAL"," ",3.45]
[null,"1.1","ESCRITÓRIO CENTRAL"," "," "]
[null,"1.2","VIAGENS"," "," "]
[null,"1.3","OUTROS"," "," "]
[null," "," "," "," "]
[null,2,"IMPOSTOS E TAXAS",{"$f":"SUM(D13:D16)","v":3.65},{"$f":"SUM(E13:E16)","v":4.5600000000000005}]
[null,"2.1","ISS (*)",null,{"$f":"ROUND(D13*1.2515,2)","v":0}]
[null,"2.2","PIS",0.65,{"$f":"ROUND(D14*1.2515,2)","v":0.81}]
[null,"2.3","Cofins",3,{"$f":"ROUND(D15*1.2515,2)","v":3.75}]
[null,"2.4","CONTRIBUIÇÃO PREVIDENCIÁRIA SOBRE A RENDA BRUTA",0,{"$f":"ROUND(D16*1.2515,2)","v":0}]
[]
[null,3,"TAXA DE RISCO"," ",{"$f":"SUM(E19:E22)","v":1.08}]
[null,"3.1","SEGURO",null,0.24]
[null,"3.2","RISCO",null,0.6]
[null,"3.3","GARANTIA",null,0.24]
[]
[null,4,"DESPESAS FINANCEIRAS"," ",0.85]
[]
[null,5,"LUCRO",null,5.1100000000000003]
[]
[null," ","BDI - CALCULADO"," ",{"$f":"ROUND((((1+(E7+E18)/100)*(1+E23/100)*(1+E25/100)/(1-D12/100)-1)*100),2)","v":15}]
[]
["BDI = ((1+((AC+S+R+G)/100))x(1+DF/100)x(1+L/100)/(1-I/100)-1)*100"]
[]
[null,"BDI (CALCULADO):",null,{"$f":"ROUND((((1+((E7+E18)/100))*(1+E23/100)*(1+E25/100))/(1-D12/100)-1)*100,2)","v":15},"%"]
[null," "]
[]
[]
[]
[]
["BDI EM CONFORMIDADE COM OS ACÓRDÃOS Nº 2369/2011 e ACÓRDÃO Nº 2.622/2013 - TCU - PLENÁRIO"]

{"sheet":"CRONOGRAMA","index":6,"n_rows":19,"n_cols":14,"rows_kept":19,"cut":false,"hidden":false,"merged":[[0,1,0,13],[1,1,2,1],[1,2,2,4],[1,6,1,13],[2,6,2,13],[9,0,10,0],[9,1,10,1],[9,2,10,2],[3,1,3,12],[5,0,6,0],[5,1,6,1],[5,2,6,2],[7,0,8,0],[7,1,8,1],[7,2,8,2],[15,1,16,2],[18,1,22,13],[11,0,12,0],[11,1,12,1],[11,2,12,2],[13,0,14,0],[13,1,14,1],[13,2,14,2]]}
[null,"CRONOGRAMA FÍSICO-FINANCEIRO"]
[null,"OBRA: ",{"$f":"ORÇAMENTO!C5","v":"PAVIMENTAÇÃO ASFÁLTICA EM CBUQ - VIAS URBANAS DIVERSAS (MATO VERDE / MG)"},null,null,"VALOR:",{"$f":"ORÇAMENTO!L43","v":2999960.9899999998}]
[{"$nulls":5},"PRAZO: ","240 DIAS "]
[]
[null,"ITEM","ETAPAS/DESCRIÇAO","FISICO/  FINANCEIRO","TOTAL    ETAPAS","MÊS 1","MÊS 2","MÊS 3","MÊS 4","MÊS 5","MÊS 6","MÊS 7","MÊS 8","TOTAL"]
["A",{"$f":"VLOOKUP(A6,ORÇAMENTO!$A$10:$L$43,2)","v":1},{"$f":"VLOOKUP(A6,ORÇAMENTO!$A$10:$L$43,5)","v":"SERVIÇOS PRELIMINARES "},"FISICO ",{"$f":"ROUND(E7/$G$2,4)","v":0.1178},0.4,0.1,0.1,0.1,0.1,0.1,0.05,0.05,{"$f":"SUM(F6:M6)","v":1}]
[null,null,null,"FINANCEIRO",{"$f":"ORÇAMENTO!L10","v":353439.22},{"$f":"ROUND($E$7*F6,2)","v":141375.69},{"$f":"ROUND($E$7*G6,2)","v":35343.919999999998},{"$f":"ROUND($E$7*H6,2)","v":35343.919999999998},{"$f":"ROUND($E$7*I6,2)","v":35343.919999999998},35343.919999999998,{"$f":"ROUND($E$7*K6,2)","v":35343.919999999998},17671.96,17671.96,{"$f":"SUM(F7:M7)","v":353439.20999999996}]
["B",{"$f":"VLOOKUP(A8,ORÇAMENTO!$A$10:$L$43,2)","v":2},{"$f":"VLOOKUP(A8,ORÇAMENTO!$A$10:$L$43,5)","v":"TERRAPLANAGEM E PAVIMENTAÇÃO"},"FISICO ",{"$f":"ROUND(E9/$G$2,4)","v":0.21099999999999999},0.15,0.15,0.15,0.15,0.15,0.15,0.1,0,{"$f":"SUM(F8:M8)","v":1}]
[null,null,null,"FINANCEIRO",{"$f":"ORÇAMENTO!L17","v":632944},{"$f":"ROUND($E$9*F8,2)","v":94941.6},{"$f":"ROUND($E$9*G8,2)","v":94941.6},{"$f":"ROUND($E$9*H8,2)","v":94941.6},{"$f":"ROUND($E$9*I8,2)","v":94941.6},94941.6,{"$f":"ROUND($E$9*K8,2)","v":94941.6},63294.400000000001,0,{"$f":"SUM(F9:M9)","v":632944}]
["C",{"$f":"VLOOKUP(A10,ORÇAMENTO!$A$10:$L$43,2)","v":3},{"$f":"VLOOKUP(A10,ORÇAMENTO!$A$10:$L$43,5)","v":"TRANSPORTE DE MATERIAIS"},"FISICO ",{"$f":"ROUND(E11/$G$2,4)","v":0.1056},0.15,0.15,0.15,0.15,0.15,0.15,0.1,0,{"$f":"SUM(F10:M10)","v":1}]
[null,null,null,"FINANCEIRO",{"$f":"ORÇAMENTO!L24","v":316714},{"$f":"ROUND($E$11*F10,2)","v":47507.1},{"$f":"ROUND($E$11*G10,2)","v":47507.1},{"$f":"ROUND($E$11*H10,2)","v":47507.1},{"$f":"ROUND($E$11*I10,2)","v":47507.1},47507.1,{"$f":"ROUND($E$11*K10,2)","v":47507.1},31671.4,0,{"$f":"SUM(F11:M11)-0.04","v":316713.96000000002}]
["E",{"$f":"VLOOKUP(A12,ORÇAMENTO!$A$10:$L$43,2)","v":4},{"$f":"VLOOKUP(A12,ORÇAMENTO!$A$10:$L$43,5)","v":"DRENAGEM E OBRAS COMPLEMENTARES"},"FISICO ",{"$f":"ROUND(E13/$G$2,4)","v":0.2611},null,0.15,0.15,0.15,0.15,0.15,0.15,0.1,{"$f":"SUM(F12:M12)","v":1}]
[null,null,null,"FINANCEIRO",{"$f":"ORÇAMENTO!L30","v":783411},{"$f":"ROUND($E$13*F12,2)","v":0},{"$f":"ROUND($E$13*G12,2)","v":117511.65},{"$f":"ROUND($E$13*H12,2)","v":117511.65},{"$f":"ROUND($E$13*I12,2)","v":117511.65},117511.65,{"$f":"ROUND($E$13*K12,2)","v":117511.65},117511.65,78341.100000000006,{"$f":"SUM(F13:M13)-0.02","v":783410.98}]
["F",{"$f":"VLOOKUP(A14,ORÇAMENTO!$A$10:$L$43,2)","v":5},{"$f":"VLOOKUP(A14,ORÇAMENTO!$A$10:$L$43,5)","v":"FORNECIMENTOS - MATERIAL ASFÁLTICO (BDI DIFERENCIADO)"},"FISICO ",{"$f":"ROUND(E15/$G$2,4)","v":0.30449999999999999},0.15,0.15,0.15,0.15,0.15,0.15,0.1,0,{"$f":"SUM(F14:M14)","v":1}]
[null,null,null,"FINANCEIRO",{"$f":"ORÇAMENTO!L36","v":913452.76},{"$f":"ROUND($E$15*F14,2)","v":137017.91},137017.91,137017.91,137017.91,137017.91,{"$f":"ROUND($E$15*K14,2)","v":137017.91},91345.279999999999,0,{"$f":"SUM(F15:M15)-0.02","v":913452.72000000009}]
[null,"TOTAL",null,"FISICO ",{"$f":"SUM(F16:M16)","v":0.99999998999987016},{"$f":"F17/$E$17","v":0.14028259127557055},{"$f":"G17/$E$17","v":0.14410926771454211},{"$f":"H17/$E$17","v":0.14410926771454211},{"$f":"I17/$E$17","v":0.14410926771454211},0.14410926771454211,0.14410926771454211,0.10716629054288566,3.2004769608703375E-2,{"$f":"SUM(F16:M16)","v":0.99999998999987016}]
[null,null,null,"FINANCEIRO",{"$f":"E11+E9+E7+E15+E13","v":2999960.98},{"$f":"F11+F9+F7+F15+F13","v":420842.30000000005},{"$f":"G11+G9+G7+G15+G13","v":432322.18000000005},432322.18000000005,432322.18000000005,432322.18000000005,{"$f":"K11+K9+K7+K15+K13","v":432322.18000000005},321494.69,96013.06,{"$f":"SUM(F17:M17)-0.06","v":2999960.8900000006}]
[]
[null,"OBSERVAÇÕES:"]

{"sheet":"EAI","index":7,"n_rows":90,"n_cols":34,"rows_kept":90,"cut":false,"hidden":false,"merged":[[12,3,24,3],[1,2,3,26],[5,2,7,2],[5,12,7,12],[6,6,7,6],[6,19,6,20],[10,4,10,8],[10,9,10,10],[10,22,10,23],[5,6,5,7],[5,8,5,9],[6,21,6,24],[7,21,7,24]]}
[]
[null,null,"MEMÓRIA DE CÁLCULO"]
[]
[]
[]
[{"$nulls":6},"TIPOLOGIA DO MATERIAL",null,"Emulsão Asfáltica para Serviço de Imprimação",null,null,null,"IMPOSTOS","COFINS",6.4999999999999997E-3,6.4999999999999997E-3]
[{"$nulls":6},"ÍNDICE DE PAVIMENTAÇÃO DNIT","2014-07-01","ÍNDICE INICIAL",270.23700000000002,null,null,null,"PIS",0.03,0.03,null,null,null,"LEGENDA",{"$nulls":8},"As empresas tributadas pelo Lucro Presumido pagam 0,65% de PIS e 3% de COFINS"]
[{"$nulls":7},"2025-06-01","ÍNDICE FINAL",586.21100000000001,null,null,null," ICMS",0.18,0.18,{"$f":"1-(O8/1)","v":0.82000000000000006},{"$f":"1-(P8/1)","v":0.82000000000000006},{"$f":"1-(Q8/1)","v":0.17999999999999994},"ENTRADA DE DADOS",null,"QUANT.ESTIMADA DE EMULSÃO ASFÁLTICA PARA IMPRIMAÇÃO (TON.):",null,null,null,{"$f":"ORÇAMENTO!H37","v":28},"TONELADAS",null,"As empresas tributadas pelo Lucro Real pagam 1,65% de PIS e 7,60% de COFINS"]
[{"$nulls":6},"Data ANP","2025-06-01"]
[]
[null,null,"DATA-BASE","PRODUTOS","LOCALIDADES",{"$nulls":4},"CUSTO ANP (R$/Kg)",null,"CUSTO ANP","IMPOSTOS DO PRODUTO","CUSTO DO PRODUTO COM IMPOSTOS","DMT's","DMT's FLUVIAL","CUSTO DO TRANSPORTE RODOVIA PAVIMENTADA","CUSTO DO TRANSPORTE FLUVIAL","CUSTO DO TRANSPORTE TOTAL","ICMS","ATUALIZAÇÃO DO CUSTO DE TRANSPORTE","CUSTO DO TRANSPORTE RODOVIA PAVIMENTADA COM IMPOSTOS E ATUALIZAÇÃO MONETÁRIA","PEDÁGIO ",null,"TOTAL TRANSPORTE","AQUISIÇÃO DO PRODUTO","TOTAL GERAL ( TRANSP + AQUISIÇÃO)",null,1,2,3]
[null,null,{"$f":"H8","v":"2025-06-01"},null,"REFINARIAS","ENDEREÇO","ESTADO","CIDADE","DESTINO","ESTADO","REGIÃO","R$/t","R$/t","R$/t","KM","KM","R$/t","R$/t","R$/t","R$/t","R$/t","R$/t","CUSTO ","R$/t","R$/t","R$/t","R$/t",null,"TOTAL GERAL ( TRANSP + AQUISIÇÃO)","TOTAL TRANSPORTE","AQUISIÇÃO DO PRODUTO"]
[null,{"$f":"AA13","v":4029.3762002266112},1,{"$f":"I6","v":"Emulsão Asfáltica para Serviço de Imprimação"},"Refinaria Abreu e Lima","Rodovia PE 60, Km 10 - Ipojuca - PE CEP:55590-000","Pernambuco","IPOJUCA - PE","MATO VERDE - MG","-",2.3216290573694685,{"$f":"IF(AND(J13=\"-\",K13=\"-\"),\"\",IF(AND(J13<>0,K13=\"-\"),J13*1000,IF(AND(J13=\"-\",K13<>0),K13*1000,IF(AND(J13<>0,K13<>0),J13*1000,\"\"))))","v":2321.6290573694682},{"$f":"ROUND(((L13/(1-$O$6-$O$7-$O$8))-L13),2)","v":641.52},{"$f":"L13+M13","v":2963.1490573694682},1471,null,{"$f":"ROUND((26.939+0.253*O13),2)","v":399.1},null,{"$f":"Q13+R13","v":399.1},{"$f":"TRUNC(S13*($O$8/(1-$O$8)),2)","v":87.6},{"$f":"TRUNC(IF($J$7=\"\",\"\",(($J$8-$J$7)/$J$7)*(S13+T13)),2)","v":569.07000000000005},{"$f":"S13+T13+U13","v":1055.77},146.4,{"$f":"EVEN($Z$8*2/28)*W13/$Z$8","v":10.457142857142857},{"$f":"IF(AND(S13=\"\",T13=\"\"),\"\",V13+X13)","v":1066.2271428571428},{"$f":"IF(OR(L13=\"\",M13=\"\"),\"\",L13+M13)","v":2963.1490573694682},{"$f":"IF(OR(Y13=\"\",Z13=\"\"),\"\",Y13+Z13)","v":4029.3762002266112},null,{"$f":"AA13","v":4029.3762002266112},{"$f":"Y13","v":1066.2271428571428},{"$f":"Z13","v":2963.1490573694682},null,null,{"$f":"IF(OR(G13=$D$50,G13=$D$51,G13=$D$53,G13=$D$59,G13=$D$43,G13=$D$39,G13=$D$35,G13=$D$48,G13=$D$38),\"NORDESTE\",IF(OR(G13=$D$34,G13=$D$36,G13=$D$37,G13=$D$47,G13=$D$55,G13=$D$56,G13=$D$60),\"NORTE\",IF(OR(G13=$D$40,G13=$D$42,G13=$D$44,G13=$D$45),\"CENTRO-OESTE\",IF(OR(G13=$D$58,G13=$D$52,G13=$D$46,G13=$D$41),\"SUDESTE\",IF(OR(G13=$D$57,G13=$D$49,G13=$D$54),\"SUL\",\"\")))))","v":"NORDESTE"}]
[null,{"$f":"AA14","v":4225.4762002266107},2,null,"Refinaria Potiguar Clara Camarão","Rodovia RN 221, KM 25 - Guamaré - RN CEP:59598-000","Rio Grande do Norte","GUAMARÉ - RN",{"$f":"I13","v":"MATO VERDE - MG"},"-",2.3216290573694685,{"$f":"IF(AND(J14=\"-\",K14=\"\"),\"\",IF(AND(J14<>0,K14=\"\"),J14*1000,IF(AND(J14=\"-\",K14<>0),K14*1000,IF(AND(J14<>0,K14<>0),J14*1000,\"\"))))","v":2321.6290573694682},{"$f":"ROUND(((L14/(1-$O$6-$O$7-$O$8))-L14),2)","v":641.52},{"$f":"L14+M14","v":2963.1490573694682},1764,null,{"$f":"ROUND((26.939+0.253*O14),2)","v":473.23},null,{"$f":"Q14+R14","v":473.23},{"$f":"TRUNC(S14*($O$8/(1-$O$8)),2)","v":103.87},{"$f":"TRUNC(IF($J$7=\"\",\"\",(($J$8-$J$7)/$J$7)*(S14+T14)),2)","v":674.77},{"$f":"S14+T14+U14","v":1251.8699999999999},146.4,{"$f":"EVEN($Z$8*2/28)*W14/$Z$8","v":10.457142857142857},{"$f":"IF(AND(S14=\"\",T14=\"\"),\"\",V14+X14)","v":1262.3271428571427},2963.1490573694682,{"$f":"IF(OR(Y14=\"\",Z14=\"\"),\"\",Y14+Z14)","v":4225.4762002266107},null,{"$f":"AA14","v":4225.4762002266107},{"$f":"Y14","v":1262.3271428571427},2963.1490573694682,null,null,"NORDESTE"]
[null,3573.7462002266111,3,null,"Refinaria Landulpho Alves (RLAM)","Rodovia BA 523, KM 4 – Mataripe São Francisco do Conde - BA CEP:43900-000","Bahia","SÃO FRANCISCO DO CONDE - BA",{"$f":"I14","v":"MATO VERDE - MG"},"-",2.3216290573694685,2321.6290573694682,{"$f":"ROUND(((L15/(1-$O$6-$O$7-$O$8))-L15),2)","v":641.52},2963.1490573694682,788,null,{"$f":"ROUND((26.939+0.253*O15),2)","v":226.3},null,226.3,49.67,322.67,598.6400000000001,167.4,11.957142857142857,610.59714285714301,2963.1490573694682,3573.7462002266111,null,3573.7462002266111,610.59714285714301,2963.1490573694682,null,null,"NORDESTE"]
[2403,4196.5145430520233,4,null,"Refinaria Lubrificantes e Derivados do Nordeste (Lubnor)","Av. Leite Barbosa, s/nº - Mucuripe Fortaleza - Ceará CEP:60180-420","Ceará","FORTALEZA - CE","MATO VERDE - MG",2.2774374001948807,2.3216290573694685,{"$f":"IF(AND(J16=\"-\",K16=\"\"),\"\",IF(AND(J16<>0,K16=\"\"),J16*1000,IF(AND(J16=\"-\",K16<>0),K16*1000,IF(AND(J16<>0,K16<>0),J16*1000,\"\"))))","v":2277.4374001948809},{"$f":"ROUND(((L16/(1-$O$6-$O$7-$O$8))-L16),2)","v":629.30999999999995},2906.7474001948808,1805,null,483.6,null,483.6,106.15,689.56,1279.31,146.4,10.457142857142857,1289.7671428571427,2906.7474001948808,4196.5145430520233,null,4196.5145430520233,1289.7671428571427,2906.7474001948808,null,null,"NORDESTE"]
[null,4169.9725410720566,5,null,"Refinaria Capuava (Recap)","Av. Alberto Soares Sampaio, 2122-A Capuava – Mauá - SP","São Paulo","MAUÁ - SP","MATO VERDE - MG",2.5447125410720566,2.3107589003236337,2544.7125410720564,{"$f":"ROUND(((L17/(1-$O$6-$O$7-$O$8))-L17),2)","v":703.17},3247.8825410720565,1217,null,334.84,null,334.84,73.5,477.45,885.79,508.2,36.299999999999997,922.08999999999992,3247.8825410720565,4169.9725410720566,null,4169.9725410720566,922.08999999999992,3247.8825410720565,null,null,"SUDESTE"]
[null,3771.0489003236339,6,null,"Refinaria Duque de Caxias (Reduc)","Rodovia Washington Luiz, km 113,7 Campos Elíseos – Duque de Caxias - RJ CEP:25213-005","Rio de Janeiro","DUQUE DE CAXIAS - RJ","MATO VERDE - MG","-",2.3107589003236337,2310.758900323634,638.52,2949.2789003236339,1042,null,290.57,null,290.57,63.78,414.32,768.67000000000007,743.4,53.1,821.7700000000001,2949.2789003236339,3771.0489003236339,null,3771.0489003236339,821.7700000000001,2949.2789003236339,null,null,"SUDESTE"]
[null,5297.5852787046379,7,null,"Refinaria Alberto Pasqualini (Refap)","Avenida Getúlio Vargas, 11001 - Bairro Brigadeira Canoas - RS - Brasil CEP:92420-221","Rio Grande do Sul","CANOAS - RS","MATO VERDE - MG",2.7943295644189234,2.6697432210010943,2794.3295644189234,772.14,3566.4695644189233,2345,null,620.22,null,620.22,136.13999999999999,884.37,1640.73,1265.4000000000001,90.385714285714286,1731.1157142857144,3566.4695644189233,5297.5852787046379,null,5297.5852787046379,1731.1157142857144,3566.4695644189233,null,null,"SUL"]
[null,4630.9335659314102,8,null,"Unidade de Industrialização do Xisto (SIX)","Rodovia do Xisto, BR 476, km 153 São Mateus do Sul – PR CEP 83900-000","Paraná","SÃO MATEUS DO SUL - PR","MATO VERDE - MG",2.6068078516456956,2.6697432210010943,2606.8078516456958,720.32,3327.127851645696,1750,null,469.69,null,469.69,103.1,669.73,1242.52,858,61.285714285714285,1303.8057142857142,3327.127851645696,4630.9335659314102,null,4630.9335659314102,1303.8057142857142,3327.127851645696,null,null,"SUL"]
[null,3251.0684581333262,9,null,"Refinaria Gabriel Passos (Regap)","Av. Refinaria Gabriel Passos, 690 Distrito Industrial Paulo Camilo Sul Betim - MG CEP:32669-205","Minas Gerais","BETIM - MG","MATO VERDE - MG",2.1335513152761831,2.3107589003236337,2133.5513152761832,589.54999999999995,2723.1013152761834,643,null,189.62,null,189.62,41.62,270.37,501.61,369,26.357142857142858,527.9671428571429,2723.1013152761834,{"$f":"IF(OR(Y21=\"\",Z21=\"\"),\"\",Y21+Z21)","v":3251.0684581333262},null,3251.0684581333262,527.9671428571429,2723.1013152761834,null,null,"SUDESTE"]
[null,4555.0449945028386,10,null,"Refinaria Presidente Getúlio Vargas (Repar)","Rodovia do Xisto, BR 476, km 16 Araucária - PR CEP:83707-440","Paraná","ARAUCÁRIA - PR","MATO VERDE - MG",2.6068078516456956,2.6697432210010943,2606.8078516456958,720.32,3327.127851645696,1644,null,442.87,null,442.87,97.21,631.48,1171.56,789,56.357142857142854,1227.9171428571428,3327.127851645696,4555.0449945028386,null,4555.0449945028386,1227.9171428571428,3327.127851645696,null,null,"SUL"]
[null,4199.4025410720569,11,null,"Refinaria Presidente Bernardes (RPBC)","Av. 9 de abril, 777 - Jardim das Indústrias Cubatão - SP CEP:11505-000","São Paulo","CUBATÃO - SP","MATO VERDE - MG",2.5447125410720566,2.3107589003236337,2544.7125410720564,703.17,3247.8825410720565,1261,null,345.97,null,345.97,75.94,493.31,915.22,508.2,36.299999999999997,951.52,3247.8825410720565,4199.4025410720569,null,4199.4025410720569,951.52,3247.8825410720565,null,null,"SUDESTE"]
[null,4201.9225410720564,12,null,"Refinaria de Paulínia (Replan)","Rodovia SP 332 - Km. 130 Bonfim - Paulínia – SP CEP:13140-000","São Paulo","PAULÍNIA - SP","MATO VERDE - MG",2.5447125410720566,2.3107589003236337,2544.7125410720564,703.17,3247.8825410720565,1241,null,340.91,null,340.91,74.83,486.1,901.84,730.8,52.199999999999996,954.04000000000008,3247.8825410720565,4201.9225410720564,null,4201.9225410720564,954.04000000000008,3247.8825410720565,null,null,"SUDESTE"]
[null,4144.669683929199,13,null,"Refinaria Henrique Lage (Revap)","Rodovia Presidente Dutra, KM 143, S/N Bairro Jardim Diamante - São José dos Campos – SP CEP:12223-900","São Paulo","SÃO JOSÉ DOS CAMPOS - SP","MATO VERDE - MG",2.5447125410720566,2.3107589003236337,2544.7125410720564,703.17,3247.8825410720565,1173,null,323.70999999999998,null,323.70999999999998,71.05,461.57,856.32999999999993,566.4,40.457142857142856,896.78714285714273,3247.8825410720565,4144.669683929199,null,4144.669683929199,896.78714285714273,3247.8825410720565,null,null,"SUDESTE"]
{"$rows_empty":8}
[null,null,null,"Acre"]
[null,null,null,"Alagoas"]
[null,null,null,"Amapá"]
[null,null,null,"Amazonas"]
[null,null,null,"Bahia"]
[null,null,null,"Ceará"]
[null,null,null,"Distrito Federal"]
[null,null,null,"Espírito Santo"]
[null,null,null,"Goiás"]
[null,null,null,"Maranhão"]
[null,null,null,"Mato Grosso"]
[null,null,null,"Mato Grosso do Sul"]
[null,null,null,"Minas Gerais"]
[null,null,null,"Pará"]
[null,null,null,"Paraíba"]
[null,null,null,"Paraná"]
[null,null,null,"Pernambuco"]
[null,null,null,"Piauí"]
[null,null,null,"Rio de Janeiro"]
[null,null,null,"Rio Grande do Norte"]
[null,null,null,"Rio Grande do Sul"]
[null,null,null,"Rondônia"]
[null,null,null,"Roraima"]
[null,null,null,"Santa Catarina"]
[null,null,null,"São Paulo"]
[null,null,null,"Sergipe"]
[null,null,null,"Tocantins"]
[]
[]
[]
[null,null,null,"ASFALTOS DILUÍDOS CM-30"]
[null,null,null,"ASFALTOS DILUÍDOS CM-70"]
[null,null,null,"ASFALTOS DILUÍDOS CR-250"]
[null,null,null,"ASFALTOS DILUÍDOS CR-70"]
[null,null,null,"CAP MODIFICADO POR BORRACHA DE PNEU AB22"]
[null,null,null,"CAP MODIFICADO POR BORRACHA DE PNEU AB8"]
[null,null,null,"CAP MODIFICADO POR POLÍMERO 55-75-E"]
[null,null,null,"CAP MODIFICADO POR POLÍMERO 60-85-E"]
[null,null,null,"CAP MODIFICADO POR POLÍMERO 65-90-E"]
[null,null,null,"CIMENTOS ASFÁLTICOS CAP-150-200"]
[null,null,null,"CIMENTOS ASFÁLTICOS CAP-30-45"]
[null,null,null,"CIMENTOS ASFÁLTICOS CAP-50-70"]
[null,null,null,"CIMENTOS ASFÁLTICOS CAP-85-100"]
[null,null,null,"EMULSÃO ASFÁLTICA CATIÔNICA DE RUPTURA CONTROLADA PARA SERVIÇO DE LAMA ASFÁLTICA"]
[null,null,null,"EMULSÃO ASFÁLTICA DE RUPTURA LENTA CATIÔNICA PARA SERVIÇO DE LAMA ASFÁLTICA"]
[null,null,null,"EMULSÃO ASFÁLTICA DE RUPTURA LENTA DE CARGA NEUTRA PARA SERVIÇO DE LAMA ASFÁLTICA"]
[null,null,null,"EMULSÃO ASFÁLTICA PARA SERVIÇO DE IMPRIMAÇÃO"]
[null,null,null,"EMULSÕES ASF. MOD. POR POLÍMEROS RC1C-E"]
[null,null,null,"EMULSÕES ASF. MOD. POR POLÍMEROS RL1C-E"]
[null,null,null,"EMULSÕES ASF. MOD. POR POLÍMEROS RM1C-E"]
[null,null,null,"EMULSÕES ASF. MOD. POR POLÍMEROS RR1C-E"]
[null,null,null,"EMULSÕES ASF. MOD. POR POLÍMEROS RR2C-E"]
[null,null,null,"EMULSÕES ASFÁLTICAS RL-1C"]
[null,null,null,"EMULSÕES ASFÁLTICAS RM-1C"]
[null,null,null,"EMULSÕES ASFÁLTICAS RM-2C"]
[null,null,null,"EMULSÕES ASFÁLTICAS RR-1C"]
[null,null,null,"EMULSÕES ASFÁLTICAS RR-2C"]

{"sheet":"RR-1C","index":8,"n_rows":92,"n_cols":34,"rows_kept":92,"cut":false,"hidden":false,"merged":[[12,3,26,3],[6,19,6,20],[6,6,7,6],[5,12,7,12],[5,6,5,7],[5,8,5,9],[1,2,3,26],[5,2,7,2],[10,4,10,8],[10,9,10,10],[10,22,10,23],[6,21,6,24],[7,21,7,24]]}
[]
[null,null,"MEMÓRIA DE CÁLCULO"]
[]
[]
[]
[{"$nulls":6},"TIPOLOGIA DO MATERIAL",null,"EMULSÕES ASFÁLTICAS RR-1C",null,null,null,"IMPOSTOS","COFINS",6.4999999999999997E-3,6.4999999999999997E-3]
[{"$nulls":6},"ÍNDICE DE PAVIMENTAÇÃO DNIT","2014-07-01","ÍNDICE INICIAL",270.23700000000002,null,null,null,"PIS",0.03,0.03,null,null,null,"LEGENDA",{"$nulls":8},"As empresas tributadas pelo Lucro Presumido pagam 0,65% de PIS e 3% de COFINS"]
[{"$nulls":7},"2023-10-01","ÍNDICE FINAL",586.21100000000001,null,null,null," ICMS",0.18,0.18,{"$f":"1-(O8/1)","v":0.82000000000000006},{"$f":"1-(P8/1)","v":0.82000000000000006},{"$f":"1-(Q8/1)","v":0.17999999999999994},"ENTRADA DE DADOS",null,"QUANT.ESTIMADA DE RR-1C (TON.):",null,null,null,{"$f":"ORÇAMENTO!H39","v":9},"TONELADAS",null,"As empresas tributadas pelo Lucro Real pagam 1,65% de PIS e 7,60% de COFINS"]
[{"$nulls":6},"Data ANP",{"$f":"EAI!H9","v":"2025-06-01"}]
[]
[null,null,"DATA-BASE","PRODUTOS","LOCALIDADES",{"$nulls":4},"CUSTO ANP (R$/Kg)",null,"CUSTO ANP","IMPOSTOS DO PRODUTO","CUSTO DO PRODUTO COM IMPOSTOS","DMT's","DMT'S FLUVIAL","CUSTO DO TRANSPORTE RODOVIA PAVIMENTADA","CUSTO DO TRANSPORTE FLUVIAL","CUSTO DO TRANSPORTE TOTAL","ICMS","ATUALIZAÇÃO DO CUSTO DE TRANSPORTE","CUSTO DO TRANSPORTE RODOVIA PAVIMENTADA COM IMPOSTOS E ATUALIZAÇÃO MONETÁRIA","PEDÁGIO ",null,"TOTAL TRANSPORTE","AQUISIÇÃO DO PRODUTO","TOTAL GERAL ( TRANSP + AQUISIÇÃO)",null,1,2,3]
[null,null,{"$f":"H8","v":"2023-10-01"},null,"REFINARIAS","ENDEREÇO","ESTADO","CIDADE","DESTINO","ESTADO","REGIÃO","R$/t","R$/t","R$/t","KM","KM","R$/t","R$/t","R$/t","R$/t","R$/t","R$/t","CUSTO ","R$/t","R$/t","R$/t","R$/t",null,"TOTAL GERAL ( TRANSP + AQUISIÇÃO)","TOTAL TRANSPORTE","AQUISIÇÃO DO PRODUTO"]
[null,{"$f":"AA13","v":4170.6414818419762},1,{"$f":"I6","v":"EMULSÕES ASFÁLTICAS RR-1C"},"'CENTRO OESTE ASFALTOS LTDA.","SETOR DE INFLAMÁVEIS, S/N TRECHO 02 - LOTE 1.100 - GUARÁ - CEP:71225-000","Distrito Federal","BRASÍLIA - DF",{"$f":"EAI!I13","v":"MATO VERDE - MG"},"-",2.6927881485086433,{"$f":"IF(AND(J13=\"-\",K13=\"-\"),\"\",IF(AND(J13<>0,K13=\"-\"),J13*1000,IF(AND(J13=\"-\",K13<>0),K13*1000,IF(AND(J13<>0,K13<>0),J13*1000,\"\"))))","v":2692.7881485086432},{"$f":"ROUND(((L13/(1-$O$6-$O$7-$O$8))-L13),2)","v":744.08},{"$f":"L13+M13","v":3436.8681485086431},909,null,{"$f":"ROUND((26.939+0.253*O13),2)","v":256.92},null,{"$f":"Q13+R13","v":256.92},{"$f":"TRUNC(S13*($O$8/(1-$O$8)),2)","v":56.39},{"$f":"TRUNC(IF($J$7=\"\",\"\",(($J$8-$J$7)/$J$7)*(S13+T13)),2)","v":366.33},{"$f":"S13+T13+U13","v":679.64},243.6,{"$f":"EVEN($Z$8*2/28)*W13/$Z$8","v":54.133333333333333},{"$f":"IF(AND(Q13=\"\",T13=\"\"),\"\",V13+X13)","v":733.77333333333331},{"$f":"IF(OR(L13=\"\",M13=\"\"),\"\",L13+M13)","v":3436.8681485086431},{"$f":"IF(OR(Y13=\"\",Z13=\"\"),\"\",Y13+Z13)","v":4170.6414818419762},null,{"$f":"AA13","v":4170.6414818419762},{"$f":"Y13","v":733.77333333333331},{"$f":"Z13","v":3436.8681485086431},null,null,{"$f":"IF(OR(G13=$D$52,G13=$D$53,G13=$D$55,G13=$D$61,G13=$D$45,G13=$D$41,G13=$D$37,G13=$D$50,G13=$D$40),\"NORDESTE\",IF(OR(G13=$D$36,G13=$D$38,G13=$D$39,G13=$D$49,G13=$D$57,G13=$D$58,G13=$D$62),\"NORTE\",IF(OR(G13=$D$42,G13=$D$44,G13=$D$46,G13=$D$47),\"CENTRO-OESTE\",IF(OR(G13=$D$60,G13=$D$54,G13=$D$48,G13=$D$43),\"SUDESTE\",IF(OR(G13=$D$59,G13=$D$51,G13=$D$56),\"SUL\",\"\")))))","v":"CENTRO-OESTE"}]
[null,{"$f":"AA14","v":4202.6807553244844},2,null,"STRATURA ASFALTOS S/A","AVENIDA PRESIDENTE WILSON, 08  - JUNDIAÍ - CEP:75115-100","Goiás","ANÁPOLIS - GO",{"$f":"I13","v":"MATO VERDE - MG"},2.6561374219911511,2.6927881485086433,{"$f":"IF(AND(J14=\"-\",K14=\"-\"),\"\",IF(AND(J14<>0,K14=\"-\"),J14*1000,IF(AND(J14=\"-\",K14<>0),K14*1000,IF(AND(J14<>0,K14<>0),J14*1000,\"\"))))","v":2656.1374219911513},{"$f":"ROUND(((L14/(1-$O$6-$O$7-$O$8))-L14),2)","v":733.96},{"$f":"L14+M14","v":3390.0974219911514},1013,null,{"$f":"ROUND((26.939+0.253*O14),2)","v":283.23},null,{"$f":"Q14+R14","v":283.23},{"$f":"TRUNC(S14*($O$8/(1-$O$8)),2)","v":62.17},{"$f":"TRUNC(IF($J$7=\"\",\"\",(($J$8-$J$7)/$J$7)*(S14+T14)),2)","v":403.85},{"$f":"S14+T14+U14","v":749.25},285,{"$f":"EVEN($Z$8*2/28)*W14/$Z$8","v":63.333333333333336},812.58333333333337,3390.0974219911514,{"$f":"IF(OR(Y14=\"\",Z14=\"\"),\"\",Y14+Z14)","v":4202.6807553244844},null,{"$f":"AA14","v":4202.6807553244844},{"$f":"Y14","v":812.58333333333337},3390.0974219911514,null,null,"CENTRO-OESTE"]
[null,4228.2607553244843,3,null,"DISTRIBUIDORA BRASILEIRA DE ASFALTO SA - DISBRAL","VIA PRIMARIA 8, S/N QD-18, MODS. 24/47 - DAIAG - CEP:74980-970","Goiás","APARECIDA DE GOIANIA - GO",{"$f":"I14","v":"MATO VERDE - MG"},2.6561374219911511,2.6927881485086433,2656.1374219911513,733.96,3390.0974219911514,1065,null,296.38,null,296.38,65.05,422.6,784.03,243.6,54.133333333333333,838.1633333333333,3390.0974219911514,4228.2607553244843,null,4228.2607553244843,838.1633333333333,3390.0974219911514,null,null,"CENTRO-OESTE"]
[2403,4240.9907553244848,4,null,"INDÚSTRIA NACIONAL DE ASFALTOS LTDA.","VIA PRIMEIRA E SEGUNDA 3, S/N.º LOTES 01 A 10 - DISTRITO AGROINDUSTRIAL - CEP:75370-000","Goiás","GOIANIRA - GO","MATO VERDE - MG",2.6561374219911511,2.6927881485086433,2656.1374219911513,733.96,3390.0974219911514,1084,null,301.19,null,301.19,66.11,429.46,796.76,243.6,54.133333333333333,850.89333333333332,3390.0974219911514,4240.9907553244848,null,4240.9907553244848,850.89333333333332,3390.0974219911514,null,null,"CENTRO-OESTE"]
[null,4125.6228921681559,5,null,"STRATURA ASFALTOS S/A","RUA VICTOR RODRIGUES RESENDE, 333  - DISTRITO IND. DE UBERLÂNDIA - CEP:38405-440","Minas Gerais","UBERLANDIA - MG","MATO VERDE - MG",2.708526225501489,2.8245014676569142,2708.5262255014891,748.43,3456.9562255014889,842,null,239.97,null,239.97,52.67,342.16,634.79999999999995,152.4,33.866666666666667,668.66666666666663,3456.9562255014889,4125.6228921681559,null,4125.6228921681559,668.66666666666663,3456.9562255014889,null,null,"SUDESTE"]
[null,5667.0628774764373,6,null,"ARAPETRO DISTRIBUIDORA DE PETRÓLEO LTDA.","RUA 04, S/N° LOTES 17 A 20. - DISTRITO INDUSTRIAL 1/8 - CEP:78600-000","Mato Grosso","BARRA DO GARCAS - MT",{"$f":"I17","v":"MATO VERDE - MG"},3.5878395441431041,2.6927881485086433,{"$f":"IF(AND(J18=\"-\",K18=\"-\"),\"\",IF(AND(J18<>0,K18=\"-\"),J18*1000,IF(AND(J18=\"-\",K18<>0),K18*1000,IF(AND(J18<>0,K18<>0),J18*1000,\"\"))))","v":3587.8395441431039},{"$f":"ROUND(((L18/(1-$O$6-$O$7-$O$8))-L18),2)","v":991.41},4579.2495441431038,1438,null,390.75,null,390.75,85.77,557.16,1033.6799999999998,243.6,54.133333333333333,1087.8133333333333,4579.2495441431038,5667.0628774764373,{"$nulls":6},"CENTRO-OESTE"]
[null,4047.2462255014889,7,null,"DISTRIBUIDORA BRASILEIRA DE ASFALTO SA - DISBRAL","SÃO JUDAS TADEU, 288  - DISTRITO INDUSTRIAL - CEP:32450-000","Minas Gerais","SARZEDO - MG","MATO VERDE - MG",2.708526225501489,2.8245014676569142,2708.5262255014891,748.43,3456.9562255014889,653,null,192.15,null,192.15,42.17,273.97000000000003,508.29,369,82,590.29,3456.9562255014889,4047.2462255014889,{"$nulls":6},"SUDESTE"]
[null,5404.8944237767901,8,null,"'INDÚSTRIA NACIONAL DE ASFALTOS LTDA.","INDÚSTRIA NACIONAL DE ASFALTOS LTDA - CEP:77053-080","Tocantins"," PALMAS - TO","MATO VERDE - MG",3.5464844237767892,3.4364809738019071,3546.4844237767893,979.98,4526.4644237767898,1206,null,332.06,null,332.06,72.89,473.48,878.43000000000006,0,0,878.43000000000006,4526.4644237767898,5404.8944237767901,{"$nulls":6},"NORTE"]
[null,4534.4923123716453,9,null,"'NTA - NOVAS TÉCNICAS DE ASFALTOS S/A","RUA SOFIA ATAURI FADIN, 150 SALA A - B. SANTA TEREZINHA - CEP:13140-000","São Paulo","PAULINIA - SP","MATO VERDE - MG",2.7528523123716457,2.8245014676569142,2752.8523123716459,{"$f":"ROUND(((L21/(1-$O$6-$O$7-$O$8))-L21),2)","v":760.68},3513.5323123716457,1208,null,332.56,null,332.56,73,474.2,879.76,635.4,141.19999999999999,1020.96,3513.5323123716457,4534.4923123716453,null,4534.4923123716453,1020.96,3513.5323123716457,null,null,"SUDESTE"]
[null,4484.2889790383124,10,null,"COMPANHIA BRASILEIRA DE ASFALTOS DA AMAZÔNIA - IMPORTAÇÃO E EXPORTAÇÃO","Avenida Doutor Olindo Dártora 2451, Galpão 02, Morro Grande - CEP:07726-555","São Paulo","CAIEIRAS - SP","MATO VERDE - MG",2.7528523123716457,2.8245014676569142,2752.8523123716459,{"$f":"ROUND(((L22/(1-$O$6-$O$7-$O$8))-L22),2)","v":760.68},3513.5323123716457,1181,null,325.73,null,325.73,71.5,464.46,861.69,490.8,109.06666666666666,970.75666666666666,3513.5323123716457,4484.2889790383124,{"$nulls":6},"SUDESTE"]
[null,4649.6548151753095,11,null,"BETUNEL INDÚSTRIA E COMÉRCIO LTDA.","R 16 , 82, Vila Nova Campo Grande - CEP:79.103-834","Mato Grosso do Sul","CAMPO GRANDE - MS","MATO VERDE - MG","-",2.6927881485086433,2692.7881485086432,{"$f":"ROUND(((L23/(1-$O$6-$O$7-$O$8))-L23),2)","v":744.08},3436.8681485086431,1655,null,445.65,null,445.65,97.82,635.45000000000005,1178.92,152.4,33.866666666666667,1212.7866666666666,3436.8681485086431,4649.6548151753095,{"$nulls":6},"CENTRO-OESTE"]
[null,6061.3328774764368,12,null,"BETUNEL INDÚSTRIA E COMÉRCIO LTDA.","RUA N ESQUINA COM RUA X, S/N QD. IND. 7 L 01/08 - DIST. IND. - CEP:78015-285","Mato Grosso","CUIABA - MT",{"$f":"I23","v":"MATO VERDE - MG"},3.5878395441431041,2.6927881485086433,3587.8395441431039,991.41,4579.2495441431038,1990,null,530.41,null,530.41,116.43,756.31,1403.1499999999999,355.2,78.933333333333337,1482.0833333333333,4579.2495441431038,6061.3328774764368,{"$nulls":6},"CENTRO-OESTE"]
[null,4473.6389790383128,13,null,"VIAPOL LTDA.","VITO ARDITO, 6401 KM 118,5 - JARDIM CAMPO GRANDE - CEP:12282-535","São Paulo","CACAPAVA - SP",{"$f":"I24","v":"MATO VERDE - MG"},2.7528523123716457,2.8245014676569142,2752.8523123716459,760.68,3513.5323123716457,1140,null,315.36,null,315.36,69.22,449.66,834.24,566.4,125.86666666666666,960.10666666666668,3513.5323123716457,4473.6389790383128,null,4473.6389790383128,960.10666666666668,3513.5323123716457,null,null,"SUDESTE"]
[null,4227.8667599961409,14,null,"STRATURA ASFALTOS S/A","RUA LUIS DE CAMÕES, 26  - CAMPOS ELÍSEOS - CEP:25225-030","Rio de Janeiro","DUQUE DE CAXIAS - RJ","MATO VERDE - MG",2.6238667599961412,2.8245014676569142,2623.8667599961414,725.04,3348.9067599961413,960,null,269.82,null,269.82,59.22,384.72,713.76,743.4,165.2,878.96,3348.9067599961413,4227.8667599961409,null,4227.8667599961409,878.96,3348.9067599961413,null,null,"SUDESTE"]
[null,4741.280032172559,15,null,"CASA DO ASFALTO DISTRIBUIDORA, INDÚSTRIA E COMÉRCIO DE ASFALTO LTDA.","BR 376, PARQUE INDUSTRIAL, S/N LOTE 6/7/7-A-3-1 - GL.PATR.MARIALVA - CEP:86990-000","Paraná","MARIALVA - PR",{"$f":"I26","v":"MATO VERDE - MG"},2.6913489210614476,2.7008748414008212,2691.3489210614475,743.68,3435.0289210614474,1580,null,426.68,null,426.68,93.66,608.4,1128.74,798.8,177.51111111111109,1306.2511111111112,3435.0289210614474,4741.280032172559,null,4741.280032172559,1306.2511111111112,3435.0289210614474,null,null,"SUL"]
{"$rows_empty":8}
[null,null,null,"Acre"]
[null,null,null,"Alagoas"]
[null,null,null,"Amapá"]
[null,null,null,"Amazonas"]
[null,null,null,"Bahia"]
[null,null,null,"Ceará"]
[null,null,null,"Distrito Federal"]
[null,null,null,"Espírito Santo"]
[null,null,null,"Goiás"]
[null,null,null,"Maranhão"]
[null,null,null,"Mato Grosso"]
[null,null,null,"Mato Grosso do Sul"]
[null,null,null,"Minas Gerais"]
[null,null,null,"Pará"]
[null,null,null,"Paraíba"]
[null,null,null,"Paraná"]
[null,null,null,"Pernambuco"]
[null,null,null,"Piauí"]
[null,null,null,"Rio de Janeiro"]
[null,null,null,"Rio Grande do Norte"]
[null,null,null,"Rio Grande do Sul"]
[null,null,null,"Rondônia"]
[null,null,null,"Roraima"]
[null,null,null,"Santa Catarina"]
[null,null,null,"São Paulo"]
[null,null,null,"Sergipe"]
[null,null,null,"Tocantins"]
[]
[]
[]
[null,null,null,"ASFALTOS DILUÍDOS CM-30"]
[null,null,null,"ASFALTOS DILUÍDOS CM-70"]
[null,null,null,"ASFALTOS DILUÍDOS CR-250"]
[null,null,null,"ASFALTOS DILUÍDOS CR-70"]
[null,null,null,"CAP MODIFICADO POR BORRACHA DE PNEU AB22"]
[null,null,null,"CAP MODIFICADO POR BORRACHA DE PNEU AB8"]
[null,null,null,"CAP MODIFICADO POR POLÍMERO 55-75-E"]
[null,null,null,"CAP MODIFICADO POR POLÍMERO 60-85-E"]
[null,null,null,"CAP MODIFICADO POR POLÍMERO 65-90-E"]
[null,null,null,"CIMENTOS ASFÁLTICOS CAP-150-200"]
[null,null,null,"CIMENTOS ASFÁLTICOS CAP-30-45"]
[null,null,null,"CIMENTOS ASFÁLTICOS CAP-50-70"]
[null,null,null,"CIMENTOS ASFÁLTICOS CAP-85-100"]
[null,null,null,"EMULSÃO ASFÁLTICA CATIÔNICA DE RUPTURA CONTROLADA PARA SERVIÇO DE LAMA ASFÁLTICA"]
[null,null,null,"EMULSÃO ASFÁLTICA DE RUPTURA LENTA CATIÔNICA PARA SERVIÇO DE LAMA ASFÁLTICA"]
[null,null,null,"EMULSÃO ASFÁLTICA DE RUPTURA LENTA DE CARGA NEUTRA PARA SERVIÇO DE LAMA ASFÁLTICA"]
[null,null,null,"EMULSÃO ASFÁLTICA PARA SERVIÇO DE IMPRIMAÇÃO"]
[null,null,null,"EMULSÕES ASF. MOD. POR POLÍMEROS RC1C-E"]
[null,null,null,"EMULSÕES ASF. MOD. POR POLÍMEROS RL1C-E"]
[null,null,null,"EMULSÕES ASF. MOD. POR POLÍMEROS RM1C-E"]
[null,null,null,"EMULSÕES ASF. MOD. POR POLÍMEROS RR1C-E"]
[null,null,null,"EMULSÕES ASF. MOD. POR POLÍMEROS RR2C-E"]
[null,null,null,"EMULSÕES ASFÁLTICAS RL-1C"]
[null,null,null,"EMULSÕES ASFÁLTICAS RM-1C"]
[null,null,null,"EMULSÕES ASFÁLTICAS RM-2C"]
[null,null,null,"EMULSÕES ASFÁLTICAS RR-1C"]
[null,null,null,"EMULSÕES ASFÁLTICAS RR-2C"]

{"sheet":"CAP","index":9,"n_rows":91,"n_cols":34,"rows_kept":91,"cut":false,"hidden":false,"merged":[[10,4,10,8],[10,9,10,10],[10,22,10,23],[12,3,24,3],[1,2,3,26],[5,2,7,2],[5,12,7,12],[6,6,7,6],[6,19,6,20],[6,21,6,24],[7,21,7,24],[5,6,5,7],[5,8,5,9]]}
[]
[null,null,"MEMÓRIA DE CÁLCULO"]
[]
[]
[]
[{"$nulls":6},"TIPOLOGIA DO MATERIAL",null,"CIMENTOS ASFÁLTICOS CAP-50-70",null,null,null,"IMPOSTOS","COFINS",6.4999999999999997E-3,6.4999999999999997E-3]
[{"$nulls":6},"ÍNDICE DE PAVIMENTAÇÃO DNIT","2014-07-01","ÍNDICE INICIAL",270.23700000000002,null,null,null,"PIS",0.03,0.03,null,null,null,"LEGENDA",null,"QUANT.ESTIMADA DE MASSA ASFÁLTICA (TON.):",null,null,null,{"$f":"ORÇAMENTO!H23","v":2200},"TONELADAS",null,"As empresas tributadas pelo Lucro Presumido pagam 0,65% de PIS e 3% de COFINS"]
[{"$nulls":7},"2025-06-01","ÍNDICE FINAL",586.21100000000001,null,null,null," ICMS",0.18,0.18,{"$f":"1-(O8/1)","v":0.82000000000000006},{"$f":"1-(P8/1)","v":0.82000000000000006},{"$f":"1-(Q8/1)","v":0.17999999999999994},"ENTRADA DE DADOS",null,"QUANT.ESTIMADA DE CAP 50/70 (TON.):",null,null,null,{"$f":"ORÇAMENTO!H41","v":125},"TONELADAS",null,"As empresas tributadas pelo Lucro Real pagam 1,65% de PIS e 7,60% de COFINS"]
[{"$nulls":6},"Data ANP",{"$f":"EAI!H9","v":"2025-06-01"}]
[]
[null,null,"DATA-BASE","PRODUTOS","LOCALIDADES",{"$nulls":4},"CUSTO ANP (R$/Kg)",null,"CUSTO ANP","IMPOSTOS DO PRODUTO","CUSTO DO PRODUTO COM IMPOSTOS","DMT's","DMT's FLUVIAL","CUSTO DO TRANSPORTE RODOVIA PAVIMENTADA","CUSTO DO TRANSPORTE FLUVIAL","CUSTO DO TRANSPORTE TOTAL","ICMS","ATUALIZAÇÃO DO CUSTO DE TRANSPORTE","CUSTO DO TRANSPORTE RODOVIA PAVIMENTADA COM IMPOSTOS E ATUALIZAÇÃO MONETÁRIA","PEDÁGIO ",null,"TOTAL TRANSPORTE","AQUISIÇÃO DO PRODUTO","TOTAL GERAL ( TRANSP + AQUISIÇÃO)",null,1,2,3]
[null,null,{"$f":"H8","v":"2025-06-01"},null,"REFINARIAS","ENDEREÇO","ESTADO","CIDADE","DESTINO","ESTADO","REGIÃO","R$/t","R$/t","R$/t","KM","KM","R$/t","R$/t","R$/t","R$/t","R$/t","R$/t","CUSTO ","R$/t","R$/t","R$/t","R$/t",null,"TOTAL GERAL ( TRANSP + AQUISIÇÃO)","TOTAL TRANSPORTE","AQUISIÇÃO DO PRODUTO"]
[null,{"$f":"AA13","v":5869.3920188373741},1,{"$f":"I6","v":"CIMENTOS ASFÁLTICOS CAP-50-70"},"Refinaria Abreu e Lima","Rodovia PE 60, Km 10 - Ipojuca - PE CEP:55590-000","Pernambuco","IPOJUCA - PE","JANAÚBA - MG","-",3.7192800188373742,{"$f":"IF(AND(J13=\"-\",K13=\"-\"),\"\",IF(AND(J13<>0,K13=\"-\"),J13*1000,IF(AND(J13=\"-\",K13<>0),K13*1000,IF(AND(J13<>0,K13<>0),J13*1000,\"\"))))","v":3719.2800188373744},{"$f":"ROUND(((L13/(1-$O$6-$O$7-$O$8))-L13),2)","v":1027.73},{"$f":"L13+M13","v":4747.0100188373744},1553,null,{"$f":"ROUND((26.939+0.253*O13),2)","v":419.85},null,{"$f":"Q13+R13","v":419.85},{"$f":"TRUNC(S13*($O$8/(1-$O$8)),2)","v":92.16},{"$f":"TRUNC(IF($J$7=\"\",\"\",(($J$8-$J$7)/$J$7)*(S13+T13)),2)","v":598.66},{"$f":"S13+T13+U13","v":1110.67},146.4,{"$f":"EVEN($Z$8*2/28)*W13/$Z$8","v":11.712},{"$f":"IF(AND(Q13=\"\",T13=\"\"),\"\",V13+X13)","v":1122.3820000000001},{"$f":"IF(OR(L13=\"\",M13=\"\"),\"\",L13+M13)","v":4747.0100188373744},{"$f":"IF(OR(Y13=\"\",Z13=\"\"),\"\",Y13+Z13)","v":5869.3920188373741},null,{"$f":"AA13","v":5869.3920188373741},{"$f":"Y13","v":1122.3820000000001},{"$f":"Z13","v":4747.0100188373744},null,null,{"$f":"IF(OR(G13=$D$51,G13=$D$52,G13=$D$54,G13=$D$60,G13=$D$44,G13=$D$40,G13=$D$36,G13=$D$49,G13=$D$39),\"NORDESTE\",IF(OR(G13=$D$35,G13=$D$37,G13=$D$38,G13=$D$48,G13=$D$56,G13=$D$57,G13=$D$61),\"NORTE\",IF(OR(G13=$D$41,G13=$D$43,G13=$D$45,G13=$D$46),\"CENTRO-OESTE\",IF(OR(G13=$D$59,G13=$D$53,G13=$D$47,G13=$D$42),\"SUDESTE\",IF(OR(G13=$D$58,G13=$D$50,G13=$D$55),\"SUL\",\"\")))))","v":"NORDESTE"}]
[null,{"$f":"AA14","v":6054.7820188373744},3,null,"Refinaria Potiguar Clara Camarão","Rodovia RN 221, KM 25 - Guamaré - RN CEP:59598-000","Rio Grande do Norte","GUAMARÉ - RN",{"$f":"I13","v":"JANAÚBA - MG"},"-",3.7192800188373742,3719.2800188373744,{"$f":"ROUND(((L14/(1-$O$6-$O$7-$O$8))-L14),2)","v":1027.73},{"$f":"L14+M14","v":4747.0100188373744},1830,null,{"$f":"ROUND((26.939+0.253*O14),2)","v":489.93},null,{"$f":"Q14+R14","v":489.93},{"$f":"TRUNC(S14*($O$8/(1-$O$8)),2)","v":107.54},{"$f":"TRUNC(IF($J$7=\"\",\"\",(($J$8-$J$7)/$J$7)*(S14+T14)),2)","v":698.59},{"$f":"S14+T14+U14","v":1296.06},146.4,{"$f":"EVEN($Z$8*2/28)*W14/$Z$8","v":11.712},1307.7719999999999,4747.0100188373744,{"$f":"IF(OR(Y14=\"\",Z14=\"\"),\"\",Y14+Z14)","v":6054.7820188373744},null,{"$f":"AA14","v":6054.7820188373744},{"$f":"Y14","v":1307.7719999999999},4747.0100188373744,null,null,"NORDESTE"]
[null,5411.8215621071031,4,null,"Refinaria Landulpho Alves (RLAM)","Rodovia BA 523, KM 4 – Mataripe São Francisco do Conde - BA CEP:43900-000","Bahia","SÃO FRANCISCO DO CONDE - BA",{"$f":"I14","v":"JANAÚBA - MG"},3.7249595621071032,3.7192800188373742,3724.959562107103,{"$f":"ROUND(((L15/(1-$O$6-$O$7-$O$8))-L15),2)","v":1029.3},4754.2595621071032,856,null,{"$f":"ROUND((26.939+0.253*O15),2)","v":243.51},null,243.51,53.45,347.21,644.16999999999996,167.4,13.391999999999999,657.56200000000001,4754.2595621071032,5411.8215621071031,null,5411.8215621071031,657.56200000000001,4754.2595621071032,null,null,"NORDESTE"]
[2403,6030.2957843596978,5,null,"Refinaria Lubrificantes e Derivados do Nordeste (Lubnor)","Av. Leite Barbosa, s/nº - Mucuripe Fortaleza - Ceará CEP:60180-420","Ceará","FORTALEZA - CE","JANAÚBA - MG",3.6765137843596976,3.7192800188373742,3676.5137843596976,{"$f":"ROUND(((L16/(1-$O$6-$O$7-$O$8))-L16),2)","v":1015.91},4692.4237843596975,1875,null,501.31,null,501.31,110.04,714.81,1326.1599999999999,146.4,11.712,1337.8719999999998,4692.4237843596975,6030.2957843596978,null,6030.2957843596978,1337.8719999999998,4692.4237843596975,null,null,"NORDESTE"]
[null,5363.6260022636052,6,null,"Refinaria Capuava (Recap)","Av. Alberto Soares Sampaio, 2122-A Capuava – Mauá - SP","São Paulo","MAUÁ - SP","JANAÚBA - MG",3.5232200022636051,3.7003936998971256,3523.2200022636052,{"$f":"ROUND(((L17/(1-$O$6-$O$7-$O$8))-L17),2)","v":973.55},4496.7700022636054,1128,null,312.32,null,312.32,68.55,445.33,826.2,508.2,40.655999999999999,866.85599999999999,4496.7700022636054,5363.6260022636052,null,5363.6260022636052,866.85599999999999,4496.7700022636054,null,null,"SUDESTE"]
[null,5386.0097341373457,7,null,"Refinaria Duque de Caxias (Reduc)","Rodovia Washington Luiz, km 113,7 Campos Elíseos – Duque de Caxias - RJ CEP:25213-005","Rio de Janeiro","DUQUE DE CAXIAS - RJ","JANAÚBA - MG",3.6141077341373462,3.7003936998971256,3614.1077341373461,998.67,4612.7777341373458,960,null,269.82,null,269.82,59.22,384.72,713.76,743.4,59.472000000000001,773.23199999999997,4612.7777341373458,5386.0097341373457,null,5386.0097341373457,773.23199999999997,4612.7777341373458,null,null,"SUDESTE"]
[null,6461.754563540565,8,null,"Refinaria Alberto Pasqualini (Refap)","Avenida Getúlio Vargas, 11001 - Bairro Brigadeira Canoas - RS - Brasil CEP:92420-221","Rio Grande do Sul","CANOAS - RS","JANAÚBA - MG",3.7703125635405645,3.6977510344764437,3770.3125635405645,1041.83,4812.1425635405649,2207,null,585.30999999999995,null,585.30999999999995,128.47999999999999,834.59,1548.38,1265.4000000000001,101.232,1649.6120000000001,4812.1425635405649,6461.754563540565,null,6461.754563540565,1649.6120000000001,4812.1425635405649,null,null,"SUL"]
[null,5938.6804843546488,9,null,"Unidade de Industrialização do Xisto (SIX)","Rodovia do Xisto, BR 476, km 153 São Mateus do Sul – PR CEP 83900-000","Paraná","SÃO MATEUS DO SUL - PR","JANAÚBA - MG",3.6650104843546476,3.6977510344764437,3665.0104843546478,1012.73,4677.7404843546483,1675,null,450.71,null,450.71,98.93,642.66,1192.3,858,68.64,1260.94,4677.7404843546483,5938.6804843546488,null,5938.6804843546488,1260.94,4677.7404843546483,null,null,"SUL"]
[null,5345.5712193514237,10,null,"Refinaria Gabriel Passos (Regap)","Av. Refinaria Gabriel Passos, 690 Distrito Industrial Paulo Camilo Sul Betim - MG CEP:32669-205","Minas Gerais","BETIM - MG","JANAÚBA - MG",3.8177312193514235,3.7003936998971256,3817.7312193514235,1054.93,4872.6612193514238,556,null,167.61,null,167.61,36.79,238.99,443.39,369,29.52,472.90999999999997,4872.6612193514238,{"$f":"IF(OR(Y21=\"\",Z21=\"\"),\"\",Y21+Z21)","v":5345.5712193514237},null,5345.5712193514237,472.90999999999997,4872.6612193514238,null,null,"SUDESTE"]
[null,5851.5304843546483,11,null,"Refinaria Presidente Getúlio Vargas (Repar)","Rodovia do Xisto, BR 476, km 16 Araucária - PR CEP:83707-440","Paraná","ARAUCÁRIA - PR","JANAÚBA - MG",3.6650104843546476,3.6977510344764437,3665.0104843546478,1012.73,4677.7404843546483,1553,null,419.85,null,419.85,92.16,598.66,1110.67,789,63.12,1173.79,4677.7404843546483,5851.5304843546483,null,5851.5304843546483,1173.79,4677.7404843546483,null,null,"SUL"]
[null,5391.7560022636053,12,null,"Refinaria Presidente Bernardes (RPBC)","Av. 9 de abril, 777 - Jardim das Indústrias Cubatão - SP CEP:11505-000","São Paulo","CUBATÃO - SP","JANAÚBA - MG",3.5232200022636051,3.7003936998971256,3523.2200022636052,973.55,4496.7700022636054,1170,null,322.95,null,322.95,70.89,460.49,854.32999999999993,508.2,40.655999999999999,894.98599999999988,4496.7700022636054,5391.7560022636053,null,5391.7560022636053,894.98599999999988,4496.7700022636054,null,null,"SUDESTE"]
[null,5390.1540022636054,13,null,"Refinaria de Paulínia (Replan)","Rodovia SP 332 - Km. 130 Bonfim - Paulínia – SP CEP:13140-000","São Paulo","PAULÍNIA - SP","JANAÚBA - MG",3.5232200022636051,3.7003936998971256,3523.2200022636052,973.55,4496.7700022636054,1141,null,315.61,null,315.61,69.28,450.03,834.92,730.8,58.463999999999999,893.38400000000001,4496.7700022636054,5390.1540022636054,null,5390.1540022636054,893.38400000000001,4496.7700022636054,null,null,"SUDESTE"]
[null,5334.8320022636053,14,null,"Refinaria Henrique Lage (Revap)","Rodovia Presidente Dutra, KM 143, S/N Bairro Jardim Diamante - São José dos Campos – SP CEP:12223-900","São Paulo","SÃO JOSÉ DOS CAMPOS - SP","JANAÚBA - MG",3.5232200022636051,3.7003936998971256,3523.2200022636052,973.55,4496.7700022636054,1078,null,299.67,null,299.67,65.78,427.3,792.75,566.4,45.311999999999998,838.06200000000001,4496.7700022636054,5334.8320022636053,null,5334.8320022636053,838.06200000000001,4496.7700022636054,null,null,"SUDESTE"]
{"$rows_empty":9}
[null,null,null,"Acre"]
[null,null,null,"Alagoas"]
[null,null,null,"Amapá"]
[null,null,null,"Amazonas"]
[null,null,null,"Bahia"]
[null,null,null,"Ceará"]
[null,null,null,"Distrito Federal"]
[null,null,null,"Espírito Santo"]
[null,null,null,"Goiás"]
[null,null,null,"Maranhão"]
[null,null,null,"Mato Grosso"]
[null,null,null,"Mato Grosso do Sul"]
[null,null,null,"Minas Gerais"]
[null,null,null,"Pará"]
[null,null,null,"Paraíba"]
[null,null,null,"Paraná"]
[null,null,null,"Pernambuco"]
[null,null,null,"Piauí"]
[null,null,null,"Rio de Janeiro"]
[null,null,null,"Rio Grande do Norte"]
[null,null,null,"Rio Grande do Sul"]
[null,null,null,"Rondônia"]
[null,null,null,"Roraima"]
[null,null,null,"Santa Catarina"]
[null,null,null,"São Paulo"]
[null,null,null,"Sergipe"]
[null,null,null,"Tocantins"]
[]
[]
[]
[null,null,null,"ASFALTOS DILUÍDOS CM-30"]
[null,null,null,"ASFALTOS DILUÍDOS CM-70"]
[null,null,null,"ASFALTOS DILUÍDOS CR-250"]
[null,null,null,"ASFALTOS DILUÍDOS CR-70"]
[null,null,null,"CAP MODIFICADO POR BORRACHA DE PNEU AB22"]
[null,null,null,"CAP MODIFICADO POR BORRACHA DE PNEU AB8"]
[null,null,null,"CAP MODIFICADO POR POLÍMERO 55-75-E"]
[null,null,null,"CAP MODIFICADO POR POLÍMERO 60-85-E"]
[null,null,null,"CAP MODIFICADO POR POLÍMERO 65-90-E"]
[null,null,null,"CIMENTOS ASFÁLTICOS CAP-150-200"]
[null,null,null,"CIMENTOS ASFÁLTICOS CAP-30-45"]
[null,null,null,"CIMENTOS ASFÁLTICOS CAP-50-70"]
[null,null,null,"CIMENTOS ASFÁLTICOS CAP-85-100"]
[null,null,null,"EMULSÃO ASFÁLTICA CATIÔNICA DE RUPTURA CONTROLADA PARA SERVIÇO DE LAMA ASFÁLTICA"]
[null,null,null,"EMULSÃO ASFÁLTICA DE RUPTURA LENTA CATIÔNICA PARA SERVIÇO DE LAMA ASFÁLTICA"]
[null,null,null,"EMULSÃO ASFÁLTICA DE RUPTURA LENTA DE CARGA NEUTRA PARA SERVIÇO DE LAMA ASFÁLTICA"]
[null,null,null,"EMULSÃO ASFÁLTICA PARA SERVIÇO DE IMPRIMAÇÃO"]
[null,null,null,"EMULSÕES ASF. MOD. POR POLÍMEROS RC1C-E"]
[null,null,null,"EMULSÕES ASF. MOD. POR POLÍMEROS RL1C-E"]
[null,null,null,"EMULSÕES ASF. MOD. POR POLÍMEROS RM1C-E"]
[null,null,null,"EMULSÕES ASF. MOD. POR POLÍMEROS RR1C-E"]
[null,null,null,"EMULSÕES ASF. MOD. POR POLÍMEROS RR2C-E"]
[null,null,null,"EMULSÕES ASFÁLTICAS RL-1C"]
[null,null,null,"EMULSÕES ASFÁLTICAS RM-1C"]
[null,null,null,"EMULSÕES ASFÁLTICAS RM-2C"]
[null,null,null,"EMULSÕES ASFÁLTICAS RR-1C"]
[null,null,null,"EMULSÕES ASFÁLTICAS RR-2C"]

{"sheet":"MAT.ASF","index":10,"n_rows":33,"n_cols":23,"rows_kept":33,"cut":false,"hidden":false,"merged":[[20,2,25,2],[27,2,32,2],[19,1,19,22],[26,1,26,22],[11,2,12,2],[11,3,11,6],[11,7,11,8],[11,18,11,19],[13,2,18,2],[7,1,7,19],[8,1,10,22],[2,1,2,8],[3,1,3,8],[4,1,4,8],[5,1,5,8],[6,1,6,22]]}
{"$rows_empty":8}
[null,"PLANILHA RESUMO - MATERIAIS ASFÁLTICOS"]
[]
[]
[null,"DATA-BASE","PRODUTOS","LOCALIDADES",null,null,null,"CUSTO ANP (R$/Kg)",null,"CUSTO ANP","IMPOSTOS DO PRODUTO","CUSTO DO PRODUTO COM IMPOSTOS","DMT's","DMT's","CUSTO DO TRANSPORTE TOTAL","ICMS","ATUALIZAÇÃO DO CUSTO DE TRANSPORTE","CUSTO DO TRANSPORTE RODOVIA PAVIMENTADA COM IMPOSTOS E ATUALIZAÇÃO MONETÁRIA","PEDÁGIO ",null,"TOTAL TRANSPORTE","TOTAL PRODUTO","TOTAL GERAL"]
[null,{"$f":"CAP!H9","v":"2025-06-01"},null,"REFINARIAS","ENDEREÇO","ORIGEM - REFINARIAS / DISTRIBUIDORAS","DESTINO","ESTADO","REGIÃO","R$/t","R$/t","R$/t","KM","KM","R$/t","R$/t","R$/t","R$/t","CUSTO POR EIXO","R$/t","R$/t","R$/t","R$/t"]
[null,1,"CAP 50/70","Refinaria Abreu e Lima","Rodovia PE 60, Km 10 - Ipojuca - PE CEP:55590-000",{"$f":"VLOOKUP($W14,CAP!$B:$AA,7,FALSE)","v":"SÃO JOSÉ DOS CAMPOS - SP"},{"$f":"VLOOKUP($W14,CAP!$B:$AA,8,FALSE)","v":"JANAÚBA - MG"},{"$f":"VLOOKUP($W14,CAP!$B:$AA,9,FALSE)","v":3.5232200022636051},{"$f":"VLOOKUP($W14,CAP!$B:$AA,10,FALSE)","v":3.7003936998971256},{"$f":"VLOOKUP($W14,CAP!$B:$AA,11,FALSE)","v":3523.2200022636052},{"$f":"VLOOKUP($W14,CAP!$B:$AA,12,FALSE)","v":973.55},{"$f":"VLOOKUP($W14,CAP!$B:$AA,13,FALSE)","v":4496.7700022636054},{"$f":"VLOOKUP($W14,CAP!$B$13:$AA$25,14,FALSE)","v":1078},{"$f":"VLOOKUP($W14,'[2]Transporte Cap 50-70'!$B:$AA,15,FALSE)","v":{"$error":"#N/A"}},{"$f":"VLOOKUP($W14,CAP!$B:$AA,18,FALSE)","v":299.67},{"$f":"VLOOKUP($W14,CAP!$B:$AA,19,FALSE)","v":65.78},{"$f":"VLOOKUP($W14,CAP!$B:$AA,20,FALSE)","v":427.3},{"$f":"VLOOKUP($W14,CAP!$B:$AA,21,FALSE)","v":792.75},{"$f":"VLOOKUP($W14,CAP!$B:$AA,22,FALSE)","v":566.4},{"$f":"VLOOKUP($W14,CAP!$B:$AA,23,FALSE)","v":45.311999999999998},{"$f":"VLOOKUP($W14,CAP!$B:$AA,24,FALSE)","v":838.06200000000001},{"$f":"VLOOKUP($W14,CAP!$B:$AA,25,FALSE)","v":4496.7700022636054},{"$f":"SMALL(CAP!$AA$13:$AA$25,1)","v":5334.8320022636053}]
[null,2,null,"Refinaria Potiguar Clara Camarão","Rodovia RN 221, KM 25 - Guamaré - RN CEP:59598-000",{"$f":"VLOOKUP($W15,CAP!$B:$AA,7,FALSE)","v":"BETIM - MG"},{"$f":"VLOOKUP($W15,CAP!$B:$AA,8,FALSE)","v":"JANAÚBA - MG"},{"$f":"VLOOKUP($W15,CAP!$B:$AA,9,FALSE)","v":3.8177312193514235},{"$f":"VLOOKUP($W15,CAP!$B:$AA,10,FALSE)","v":3.7003936998971256},{"$f":"VLOOKUP($W15,CAP!$B:$AA,11,FALSE)","v":3817.7312193514235},{"$f":"VLOOKUP($W15,CAP!$B:$AA,12,FALSE)","v":1054.93},{"$f":"VLOOKUP($W15,CAP!$B:$AA,13,FALSE)","v":4872.6612193514238},{"$f":"VLOOKUP($W15,CAP!$B$13:$AA$25,14,FALSE)","v":556},{"$f":"VLOOKUP($W15,'[2]Transporte Cap 50-70'!$B:$AA,15,FALSE)","v":{"$error":"#N/A"}},{"$f":"VLOOKUP($W15,CAP!$B:$AA,18,FALSE)","v":167.61},{"$f":"VLOOKUP($W15,CAP!$B:$AA,19,FALSE)","v":36.79},{"$f":"VLOOKUP($W15,CAP!$B:$AA,20,FALSE)","v":238.99},{"$f":"VLOOKUP($W15,CAP!$B:$AA,21,FALSE)","v":443.39},{"$f":"VLOOKUP($W15,CAP!$B:$AA,22,FALSE)","v":369},{"$f":"VLOOKUP($W15,CAP!$B:$AA,23,FALSE)","v":29.52},{"$f":"VLOOKUP($W15,CAP!$B:$AA,24,FALSE)","v":472.90999999999997},{"$f":"VLOOKUP($W15,CAP!$B:$AA,25,FALSE)","v":4872.6612193514238},{"$f":"SMALL(CAP!$AA$13:$AA$25,2)","v":5345.5712193514237}]
[null,3,null,"Complexo Petroquímico do Rio de Janeiro (Comperj)","Rodovia Estadual RJ-116 - Km 5,2 - Acesso A-1, s/n, Complemento Sambaetiba - Zona Urbana do 4º Distrito de Itaboraí - RJ CEP:24841-203",{"$f":"VLOOKUP($W16,CAP!$B:$AA,7,FALSE)","v":"MAUÁ - SP"},{"$f":"VLOOKUP($W16,CAP!$B:$AA,8,FALSE)","v":"JANAÚBA - MG"},{"$f":"VLOOKUP($W16,CAP!$B:$AA,9,FALSE)","v":3.5232200022636051},{"$f":"VLOOKUP($W16,CAP!$B:$AA,10,FALSE)","v":3.7003936998971256},{"$f":"VLOOKUP($W16,CAP!$B:$AA,11,FALSE)","v":3523.2200022636052},{"$f":"VLOOKUP($W16,CAP!$B:$AA,12,FALSE)","v":973.55},{"$f":"VLOOKUP($W16,CAP!$B:$AA,13,FALSE)","v":4496.7700022636054},{"$f":"VLOOKUP($W16,CAP!$B$13:$AA$25,14,FALSE)","v":1128},{"$f":"VLOOKUP($W16,'[2]Transporte Cap 50-70'!$B:$AA,15,FALSE)","v":{"$error":"#N/A"}},{"$f":"VLOOKUP($W16,CAP!$B:$AA,18,FALSE)","v":312.32},{"$f":"VLOOKUP($W16,CAP!$B:$AA,19,FALSE)","v":68.55},{"$f":"VLOOKUP($W16,CAP!$B:$AA,20,FALSE)","v":445.33},{"$f":"VLOOKUP($W16,CAP!$B:$AA,21,FALSE)","v":826.2},{"$f":"VLOOKUP($W16,CAP!$B:$AA,22,FALSE)","v":508.2},{"$f":"VLOOKUP($W16,CAP!$B:$AA,23,FALSE)","v":40.655999999999999},{"$f":"VLOOKUP($W16,CAP!$B:$AA,24,FALSE)","v":866.85599999999999},{"$f":"VLOOKUP($W16,CAP!$B:$AA,25,FALSE)","v":4496.7700022636054},{"$f":"SMALL(CAP!$AA$13:$AA$25,3)","v":5363.6260022636052}]
[null,4,null,null,null,{"$f":"VLOOKUP($W17,CAP!$B:$AA,7,FALSE)","v":"DUQUE DE CAXIAS - RJ"},{"$f":"VLOOKUP($W17,CAP!$B:$AA,8,FALSE)","v":"JANAÚBA - MG"},{"$f":"VLOOKUP($W17,CAP!$B:$AA,9,FALSE)","v":3.6141077341373462},{"$f":"VLOOKUP($W17,CAP!$B:$AA,10,FALSE)","v":3.7003936998971256},{"$f":"VLOOKUP($W17,CAP!$B:$AA,11,FALSE)","v":3614.1077341373461},{"$f":"VLOOKUP($W17,CAP!$B:$AA,12,FALSE)","v":998.67},{"$f":"VLOOKUP($W17,CAP!$B:$AA,13,FALSE)","v":4612.7777341373458},{"$f":"VLOOKUP($W17,CAP!$B$13:$AA$25,14,FALSE)","v":960},{"$f":"VLOOKUP($W17,'[2]Transporte Cap 50-70'!$B:$AA,15,FALSE)","v":{"$error":"#N/A"}},{"$f":"VLOOKUP($W17,CAP!$B:$AA,18,FALSE)","v":269.82},{"$f":"VLOOKUP($W17,CAP!$B:$AA,19,FALSE)","v":59.22},{"$f":"VLOOKUP($W17,CAP!$B:$AA,20,FALSE)","v":384.72},{"$f":"VLOOKUP($W17,CAP!$B:$AA,21,FALSE)","v":713.76},{"$f":"VLOOKUP($W17,CAP!$B:$AA,22,FALSE)","v":743.4},{"$f":"VLOOKUP($W17,CAP!$B:$AA,23,FALSE)","v":59.472000000000001},{"$f":"VLOOKUP($W17,CAP!$B:$AA,24,FALSE)","v":773.23199999999997},{"$f":"VLOOKUP($W17,CAP!$B:$AA,25,FALSE)","v":4612.7777341373458},{"$f":"SMALL(CAP!$AA$13:$AA$25,4)","v":5386.0097341373457}]
[null,5,null,null,null,{"$f":"VLOOKUP($W18,CAP!$B:$AA,7,FALSE)","v":"PAULÍNIA - SP"},{"$f":"VLOOKUP($W18,CAP!$B:$AA,8,FALSE)","v":"JANAÚBA - MG"},{"$f":"VLOOKUP($W18,CAP!$B:$AA,9,FALSE)","v":3.5232200022636051},{"$f":"VLOOKUP($W18,CAP!$B:$AA,10,FALSE)","v":3.7003936998971256},{"$f":"VLOOKUP($W18,CAP!$B:$AA,11,FALSE)","v":3523.2200022636052},{"$f":"VLOOKUP($W18,CAP!$B:$AA,12,FALSE)","v":973.55},{"$f":"VLOOKUP($W18,CAP!$B:$AA,13,FALSE)","v":4496.7700022636054},{"$f":"VLOOKUP($W18,CAP!$B$13:$AA$25,14,FALSE)","v":1141},{"$f":"VLOOKUP($W18,'[2]Transporte Cap 50-70'!$B:$AA,15,FALSE)","v":{"$error":"#N/A"}},{"$f":"VLOOKUP($W18,CAP!$B:$AA,18,FALSE)","v":315.61},{"$f":"VLOOKUP($W18,CAP!$B:$AA,19,FALSE)","v":69.28},{"$f":"VLOOKUP($W18,CAP!$B:$AA,20,FALSE)","v":450.03},{"$f":"VLOOKUP($W18,CAP!$B:$AA,21,FALSE)","v":834.92},{"$f":"VLOOKUP($W18,CAP!$B:$AA,22,FALSE)","v":730.8},{"$f":"VLOOKUP($W18,CAP!$B:$AA,23,FALSE)","v":58.463999999999999},{"$f":"VLOOKUP($W18,CAP!$B:$AA,24,FALSE)","v":893.38400000000001},{"$f":"VLOOKUP($W18,CAP!$B:$AA,25,FALSE)","v":4496.7700022636054},{"$f":"SMALL(CAP!$AA$13:$AA$25,5)","v":5390.1540022636054}]
[null,6,null,null,null,{"$f":"VLOOKUP($W19,CAP!$B:$AA,7,FALSE)","v":"CUBATÃO - SP"},{"$f":"VLOOKUP($W19,CAP!$B:$AA,8,FALSE)","v":"JANAÚBA - MG"},{"$f":"VLOOKUP($W19,CAP!$B:$AA,9,FALSE)","v":3.5232200022636051},{"$f":"VLOOKUP($W19,CAP!$B:$AA,10,FALSE)","v":3.7003936998971256},{"$f":"VLOOKUP($W19,CAP!$B:$AA,11,FALSE)","v":3523.2200022636052},{"$f":"VLOOKUP($W19,CAP!$B:$AA,12,FALSE)","v":973.55},{"$f":"VLOOKUP($W19,CAP!$B:$AA,13,FALSE)","v":4496.7700022636054},{"$f":"VLOOKUP($W19,CAP!$B$13:$AA$25,14,FALSE)","v":1170},{"$f":"VLOOKUP($W19,'[2]Transporte Cap 50-70'!$B:$AA,15,FALSE)","v":{"$error":"#N/A"}},{"$f":"VLOOKUP($W19,CAP!$B:$AA,18,FALSE)","v":322.95},{"$f":"VLOOKUP($W19,CAP!$B:$AA,19,FALSE)","v":70.89},{"$f":"VLOOKUP($W19,CAP!$B:$AA,20,FALSE)","v":460.49},{"$f":"VLOOKUP($W19,CAP!$B:$AA,21,FALSE)","v":854.32999999999993},{"$f":"VLOOKUP($W19,CAP!$B:$AA,22,FALSE)","v":508.2},{"$f":"VLOOKUP($W19,CAP!$B:$AA,23,FALSE)","v":40.655999999999999},{"$f":"VLOOKUP($W19,CAP!$B:$AA,24,FALSE)","v":894.98599999999988},{"$f":"VLOOKUP($W19,CAP!$B:$AA,25,FALSE)","v":4496.7700022636054},{"$f":"SMALL(CAP!$AA$13:$AA$25,6)","v":5391.7560022636053}]
[]
[null,1,"EMULSÃO ASFÁLTICA PARA IMPRIMAÇÃO (EAI)","Refinaria Abreu e Lima","Rodovia PE 60, Km 10 - Ipojuca - PE CEP:55590-000",{"$f":"VLOOKUP($W21,EAI!$B$13:$AA$24,7,FALSE)","v":"BETIM - MG"},{"$f":"VLOOKUP($W21,EAI!$B$13:$AA$24,8,FALSE)","v":"MATO VERDE - MG"},{"$f":"VLOOKUP($W21,EAI!$B$13:$AA$24,9,FALSE)","v":2.1335513152761831},{"$f":"VLOOKUP($W21,EAI!$B$13:$AA$24,10,FALSE)","v":2.3107589003236337},{"$f":"VLOOKUP($W21,EAI!$B$13:$AA$24,11,FALSE)","v":2133.5513152761832},{"$f":"VLOOKUP($W21,EAI!$B$13:$AA$24,12,FALSE)","v":589.54999999999995},{"$f":"VLOOKUP($W21,EAI!$B$13:$AA$24,13,FALSE)","v":2723.1013152761834},{"$f":"VLOOKUP($W21,EAI!$B$13:$AA$24,14,FALSE)","v":643},{"$f":"VLOOKUP($W21,'[2]Transporte CM-30'!$B$13:$AA$25,15,FALSE)","v":{"$error":"#N/A"}},{"$f":"VLOOKUP($W21,EAI!$B$13:$AA$24,18,FALSE)","v":189.62},{"$f":"VLOOKUP($W21,EAI!$B$13:$AA$24,19,FALSE)","v":41.62},{"$f":"VLOOKUP($W21,EAI!$B$13:$AA$24,20,FALSE)","v":270.37},{"$f":"VLOOKUP($W21,EAI!$B$13:$AA$24,21,FALSE)","v":501.61},{"$f":"VLOOKUP($W21,EAI!$B$13:$AA$24,22,FALSE)","v":369},{"$f":"VLOOKUP($W21,EAI!$B$13:$AA$24,23,FALSE)","v":26.357142857142858},{"$f":"VLOOKUP($W21,EAI!$B$13:$AA$24,24,FALSE)","v":527.9671428571429},{"$f":"VLOOKUP($W21,EAI!$B:$AA,25,FALSE)","v":2723.1013152761834},{"$f":"SMALL(EAI!$AA$13:$AA$24,1)","v":3251.0684581333262}]
[null,2,null,"Refinaria Potiguar Clara Camarão","Rodovia RN 221, KM 25 - Guamaré - RN CEP:59598-000",{"$f":"VLOOKUP($W22,EAI!$B$13:$AA$24,7,FALSE)","v":"SÃO FRANCISCO DO CONDE - BA"},{"$f":"VLOOKUP($W22,EAI!$B$13:$AA$24,8,FALSE)","v":"MATO VERDE - MG"},{"$f":"VLOOKUP($W22,EAI!$B$13:$AA$24,9,FALSE)","v":"-"},{"$f":"VLOOKUP($W22,EAI!$B$13:$AA$24,10,FALSE)","v":2.3216290573694685},{"$f":"VLOOKUP($W22,EAI!$B$13:$AA$24,11,FALSE)","v":2321.6290573694682},{"$f":"VLOOKUP($W22,EAI!$B$13:$AA$24,12,FALSE)","v":641.52},{"$f":"VLOOKUP($W22,EAI!$B$13:$AA$24,13,FALSE)","v":2963.1490573694682},{"$f":"VLOOKUP($W22,EAI!$B$13:$AA$24,14,FALSE)","v":788},{"$f":"VLOOKUP($W22,'[2]Transporte CM-30'!$B$13:$AA$25,15,FALSE)","v":{"$error":"#N/A"}},{"$f":"VLOOKUP($W22,EAI!$B$13:$AA$24,18,FALSE)","v":226.3},{"$f":"VLOOKUP($W22,EAI!$B$13:$AA$24,19,FALSE)","v":49.67},{"$f":"VLOOKUP($W22,EAI!$B$13:$AA$24,20,FALSE)","v":322.67},{"$f":"VLOOKUP($W22,EAI!$B$13:$AA$24,21,FALSE)","v":598.6400000000001},{"$f":"VLOOKUP($W22,EAI!$B$13:$AA$24,22,FALSE)","v":167.4},{"$f":"VLOOKUP($W22,EAI!$B$13:$AA$24,23,FALSE)","v":11.957142857142857},{"$f":"VLOOKUP($W22,EAI!$B$13:$AA$24,24,FALSE)","v":610.59714285714301},{"$f":"VLOOKUP($W22,EAI!$B:$AA,25,FALSE)","v":2963.1490573694682},{"$f":"SMALL(EAI!$AA$13:$AA$24,2)","v":3573.7462002266111}]
[null,3,null,"Complexo Petroquímico do Rio de Janeiro (Comperj)","Rodovia Estadual RJ-116 - Km 5,2 - Acesso A-1, s/n, Complemento Sambaetiba - Zona Urbana do 4º Distrito de Itaboraí - RJ CEP:24841-203",{"$f":"VLOOKUP($W23,EAI!$B$13:$AA$24,7,FALSE)","v":"DUQUE DE CAXIAS - RJ"},{"$f":"VLOOKUP($W23,EAI!$B$13:$AA$24,8,FALSE)","v":"MATO VERDE - MG"},{"$f":"VLOOKUP($W23,EAI!$B$13:$AA$24,9,FALSE)","v":"-"},{"$f":"VLOOKUP($W23,EAI!$B$13:$AA$24,10,FALSE)","v":2.3107589003236337},{"$f":"VLOOKUP($W23,EAI!$B$13:$AA$24,11,FALSE)","v":2310.758900323634},{"$f":"VLOOKUP($W23,EAI!$B$13:$AA$24,12,FALSE)","v":638.52},{"$f":"VLOOKUP($W23,EAI!$B$13:$AA$24,13,FALSE)","v":2949.2789003236339},{"$f":"VLOOKUP($W23,EAI!$B$13:$AA$24,14,FALSE)","v":1042},{"$f":"VLOOKUP($W23,'[2]Transporte CM-30'!$B$13:$AA$25,15,FALSE)","v":{"$error":"#N/A"}},{"$f":"VLOOKUP($W23,EAI!$B$13:$AA$24,18,FALSE)","v":290.57},{"$f":"VLOOKUP($W23,EAI!$B$13:$AA$24,19,FALSE)","v":63.78},{"$f":"VLOOKUP($W23,EAI!$B$13:$AA$24,20,FALSE)","v":414.32},{"$f":"VLOOKUP($W23,EAI!$B$13:$AA$24,21,FALSE)","v":768.67000000000007},{"$f":"VLOOKUP($W23,EAI!$B$13:$AA$24,22,FALSE)","v":743.4},{"$f":"VLOOKUP($W23,EAI!$B$13:$AA$24,23,FALSE)","v":53.1},{"$f":"VLOOKUP($W23,EAI!$B$13:$AA$24,24,FALSE)","v":821.7700000000001},{"$f":"VLOOKUP($W23,EAI!$B:$AA,25,FALSE)","v":2949.2789003236339},{"$f":"SMALL(EAI!$AA$13:$AA$24,3)","v":3771.0489003236339}]
[null,4,null,null,null,{"$f":"VLOOKUP($W24,EAI!$B$13:$AA$24,7,FALSE)","v":"IPOJUCA - PE"},{"$f":"VLOOKUP($W24,EAI!$B$13:$AA$24,8,FALSE)","v":"MATO VERDE - MG"},{"$f":"VLOOKUP($W24,EAI!$B$13:$AA$24,9,FALSE)","v":"-"},{"$f":"VLOOKUP($W24,EAI!$B$13:$AA$24,10,FALSE)","v":2.3216290573694685},{"$f":"VLOOKUP($W24,EAI!$B$13:$AA$24,11,FALSE)","v":2321.6290573694682},{"$f":"VLOOKUP($W24,EAI!$B$13:$AA$24,12,FALSE)","v":641.52},{"$f":"VLOOKUP($W24,EAI!$B$13:$AA$24,13,FALSE)","v":2963.1490573694682},{"$f":"VLOOKUP($W24,EAI!$B$13:$AA$24,14,FALSE)","v":1471},{"$f":"VLOOKUP($W24,'[2]Transporte CM-30'!$B$13:$AA$25,15,FALSE)","v":{"$error":"#N/A"}},{"$f":"VLOOKUP($W24,EAI!$B$13:$AA$24,18,FALSE)","v":399.1},{"$f":"VLOOKUP($W24,EAI!$B$13:$AA$24,19,FALSE)","v":87.6},{"$f":"VLOOKUP($W24,EAI!$B$13:$AA$24,20,FALSE)","v":569.07000000000005},{"$f":"VLOOKUP($W24,EAI!$B$13:$AA$24,21,FALSE)","v":1055.77},{"$f":"VLOOKUP($W24,EAI!$B$13:$AA$24,22,FALSE)","v":146.4},{"$f":"VLOOKUP($W24,EAI!$B$13:$AA$24,23,FALSE)","v":10.457142857142857},{"$f":"VLOOKUP($W24,EAI!$B$13:$AA$24,24,FALSE)","v":1066.2271428571428},{"$f":"VLOOKUP($W24,EAI!$B:$AA,25,FALSE)","v":2963.1490573694682},{"$f":"SMALL(EAI!$AA$13:$AA$24,4)","v":4029.3762002266112}]
[null,5,null,null,null,{"$f":"VLOOKUP($W25,EAI!$B$13:$AA$24,7,FALSE)","v":"MAUÁ - SP"},{"$f":"VLOOKUP($W25,EAI!$B$13:$AA$24,8,FALSE)","v":"MATO VERDE - MG"},{"$f":"VLOOKUP($W25,EAI!$B$13:$AA$24,9,FALSE)","v":2.5447125410720566},{"$f":"VLOOKUP($W25,EAI!$B$13:$AA$24,10,FALSE)","v":2.3107589003236337},{"$f":"VLOOKUP($W25,EAI!$B$13:$AA$24,11,FALSE)","v":2544.7125410720564},{"$f":"VLOOKUP($W25,EAI!$B$13:$AA$24,12,FALSE)","v":703.17},{"$f":"VLOOKUP($W25,EAI!$B$13:$AA$24,13,FALSE)","v":3247.8825410720565},{"$f":"VLOOKUP($W25,EAI!$B$13:$AA$24,14,FALSE)","v":1217},{"$f":"VLOOKUP($W25,'[2]Transporte CM-30'!$B$13:$AA$25,15,FALSE)","v":{"$error":"#N/A"}},{"$f":"VLOOKUP($W25,EAI!$B$13:$AA$24,18,FALSE)","v":334.84},{"$f":"VLOOKUP($W25,EAI!$B$13:$AA$24,19,FALSE)","v":73.5},{"$f":"VLOOKUP($W25,EAI!$B$13:$AA$24,20,FALSE)","v":477.45},{"$f":"VLOOKUP($W25,EAI!$B$13:$AA$24,21,FALSE)","v":885.79},{"$f":"VLOOKUP($W25,EAI!$B$13:$AA$24,22,FALSE)","v":508.2},{"$f":"VLOOKUP($W25,EAI!$B$13:$AA$24,23,FALSE)","v":36.299999999999997},{"$f":"VLOOKUP($W25,EAI!$B$13:$AA$24,24,FALSE)","v":922.08999999999992},{"$f":"VLOOKUP($W25,EAI!$B:$AA,25,FALSE)","v":3247.8825410720565},{"$f":"SMALL(EAI!$AA$13:$AA$24,5)","v":4169.9725410720566}]
[null,6,null,null,null,{"$f":"VLOOKUP($W26,EAI!$B$13:$AA$24,7,FALSE)","v":"FORTALEZA - CE"},{"$f":"VLOOKUP($W26,EAI!$B$13:$AA$24,8,FALSE)","v":"MATO VERDE - MG"},{"$f":"VLOOKUP($W26,EAI!$B$13:$AA$24,9,FALSE)","v":2.2774374001948807},{"$f":"VLOOKUP($W26,EAI!$B$13:$AA$24,10,FALSE)","v":2.3216290573694685},{"$f":"VLOOKUP($W26,EAI!$B$13:$AA$24,11,FALSE)","v":2277.4374001948809},{"$f":"VLOOKUP($W26,EAI!$B$13:$AA$24,12,FALSE)","v":629.30999999999995},{"$f":"VLOOKUP($W26,EAI!$B$13:$AA$24,13,FALSE)","v":2906.7474001948808},{"$f":"VLOOKUP($W26,EAI!$B$13:$AA$24,14,FALSE)","v":1805},{"$f":"VLOOKUP($W26,'[2]Transporte CM-30'!$B$13:$AA$25,15,FALSE)","v":{"$error":"#N/A"}},{"$f":"VLOOKUP($W26,EAI!$B$13:$AA$24,18,FALSE)","v":483.6},{"$f":"VLOOKUP($W26,EAI!$B$13:$AA$24,19,FALSE)","v":106.15},{"$f":"VLOOKUP($W26,EAI!$B$13:$AA$24,20,FALSE)","v":689.56},{"$f":"VLOOKUP($W26,EAI!$B$13:$AA$24,21,FALSE)","v":1279.31},{"$f":"VLOOKUP($W26,EAI!$B$13:$AA$24,22,FALSE)","v":146.4},{"$f":"VLOOKUP($W26,EAI!$B$13:$AA$24,23,FALSE)","v":10.457142857142857},{"$f":"VLOOKUP($W26,EAI!$B$13:$AA$24,24,FALSE)","v":1289.7671428571427},{"$f":"VLOOKUP($W26,EAI!$B:$AA,25,FALSE)","v":2906.7474001948808},{"$f":"SMALL(EAI!$AA$13:$AA$24,6)","v":4196.5145430520233}]
[]
[null,1,"RR1-C","Refinaria Abreu e Lima","Rodovia PE 60, Km 10 - Ipojuca - PE CEP:55590-000",{"$f":"VLOOKUP($W28,'RR-1C'!$B:$AA,7,FALSE)","v":"SARZEDO - MG"},{"$f":"VLOOKUP($W28,'RR-1C'!$B:$AA,8,FALSE)","v":"MATO VERDE - MG"},{"$f":"VLOOKUP($W28,'RR-1C'!$B:$AA,9,FALSE)","v":2.708526225501489},{"$f":"VLOOKUP($W28,'RR-1C'!$B:$AA,10,FALSE)","v":2.8245014676569142},{"$f":"VLOOKUP($W28,'RR-1C'!$B:$AA,11,FALSE)","v":2708.5262255014891},{"$f":"VLOOKUP($W28,'RR-1C'!$B:$AA,12,FALSE)","v":748.43},{"$f":"VLOOKUP($W28,'RR-1C'!$B:$AA,13,FALSE)","v":3456.9562255014889},{"$f":"VLOOKUP($W28,'RR-1C'!$B:$AA,14,FALSE)","v":653},{"$f":"VLOOKUP($W28,'[2]Transporte RR-1C'!$B:$AA,15,FALSE)","v":{"$error":"#N/A"}},{"$f":"VLOOKUP($W28,'RR-1C'!$B:$AA,18,FALSE)","v":192.15},{"$f":"VLOOKUP($W28,'RR-1C'!$B:$AA,19,FALSE)","v":42.17},{"$f":"VLOOKUP($W28,'RR-1C'!$B:$AA,20,FALSE)","v":273.97000000000003},{"$f":"VLOOKUP($W28,'RR-1C'!$B:$AA,21,FALSE)","v":508.29},{"$f":"VLOOKUP($W28,'RR-1C'!$B:$AA,22,FALSE)","v":369},{"$f":"VLOOKUP($W28,'RR-1C'!$B:$AA,23,FALSE)","v":82},{"$f":"VLOOKUP($W28,'RR-1C'!$B:$AA,24,FALSE)","v":590.29},{"$f":"VLOOKUP($W28,'RR-1C'!$B:$AA,25,FALSE)","v":3456.9562255014889},{"$f":"SMALL('RR-1C'!$AA$13:$AA$27,1)","v":4047.2462255014889}]
[null,2,null,"Refinaria Potiguar Clara Camarão","Rodovia RN 221, KM 25 - Guamaré - RN CEP:59598-000",{"$f":"VLOOKUP($W29,'RR-1C'!$B:$AA,7,FALSE)","v":"UBERLANDIA - MG"},{"$f":"VLOOKUP($W29,'RR-1C'!$B:$AA,8,FALSE)","v":"MATO VERDE - MG"},{"$f":"VLOOKUP($W29,'RR-1C'!$B:$AA,9,FALSE)","v":2.708526225501489},{"$f":"VLOOKUP($W29,'RR-1C'!$B:$AA,10,FALSE)","v":2.8245014676569142},{"$f":"VLOOKUP($W29,'RR-1C'!$B:$AA,11,FALSE)","v":2708.5262255014891},{"$f":"VLOOKUP($W29,'RR-1C'!$B:$AA,12,FALSE)","v":748.43},{"$f":"VLOOKUP($W29,'RR-1C'!$B:$AA,13,FALSE)","v":3456.9562255014889},{"$f":"VLOOKUP($W29,'RR-1C'!$B:$AA,14,FALSE)","v":842},{"$f":"VLOOKUP($W29,'[2]Transporte RR-1C'!$B:$AA,15,FALSE)","v":{"$error":"#N/A"}},{"$f":"VLOOKUP($W29,'RR-1C'!$B:$AA,18,FALSE)","v":239.97},{"$f":"VLOOKUP($W29,'RR-1C'!$B:$AA,19,FALSE)","v":52.67},{"$f":"VLOOKUP($W29,'RR-1C'!$B:$AA,20,FALSE)","v":342.16},{"$f":"VLOOKUP($W29,'RR-1C'!$B:$AA,21,FALSE)","v":634.79999999999995},{"$f":"VLOOKUP($W29,'RR-1C'!$B:$AA,22,FALSE)","v":152.4},{"$f":"VLOOKUP($W29,'RR-1C'!$B:$AA,23,FALSE)","v":33.866666666666667},{"$f":"VLOOKUP($W29,'RR-1C'!$B:$AA,24,FALSE)","v":668.66666666666663},{"$f":"VLOOKUP($W29,'RR-1C'!$B:$AA,25,FALSE)","v":3456.9562255014889},{"$f":"SMALL('RR-1C'!$AA$13:$AA$27,2)","v":4125.6228921681559}]
[null,3,null,"Complexo Petroquímico do Rio de Janeiro (Comperj)","Rodovia Estadual RJ-116 - Km 5,2 - Acesso A-1, s/n, Complemento Sambaetiba - Zona Urbana do 4º Distrito de Itaboraí - RJ CEP:24841-203",{"$f":"VLOOKUP($W30,'RR-1C'!$B:$AA,7,FALSE)","v":"BRASÍLIA - DF"},{"$f":"VLOOKUP($W30,'RR-1C'!$B:$AA,8,FALSE)","v":"MATO VERDE - MG"},{"$f":"VLOOKUP($W30,'RR-1C'!$B:$AA,9,FALSE)","v":"-"},{"$f":"VLOOKUP($W30,'RR-1C'!$B:$AA,10,FALSE)","v":2.6927881485086433},{"$f":"VLOOKUP($W30,'RR-1C'!$B:$AA,11,FALSE)","v":2692.7881485086432},{"$f":"VLOOKUP($W30,'RR-1C'!$B:$AA,12,FALSE)","v":744.08},{"$f":"VLOOKUP($W30,'RR-1C'!$B:$AA,13,FALSE)","v":3436.8681485086431},{"$f":"VLOOKUP($W30,'RR-1C'!$B:$AA,14,FALSE)","v":909},{"$f":"VLOOKUP($W30,'[2]Transporte RR-1C'!$B:$AA,15,FALSE)","v":{"$error":"#N/A"}},{"$f":"VLOOKUP($W30,'RR-1C'!$B:$AA,18,FALSE)","v":256.92},{"$f":"VLOOKUP($W30,'RR-1C'!$B:$AA,19,FALSE)","v":56.39},{"$f":"VLOOKUP($W30,'RR-1C'!$B:$AA,20,FALSE)","v":366.33},{"$f":"VLOOKUP($W30,'RR-1C'!$B:$AA,21,FALSE)","v":679.64},{"$f":"VLOOKUP($W30,'RR-1C'!$B:$AA,22,FALSE)","v":243.6},{"$f":"VLOOKUP($W30,'RR-1C'!$B:$AA,23,FALSE)","v":54.133333333333333},{"$f":"VLOOKUP($W30,'RR-1C'!$B:$AA,24,FALSE)","v":733.77333333333331},{"$f":"VLOOKUP($W30,'RR-1C'!$B:$AA,25,FALSE)","v":3436.8681485086431},{"$f":"SMALL('RR-1C'!$AA$13:$AA$27,3)","v":4170.6414818419762}]
[null,4,null,"Refinaria Abreu e Lima","Rodovia PE 60, Km 10 - Ipojuca - PE CEP:55590-000",{"$f":"VLOOKUP($W31,'RR-1C'!$B:$AA,7,FALSE)","v":"ANÁPOLIS - GO"},{"$f":"VLOOKUP($W31,'RR-1C'!$B:$AA,8,FALSE)","v":"MATO VERDE - MG"},{"$f":"VLOOKUP($W31,'RR-1C'!$B:$AA,9,FALSE)","v":2.6561374219911511},{"$f":"VLOOKUP($W31,'RR-1C'!$B:$AA,10,FALSE)","v":2.6927881485086433},{"$f":"VLOOKUP($W31,'RR-1C'!$B:$AA,11,FALSE)","v":2656.1374219911513},{"$f":"VLOOKUP($W31,'RR-1C'!$B:$AA,12,FALSE)","v":733.96},{"$f":"VLOOKUP($W31,'RR-1C'!$B:$AA,13,FALSE)","v":3390.0974219911514},{"$f":"VLOOKUP($W31,'RR-1C'!$B:$AA,14,FALSE)","v":1013},{"$f":"VLOOKUP($W31,'[2]Transporte RR-1C'!$B:$AA,15,FALSE)","v":{"$error":"#N/A"}},{"$f":"VLOOKUP($W31,'RR-1C'!$B:$AA,18,FALSE)","v":283.23},{"$f":"VLOOKUP($W31,'RR-1C'!$B:$AA,19,FALSE)","v":62.17},{"$f":"VLOOKUP($W31,'RR-1C'!$B:$AA,20,FALSE)","v":403.85},{"$f":"VLOOKUP($W31,'RR-1C'!$B:$AA,21,FALSE)","v":749.25},{"$f":"VLOOKUP($W31,'RR-1C'!$B:$AA,22,FALSE)","v":285},{"$f":"VLOOKUP($W31,'RR-1C'!$B:$AA,23,FALSE)","v":63.333333333333336},{"$f":"VLOOKUP($W31,'RR-1C'!$B:$AA,24,FALSE)","v":812.58333333333337},{"$f":"VLOOKUP($W31,'RR-1C'!$B:$AA,25,FALSE)","v":3390.0974219911514},{"$f":"SMALL('RR-1C'!$AA$13:$AA$27,4)","v":4202.6807553244844}]
[null,5,null,"Refinaria Potiguar Clara Camarão","Rodovia RN 221, KM 25 - Guamaré - RN CEP:59598-000",{"$f":"VLOOKUP($W32,'RR-1C'!$B:$AA,7,FALSE)","v":"DUQUE DE CAXIAS - RJ"},{"$f":"VLOOKUP($W32,'RR-1C'!$B:$AA,8,FALSE)","v":"MATO VERDE - MG"},{"$f":"VLOOKUP($W32,'RR-1C'!$B:$AA,9,FALSE)","v":2.6238667599961412},{"$f":"VLOOKUP($W32,'RR-1C'!$B:$AA,10,FALSE)","v":2.8245014676569142},{"$f":"VLOOKUP($W32,'RR-1C'!$B:$AA,11,FALSE)","v":2623.8667599961414},{"$f":"VLOOKUP($W32,'RR-1C'!$B:$AA,12,FALSE)","v":725.04},{"$f":"VLOOKUP($W32,'RR-1C'!$B:$AA,13,FALSE)","v":3348.9067599961413},{"$f":"VLOOKUP($W32,'RR-1C'!$B:$AA,14,FALSE)","v":960},{"$f":"VLOOKUP($W32,'[2]Transporte RR-1C'!$B:$AA,15,FALSE)","v":{"$error":"#N/A"}},{"$f":"VLOOKUP($W32,'RR-1C'!$B:$AA,18,FALSE)","v":269.82},{"$f":"VLOOKUP($W32,'RR-1C'!$B:$AA,19,FALSE)","v":59.22},{"$f":"VLOOKUP($W32,'RR-1C'!$B:$AA,20,FALSE)","v":384.72},{"$f":"VLOOKUP($W32,'RR-1C'!$B:$AA,21,FALSE)","v":713.76},{"$f":"VLOOKUP($W32,'RR-1C'!$B:$AA,22,FALSE)","v":743.4},{"$f":"VLOOKUP($W32,'RR-1C'!$B:$AA,23,FALSE)","v":165.2},{"$f":"VLOOKUP($W32,'RR-1C'!$B:$AA,24,FALSE)","v":878.96},{"$f":"VLOOKUP($W32,'RR-1C'!$B:$AA,25,FALSE)","v":3348.9067599961413},{"$f":"SMALL('RR-1C'!$AA$13:$AA$27,5)","v":4227.8667599961409}]
[null,6,null,"Complexo Petroquímico do Rio de Janeiro (Comperj)","Rodovia Estadual RJ-116 - Km 5,2 - Acesso A-1, s/n, Complemento Sambaetiba - Zona Urbana do 4º Distrito de Itaboraí - RJ CEP:24841-203",{"$f":"VLOOKUP($W33,'RR-1C'!$B:$AA,7,FALSE)","v":"APARECIDA DE GOIANIA - GO"},{"$f":"VLOOKUP($W33,'RR-1C'!$B:$AA,8,FALSE)","v":"MATO VERDE - MG"},{"$f":"VLOOKUP($W33,'RR-1C'!$B:$AA,9,FALSE)","v":2.6561374219911511},{"$f":"VLOOKUP($W33,'RR-1C'!$B:$AA,10,FALSE)","v":2.6927881485086433},{"$f":"VLOOKUP($W33,'RR-1C'!$B:$AA,11,FALSE)","v":2656.1374219911513},{"$f":"VLOOKUP($W33,'RR-1C'!$B:$AA,12,FALSE)","v":733.96},{"$f":"VLOOKUP($W33,'RR-1C'!$B:$AA,13,FALSE)","v":3390.0974219911514},{"$f":"VLOOKUP($W33,'RR-1C'!$B:$AA,14,FALSE)","v":1065},{"$f":"VLOOKUP($W33,'[2]Transporte RR-1C'!$B:$AA,15,FALSE)","v":{"$error":"#N/A"}},{"$f":"VLOOKUP($W33,'RR-1C'!$B:$AA,18,FALSE)","v":296.38},{"$f":"VLOOKUP($W33,'RR-1C'!$B:$AA,19,FALSE)","v":65.05},{"$f":"VLOOKUP($W33,'RR-1C'!$B:$AA,20,FALSE)","v":422.6},{"$f":"VLOOKUP($W33,'RR-1C'!$B:$AA,21,FALSE)","v":784.03},{"$f":"VLOOKUP($W33,'RR-1C'!$B:$AA,22,FALSE)","v":243.6},{"$f":"VLOOKUP($W33,'RR-1C'!$B:$AA,23,FALSE)","v":54.133333333333333},{"$f":"VLOOKUP($W33,'RR-1C'!$B:$AA,24,FALSE)","v":838.1633333333333},{"$f":"VLOOKUP($W33,'RR-1C'!$B:$AA,25,FALSE)","v":3390.0974219911514},{"$f":"SMALL('RR-1C'!$AA$13:$AA$27,6)","v":4228.2607553244843}]