{"text_format":"2","workbook":"xlsx","n_sheets":5,"sheets":["ORÇAMENTO","CPU-SERV","AUX-VEIC.","BDI SERV","CRONOGRAMA"],"not_rendered":{"charts":0,"images":1,"macros":0,"external_links":0,"defined_names":5,"comments":2,"pivot_tables":0},"unopened":[],"bounds":{"document_bytes":16777216,"sheet_cells":100000,"run_cost":"one","rows_first":2000,"rows_last":500,"rows_between":2000,"halvings":0,"cell_chars":16384,"cell_head_chars":4096},"cells_cut":0,"cells_raw":0,"read":"whole","date_system":"1900"}

{"sheet":"ORÇAMENTO","index":0,"n_rows":34,"n_cols":12,"rows_kept":34,"cut":false,"hidden":false,"merged":[[33,1,33,4],[0,0,8,0],[0,4,0,11],[1,4,1,11],[2,4,2,11],[7,1,7,11],[4,2,4,7],[5,2,5,7],[4,8,4,10],[5,8,5,10],[6,8,6,10],[6,1,6,4]]}
["<---- NUMERAR SERVIÇOS PARA CPU",null,null,null,"Ministério do Desenvolvimento Regional"]
[{"$nulls":4},"Companhia de Desenvolvimento dos Vales do São Francisco e do Parnaíba"]
[{"$nulls":4},"1ª Superintendência Regional"]
[]
[null,"OBRA: "," PAVIMENTAÇÃO EM BLOQUETE SEXTAVADOS - RUAS DIVERSAS - VARGEM GRANDE DO RIO PARDO / MG",{"$nulls":5},"BDI Serviços (%):",null,null,{"$f":"'BDI SERV'!E26","v":25.48}]
[null,"DATA:"," JUNHO/2025",{"$nulls":5},"BDI Diferenciado Serviços (%):",null,null,15]
[null,"PRAZO DE EXECUÇÃO:    180 DIAS",{"$nulls":6},"BDI Fornecimentos (%):",null,null,15]
[null,"PLANILHA DE ORÇAMENTAÇÃO"]
[null,"ITEM","CÓDIGO","FONTE","DISCRIMINAÇÃO","TIPO","UNID.","QUANT.","VR.UNIT.S/BDI","PR. UNIT.C/BDI","C. TOT.S/BDI","P. TOT.C/BDI"]
["A",1,null,null,"SERVIÇOS PRELIMINARES ",{"$nulls":5},{"$f":"SUM(K11:K16)","v":161472.41999999998},{"$f":"SUM(L11:L16)","v":202529.03999999998}]
[1,"1.1","CPU.1","CODEVASF","MOBILIZAÇÃO E DESMOBILIZAÇÃO","SERV","GL",1,{"$f":"VLOOKUP(A11,'CPU-SERV'!A:K,11,0)","v":13307.38},{"$f":"TRUNC(_xlfn.IFS(F11=\"SERV\",I11*(1+$L$5/100),F11=\"SERV DIF\",I11*(1+$L$6/100),F11=\"FORN\",I11*(1+$L$7/100)),2)","v":16698.099999999999},{"$f":"TRUNC(H11*I11,2)","v":13307.38},{"$f":"TRUNC(H11*J11,2)","v":16698.099999999999}]
[2,"1.2","CPU.2","CODEVASF","ADMINISTRAÇÃO LOCAL","SERV","GL",1,{"$f":"VLOOKUP(A12,'CPU-SERV'!A:K,11,0)","v":93721.7},{"$f":"TRUNC(_xlfn.IFS(F12=\"SERV\",I12*(1+$L$5/100),F12=\"SERV DIF\",I12*(1+$L$6/100),F12=\"FORN\",I12*(1+$L$7/100)),2)","v":117601.98},{"$f":"TRUNC(H12*I12,2)","v":93721.7},{"$f":"TRUNC(H12*J12,2)","v":117601.98}]
[3,"1.3","CPU.3","CODEVASF","CANTEIRO DE OBRAS","SERV","GL",1,{"$f":"VLOOKUP(A13,'CPU-SERV'!A:K,11,0)","v":13722.3},{"$f":"TRUNC(_xlfn.IFS(F13=\"SERV\",I13*(1+$L$5/100),F13=\"SERV DIF\",I13*(1+$L$6/100),F13=\"FORN\",I13*(1+$L$7/100)),2)","v":17218.740000000002},13722.3,17218.740000000002]
[4,"1.4",103689,"SINAPI","PLACA DE OBRA EM CHAPA DE AÇO GALVANIZADO","SERV","M2",2,{"$f":"VLOOKUP(A14,'CPU-SERV'!A:K,11,0)","v":543.91999999999996},{"$f":"TRUNC(_xlfn.IFS(F14=\"SERV\",I14*(1+$L$5/100),F14=\"SERV DIF\",I14*(1+$L$6/100),F14=\"FORN\",I14*(1+$L$7/100)),2)","v":682.51},1087.8399999999999,1365.02]
[5,"1.5","CPU.4","CODEVASF","VEÍCULO PARA A FISCALIZAÇÃO, MÁXIMO 02 ANOS DE USO OU 50.000KM, PREFERENCIALMENTE NA COR BRANCA, COM IDENTIFICAÇÃO CONFORME ESPECIFICAÇÕES DA CODEVASF, INCLUSIVE COMBUSTÍVEL, MANUTENÇÃO, SEGURO E IMPOSTOS - CONFORME ESPECIFICAÇÕES","SERV","MÊS",8,{"$f":"VLOOKUP(A15,'CPU-SERV'!A:K,11,0)","v":4264.1499999999996},{"$f":"TRUNC(_xlfn.IFS(F15=\"SERV\",I15*(1+$L$5/100),F15=\"SERV DIF\",I15*(1+$L$6/100),F15=\"FORN\",I15*(1+$L$7/100)),2)","v":5350.65},{"$f":"TRUNC(H15*I15,2)","v":34113.199999999997},{"$f":"TRUNC(H15*J15,2)","v":42805.2}]
[6,"1.6",78472,"SINAPI","SERVIÇOS TOPOGRÁFICOS PARA PAVIMENTAÇÃO, INCLUSIVE LEVANTAMENTO PLANIALTIMÉTRICO CADASTRAL, GERAÇÃO DE NOTAS DE SERVIÇO, SEÇÕES TRANSVERSAIS E GREIDE, ESTAQUEAMENTO E ACOMPANHAMENTO EXECUTIVO","SERV","M2",12000,{"$f":"VLOOKUP(A16,'CPU-SERV'!A:K,11,0)","v":0.46},{"$f":"TRUNC(_xlfn.IFS(F16=\"SERV\",I16*(1+$L$5/100),F16=\"SERV DIF\",I16*(1+$L$6/100),F16=\"FORN\",I16*(1+$L$7/100)),2)","v":0.56999999999999995},5520,6840]
["B",2,null,null,"TERRAPLANAGEM E PAVIMENTAÇÃO",{"$nulls":5},{"$f":"SUM(K18:K21)","v":702152},{"$f":"SUM(L18:L21)","v":880956}]
[7,"2.1",5502114,"SICRO","ESCAVAÇÃO, CARGA E TRANSPORTE DE MATERIAL DE 1ª CATEGORIA - DMT 1.000 A 1.200M, CAMINHO DE SERVIÇO EM REVESTIMENTO PRIMÁRIO","SERV","M3",3600,{"$f":"VLOOKUP(A18,'CPU-SERV'!A:K,11,0)","v":6.73},{"$f":"TRUNC(_xlfn.IFS(F18=\"SERV\",I18*(1+$L$5/100),F18=\"SERV DIF\",I18*(1+$L$6/100),F18=\"FORN\",I18*(1+$L$7/100)),2)","v":8.44},{"$f":"TRUNC(H18*I18,2)","v":24228},{"$f":"TRUNC(H18*J18,2)","v":30384}]
[8,"2.2",4011209,"SICRO","REGULARIZAÇÃO DO SUBLEITO - 100% PROCTOR INTERMEDIÁRIO","SERV","M2",12000,{"$f":"VLOOKUP(A19,'CPU-SERV'!A:K,11,0)","v":1.54},{"$f":"TRUNC(_xlfn.IFS(F19=\"SERV\",I19*(1+$L$5/100),F19=\"SERV DIF\",I19*(1+$L$6/100),F19=\"FORN\",I19*(1+$L$7/100)),2)","v":1.93},18480,23160]
[9,"2.3",4011219,"SICRO","BASE DE SOLO ESTABILIZADA GRANULOMETRICAMENTE SEM MISTURA COM MATERIAL DE JAZIDA - 100% PROCTOR MODIFICADO","SERV","M3",1800,{"$f":"VLOOKUP(A20,'CPU-SERV'!A:K,11,0)","v":14.78},{"$f":"TRUNC(_xlfn.IFS(F20=\"SERV\",I20*(1+$L$5/100),F20=\"SERV DIF\",I20*(1+$L$6/100),F20=\"FORN\",I20*(1+$L$7/100)),2)","v":18.54},{"$f":"TRUNC(H20*I20,2)","v":26604},{"$f":"TRUNC(H20*J20,2)","v":33372}]
{"$rows_left_out":15}
{"sheet":"CPU-SERV","index":1,"n_rows":813,"n_cols":16,"rows_kept":813,"cut":false,"hidden":false,"merged":[[750,7,750,9],[755,3,755,7],[756,7,756,9],[759,3,759,7],[761,8,761,9],[773,2,773,9],[774,1,775,3],[774,4,774,5],[775,4,775,5],[693,0,730,0],[732,2,732,9],[733,1,734,3],[733,4,733,5],[734,4,734,5],[735,2,735,7],[735,8,735,9],[736,1,737,2],[736,3,737,3],[736,4,736,5],[736,6,736,7],[731,0,771,0],[764,3,764,7],[765,1,766,2],[765,3,766,3],[765,4,766,4],[765,5,765,7],[765,9,766,9],[769,3,769,7],[770,5,770,7],[741,7,741,9],[745,3,745,7],[746,3,746,7],[747,3,747,7],[621,7,621,9],[624,3,624,7],[625,3,625,7],[291,11,291,12],[695,10,695,11],[574,10,574,11],[612,11,612,12],[613,10,613,11],[654,11,654,12],[655,10,655,11],[694,11,694,12],[457,10,457,11],[495,11,495,12],[496,10,496,11],[534,11,534,12],[535,10,535,11],[573,11,573,12],[658,4,658,5],[658,6,658,7],[663,7,663,9],[666,3,666,7],[667,3,667,7],[626,3,626,7],[629,7,629,9],[635,3,635,7],[636,7,636,9],[639,3,639,7],[641,8,641,9],[630,7,630,8],[729,5,729,7],[723,3,723,7],[698,3,699,3],[698,4,698,5],[698,6,698,7],[703,7,703,9],[706,3,706,7],[707,3,707,7],[689,3,689,7],[690,5,690,7],[720,8,720,9],[694,2,694,9],[695,1,696,3],[695,4,695,5],[696,4,696,5],[697,2,697,7],[697,8,697,9],[698,1,699,2],[684,3,684,7],[41,10,41,11],[84,11,84,12],[85,10,85,11],[123,11,123,12],[124,10,124,11],[211,11,211,12],[40,11,40,12],[728,3,728,7],[668,3,668,7],[671,7,671,9],[674,3,674,7],[675,7,675,9],[679,3,679,7],[681,8,681,9],[292,10,292,11],[374,11,374,12],[378,10,378,11],[417,11,417,12],[418,10,418,11],[456,11,456,12],[212,10,212,11],[252,11,252,12],[253,10,253,11],[658,3,659,3],[685,1,686,2],[685,3,686,3],[685,4,686,4],[685,5,685,7],[685,9,686,9],[724,1,725,2],[724,3,725,3],[724,4,725,4],[724,5,724,7],[724,9,725,9],[708,3,708,7],[711,7,711,9],[714,3,714,7],[715,7,715,9],[718,3,718,7],[653,0,691,0],[654,2,654,9],[655,1,656,3],[655,4,655,5],[656,4,656,5],[657,2,657,7],[657,8,657,9],[658,1,659,2],[611,0,651,0],[612,2,612,9],[613,1,614,3],[613,4,613,5],[614,4,614,5],[615,2,615,7],[615,8,615,9],[616,1,617,2],[649,3,649,7],[650,5,650,7],[644,3,644,7],[645,1,646,2],[645,3,646,3],[645,4,646,4],[645,5,645,7],[645,9,646,9],[616,3,617,3],[616,4,616,5],[560,8,560,9],[577,3,578,3],[577,4,577,5],[577,6,577,7],[582,7,582,9],[585,3,585,7],[586,3,586,7],[607,3,607,7],[608,5,608,7],[591,7,591,8],[592,7,592,8],[594,7,594,9],[597,3,597,7],[599,8,599,9],[616,6,616,7],[572,0,609,0],[573,2,573,9],[574,1,575,3],[574,4,574,5],[575,4,575,5],[576,2,576,7],[576,8,576,9],[577,1,578,2],[602,3,602,7],[603,1,604,2],[603,3,604,3],[603,4,604,4],[603,5,603,7],[603,9,604,9],[587,3,587,7],[590,7,590,9],[593,3,593,7],[547,3,547,7],[529,3,529,7],[530,5,530,7],[533,0,570,0],[534,2,534,9],[535,1,536,3],[535,4,535,5],[536,4,536,5],[537,2,537,7],[537,8,537,9],[538,1,539,2],[568,3,568,7],[569,5,569,7],[563,3,563,7],[564,1,565,2],[564,3,565,3],[564,4,565,4],[564,5,564,7],[564,9,565,9],[548,3,548,7],[551,7,551,9],[554,3,554,7],[555,7,555,9],[558,3,558,7],[515,3,515,7],[516,7,516,9],[519,3,519,7],[521,8,521,9],[538,3,539,3],[538,4,538,5],[538,6,538,7],[543,7,543,9],[546,3,546,7],[499,3,500,3],[499,4,499,5],[499,6,499,7],[504,7,504,9],[507,3,507,7],[508,3,508,7],[490,3,490,7],[491,5,491,7],[494,0,531,0],[495,2,495,9],[496,1,497,3],[496,4,496,5],[497,4,497,5],[498,2,498,7],[498,8,498,9],[499,1,500,2],[524,3,524,7],[525,1,526,2],[525,3,526,3],[525,4,526,4],[525,5,525,7],[525,9,526,9],[509,3,509,7],[512,7,512,9],[455,0,492,0],[456,2,456,9],[457,1,458,3],[457,4,457,5],[458,4,458,5],[459,2,459,7],[459,8,459,9],[460,1,461,2],[485,3,485,7],[486,1,487,2],[486,3,487,3],[486,4,487,4],[486,5,486,7],[486,9,487,9],[470,3,470,7],[473,7,473,9],[476,3,476,7],[477,7,477,9],[480,3,480,7],[482,8,482,9],[441,3,441,7],[443,8,443,9],[460,3,461,3],[460,4,460,5],[460,6,460,7],[465,7,465,9],[468,3,468,7],[469,3,469,7],[451,3,451,7],[452,5,452,7],[421,3,422,3],[421,4,421,5],[421,6,421,7],[426,7,426,9],[429,3,429,7],[430,3,430,7],[416,0,453,0],[417,2,417,9],[418,1,419,3],[418,4,418,5],[419,4,419,5],[420,2,420,7],[420,8,420,9],[421,1,422,2],[446,3,446,7],[447,1,448,2],[447,3,448,3],[447,4,448,4],[447,5,447,7],[447,9,448,9],[431,3,431,7],[434,7,434,9],[437,3,437,7],[438,7,438,9],[412,3,412,7],[413,5,413,7],[407,3,407,7],[408,1,409,2],[408,3,409,3],[408,4,409,4],[408,5,408,7],[408,9,409,9],[391,3,391,7],[394,7,394,9],[398,3,398,7],[399,7,399,9],[402,3,402,7],[404,8,404,9],[395,7,395,8],[396,7,396,8],[381,6,381,7],[386,7,386,9],[389,3,389,7],[390,3,390,7],[329,3,329,7],[330,5,330,7],[378,1,379,3],[378,4,378,5],[379,4,379,5],[380,2,380,7],[380,8,380,9],[381,1,382,2],[334,2,334,9],[335,1,336,3],[335,4,335,5],[336,4,336,5],[337,2,337,7],[337,8,337,9],[338,1,339,2],[338,3,339,3],[373,5,373,7],[381,4,381,5],[359,7,359,9],[381,3,382,3],[290,0,331,0],[291,2,291,9],[292,1,293,3],[292,4,292,5],[293,4,293,5],[294,2,294,7],[294,8,294,9],[295,1,296,2],[324,3,324,7],[325,1,326,2],[325,3,326,3],[325,4,326,4],[325,5,325,7],[325,9,326,9],[309,3,309,7],[312,7,312,9],[315,3,315,7],[316,7,316,9],[319,3,319,7],[321,8,321,9],[273,7,273,9],[276,3,276,7],[278,8,278,9],[295,3,296,3],[295,4,295,5],[295,6,295,7],[304,7,304,9],[307,3,307,7],[308,3,308,7],[286,3,286,7],[287,5,287,7],[239,8,239,9],[256,3,257,3],[256,4,256,5],[256,6,256,7],[261,7,261,9],[264,3,264,7],[265,3,265,7],[251,0,288,0],[252,2,252,9],[253,1,254,3],[253,4,253,5],[254,4,254,5],[255,2,255,7],[255,8,255,9],[256,1,257,2],[281,3,281,7],[282,1,283,2],[282,3,283,3],[282,4,283,4],[282,5,282,7],[282,9,283,9],[266,3,266,7],[269,7,269,9],[272,3,272,7],[226,3,226,7],[159,3,159,7],[160,5,160,7],[210,0,249,0],[211,2,211,9],[212,1,213,3],[212,4,212,5],[213,4,213,5],[214,2,214,7],[214,8,214,9],[215,1,216,2],[247,3,247,7],[248,5,248,7],[242,3,242,7],[243,1,244,2],[243,3,244,3],[243,4,244,4],[243,5,243,7],[243,9,244,9],[227,3,227,7],[230,7,230,9],[233,3,233,7],[234,7,234,9],[237,3,237,7],[145,3,145,7],[146,7,146,9],[149,3,149,7],[151,8,151,9],[215,3,216,3],[215,4,215,5],[215,6,215,7],[220,7,220,9],[225,3,225,7],[202,3,203,3],[202,4,203,4],[202,5,202,7],[202,9,203,9],[206,3,206,7],[207,5,207,7],[127,3,128,3],[127,4,127,5],[127,6,127,7],[132,7,132,9],[135,3,135,7],[136,3,136,7],[118,3,118,7],[119,5,119,7],[122,0,161,0],[123,2,123,9],[124,1,125,3],[124,4,124,5],[125,4,125,5],[126,2,126,7],[126,8,126,9],[127,1,128,2],[154,3,154,7],[155,1,156,2],[155,3,156,3],[155,4,156,4],[155,5,155,7],[155,9,156,9],[137,3,137,7],[140,7,140,9],[83,0,120,0],[84,2,84,9],[85,1,86,3],[85,4,85,5],[86,4,86,5],[87,2,87,7],[87,8,87,9],[88,1,89,2],[113,3,113,7],[114,1,115,2],[114,3,115,3],[114,4,115,4],[114,5,114,7],[114,9,115,9],[98,3,98,7],[101,7,101,9],[104,3,104,7],[105,7,105,9],[108,3,108,7],[110,8,110,9],[69,3,69,7],[71,8,71,9],[88,3,89,3],[88,4,88,5],[88,6,88,7],[93,7,93,9],[96,3,96,7],[97,3,97,7],[79,3,79,7],[80,5,80,7],[49,7,49,9],[55,3,55,7],[56,3,56,7],[35,3,35,7],[36,5,36,7],[39,0,81,0],[40,2,40,9],[41,1,42,3],[41,4,41,5],[42,4,42,5],[43,2,43,7],[43,8,43,9],[44,1,45,2],[0,0,37,0],[74,3,74,7],[75,1,76,2],[75,3,76,3],[75,4,76,4],[75,5,75,7],[75,9,76,9],[57,3,57,7],[60,7,60,9],[63,3,63,7],[64,7,64,9],[27,8,27,9],[30,3,30,7],[31,1,32,2],[31,3,32,3],[31,4,32,4],[31,5,31,7],[31,9,32,9],[44,3,45,3],[44,4,44,5],[44,6,44,7],[0,11,0,12],[1,2,1,9],[1,11,1,12],[2,1,3,3],[2,4,2,5],[2,10,2,11],[3,4,3,5],[4,2,4,7],[4,8,4,9],[13,3,13,7],[14,3,14,7],[15,3,15,7],[15,11,15,13],[18,7,18,9],[21,3,21,7],[5,1,6,2],[5,3,6,3],[5,4,5,5],[5,6,5,7],[7,13,7,15],[10,7,10,9],[22,7,22,9],[25,3,25,7],[202,1,203,2],[333,0,374,0],[377,2,377,9],[376,0,415,0],[397,7,397,8],[362,3,362,7],[364,8,364,9],[367,3,367,7],[368,1,369,2],[368,3,369,3],[368,4,369,4],[368,5,368,7],[368,9,369,9],[372,3,372,7],[338,4,338,5],[338,6,338,7],[347,7,347,9],[350,3,350,7],[351,3,351,7],[352,3,352,7],[355,7,355,9],[358,3,358,7],[50,11,51,12],[163,0,208,0],[164,2,164,9],[164,11,164,12],[165,1,166,3],[165,4,165,5],[165,10,165,11],[166,4,166,5],[167,2,167,7],[167,8,167,9],[168,1,169,2],[168,3,169,3],[168,4,168,5],[168,6,168,7],[173,7,173,9],[176,3,176,7],[177,3,177,7],[178,3,178,7],[181,7,181,9],[184,3,184,7],[185,7,185,9],[196,3,196,7],[198,8,198,9],[201,3,201,7],[810,3,810,7],[811,5,811,7],[772,0,812,0],[796,3,796,7],[797,7,797,9],[800,3,800,7],[802,8,802,9],[805,3,805,7],[806,1,807,2],[806,3,807,3],[806,4,807,4],[806,5,806,7],[806,9,807,9],[777,1,778,2],[777,3,778,3],[777,4,777,5],[777,6,777,7],[782,7,782,9],[785,3,785,7],[786,3,786,7],[787,3,787,7],[790,7,790,9],[776,2,776,7],[776,8,776,9]]}
[1,"1ª/GRD",{"$nulls":8},{"$f":"J37","v":13307.38},"Minas Gerais"]
[null,"OBRA:"," PAVIMENTAÇÃO EM BLOQUETE SEXTAVADOS - RUAS DIVERSAS - VARGEM GRANDE DO RIO PARDO / MG",{"$nulls":8}," Junho /2025"]
[null,"Custo Unitário de Referência",null,null,"Minas Gerais",{"$nulls":5},"QUANT.MATERIAL:",null,{"$f":"SUM(M20:M815)","v":0},{"$f":"M3/(ORÇAMENTO!L34)","v":0}]
[{"$nulls":4}," Junho /2025",null,null,"Produção da equipe ",0.5,{"$f":"VLOOKUP(A1,ORÇAMENTO!$A$10:$L$61,7,1)","v":"GL"}]
[null,"CPU.1","MOBILIZAÇÃO E DESMOBILIZAÇÃO",{"$nulls":5},"Valores em reais (R$)"]
[null,"A - EQUIPAMENTOS",null,"Quantidade","Utilização",null,"Custo Horário",null,null,"Custo"]
[{"$nulls":4},"Operativa","Improdutiva","Produtivo","Improdutivo",null,"Horário Total"]
[null,"E9687","Caminhão carroceria com capacidade de 5 t - 115 kW",8,0.6,0.4,146.88079999999999,57.423099999999998,null,{"$f":"D8*(E8*G8+F8*H8)","v":888.78175999999996},null,"distancia =",113,"SALINAS"]
[null,"E9575","Caminhão basculante com caçamba estanque com capacidade de 14 m³ - 210 kW",8,1,0,309.83940000000001,90.412199999999999,null,{"$f":"D9*(E9*G9+F9*H9)","v":2478.7152000000001},null,"Pá carregadeira ",null,null,10.1," ton"]
[{"$nulls":7},"Custo horário total de equipamentos",null,{"$f":"SUM(J8:J9)","v":3367.4969599999999},null,"Motoniveladora ",null,null,12.47," ton"]
[null,"B - MÃO DE OBRA",null,"Quantidade","Unidade",null,"Custo Horário","Custo Horário Total",null,null,null,"Trator de pneus",null,null,2.8," ton"]
[null,"P9824","Servente",8,"h",null,21.3355,null,null,{"$f":"D12*G12","v":170.684},null,"Rolo Compactador ",null,null,15.33," ton"]
[null,"-",0,null,0,null,0,null,null,{"$f":"D13*G13","v":0},null,"Grade de disco",null,null,1," ton"]
[null,null,null,"Custo horário total de mão de obra",{"$nulls":5},{"$f":"SUM(J12:J13)","v":170.684},null,"RETROESCAVADEIRA",null,null,6.67," ton"]
[null,null,null,"Custo horário total de execução",{"$nulls":5},{"$f":"J10+J14","v":3538.1809600000001}]
[null,null,null,"Custo unitário de execução",{"$nulls":5},{"$f":"J15/I4","v":7076.3619200000003},null,"MOBILIZAÇÃO + DESMOBILIZAÇÃO DOS EQUIPTOS",null,null,{"$f":"SUM(O9:O15)*M8","v":5465.81},"ton.km"]
[{"$nulls":7},"Custo do FIC",null,0]
[{"$nulls":7},"Custo do FIT",null,0]
[null,"C - MATERIAL",null,"Quantidade","Unidade",null,"Preço Unitário","Custo Unitário"]
[null,"-",0,null,0,null,0,null,null,{"$f":"D20*G20","v":0}]
{"$rows_left_out":794}
{"sheet":"AUX-VEIC.","index":2,"n_rows":31,"n_cols":5,"rows_kept":31,"cut":false,"hidden":false,"merged":[[25,2,25,3],[1,1,1,4],[2,1,2,2],[3,1,3,4],[17,1,17,4],[18,2,18,3],[19,2,19,3],[20,2,20,3],[21,2,21,3],[22,2,22,3],[23,2,23,3],[24,2,24,3],[26,2,26,3],[27,2,27,3],[28,2,28,3],[29,1,30,1],[29,2,29,3],[30,2,30,3]]}
[]
[null,"CÁLCULO DO CUSTO POR MÊS DE VEÍCULOS"]
[null,"Veículo: Polo TSI, Onix Turbo, Argo 1.3, HB-20 Turbo",null,"Data:","2025-06-17"]
[null,"DADOS ELEMENTARES DO VEÍCULO"]
[null,"Dados Básicos","Preço (R$)","Quantidade","Vida Útil"]
[null,"Quilometragem média mensal",null,3000]
[null,"Valor de Aquisição (VA)",103900]
[null,"Taxa de Juros (i)%",null,14.75]
[null,"IPVA e Seguro Obrigatório (4%)",{"$f":"0.04*C7","v":4156}]
[null,"Lavagem",50,2]
[null,"Pneus",479.9,4,50000]
[null,"Combustível",6.01,14]
[null,"Óleo Lubrificante + Filtros (revisão)",{"$f":"4*(188.59+213.69+186.16+283.83+186.16)/5","v":846.74400000000003},1,10000]
[null,"Seguro Total Anual",3378.94]
[null,"Jogo de Amortecedores",1287,null,50000]
[null,"Coeficiente de Manutenção",null,4.7999999999999998E-6]
[null,"Motorista",{"$f":"5284.47/1.7393","v":3038.2740182832176},1]
[null,"CÁLCULO DO CUSTO POR MÊS"]
[null,"DEPRECIAÇÃO","D = (VA-0,60xVA) / 12 x 5",null,{"$f":"(C7-(0.6*C7))/60","v":692.66666666666663}]
[null,"JUROS","J = (VA-0,60xVA) x i / 12",null,{"$f":"ROUND(((C7-0.6*C7)*D8/100)/12,2)","v":510.84}]
{"$rows_left_out":12}
{"sheet":"BDI SERV","index":3,"n_rows":60,"n_cols":5,"rows_kept":60,"cut":false,"hidden":false,"merged":[[36,0,36,5],[38,1,38,4],[39,2,39,3],[35,0,35,5],[0,1,2,4],[25,1,25,3],[26,1,26,2],[26,3,26,4],[27,3,27,4]]}
[null,"DETALHAMENTO DO BDI - SERVIÇOS"]
[]
[]
[null,"Item","Descrição dos Serviços","% - PV","% - CD"]
[]
[null,1,"ADMINISTRAÇÃO CENTRAL"," ",{"$f":"SUM(E7:E9)","v":4.01}]
[null,"1.1","ESCRITÓRIO CENTRAL",null,4.01]
[null,"1.2","VIAGENS"]
[null,"1.3","OUTROS"]
[null," "," "," "," "]
[null,2,"IMPOSTOS E TAXAS",{"$f":"SUM(D12:D15)","v":8.65},{"$f":"SUM(E12:E15)","v":0}]
[null,"2.1","ISS - Proposta",{"$f":"D34*100","v":5}]
[null,"2.2","PIS",0.65]
[null,"2.3","Cofins",3]
[null,"2.4","Contribuição Previdenciaria (CPRB)"]
[]
[null,3,"TAXA DE RISCO",null,{"$f":"SUM(E18:E20)","v":0.96}]
[null,"3.1","SEGURO",null,0.2]
[null,"3.2","RISCO",null,0.56000000000000005]
[null,"3.3","GARANTIA",null,0.2]
{"$rows_left_out":41}
{"sheet":"CRONOGRAMA","index":4,"n_rows":17,"n_cols":12,"rows_kept":17,"cut":false,"hidden":false,"merged":[[7,0,8,0],[9,0,10,0],[11,0,12,0],[0,1,0,11],[1,6,1,11],[2,6,2,11],[3,1,3,6],[5,0,6,0],[5,2,6,2],[1,1,2,1],[5,1,6,1],[1,2,2,4],[13,1,14,2],[16,1,20,11],[7,2,8,2],[9,2,10,2],[11,2,12,2],[7,1,8,1],[9,1,10,1],[11,1,12,1]]}
[null,"CRONOGRAMA FÍSICO-FINANCEIRO"]
[null,"OBRA: ",{"$f":"ORÇAMENTO!C5","v":" PAVIMENTAÇÃO EM BLOQUETE SEXTAVADOS - RUAS DIVERSAS - VARGEM GRANDE DO RIO PARDO / MG"},null,null,"VALOR:",{"$f":"ORÇAMENTO!L34","v":1922019.74}]
[{"$nulls":5},"PRAZO: ","180 DIAS "]
[]
[null,"ITEM","ETAPAS/DESCRIÇAO","FISICO/  FINANCEIRO","TOTAL    ETAPAS","MÊS 1","MÊS 2","MÊS 3","MÊS 4","MÊS 5","MÊS 6","TOTAL"]
["A",{"$f":"VLOOKUP(A6,ORÇAMENTO!$A$10:$L$34,2)","v":1},{"$f":"VLOOKUP(A6,ORÇAMENTO!$A$10:$L$34,5)","v":"SERVIÇOS PRELIMINARES "},"FISICO ",{"$f":"ROUND(E7/$G$2,4)","v":0.10539999999999999},0.2,0.15,0.15,0.15,0.15,0.2,{"$f":"SUM(F6:K6)","v":1}]
[null,null,null,"FINANCEIRO",{"$f":"ORÇAMENTO!L10","v":202529.03999999998},{"$f":"ROUND($E$7*F6,2)","v":40505.81},{"$f":"ROUND($E$7*G6,2)","v":30379.360000000001},{"$f":"ROUND($E$7*H6,2)","v":30379.360000000001},{"$f":"ROUND($E$7*I6,2)","v":30379.360000000001},{"$f":"ROUND($E$7*J6,2)","v":30379.360000000001},40505.81,202529.06]
["B",{"$f":"VLOOKUP(A8,ORÇAMENTO!$A$10:$L$34,2)","v":2},{"$f":"VLOOKUP(A8,ORÇAMENTO!$A$10:$L$34,5)","v":"TERRAPLANAGEM E PAVIMENTAÇÃO"},"FISICO ",{"$f":"ROUND(E9/$G$2,4)","v":0.45829999999999999},0.2,0.2,0.15,0.15,0.15,0.15,1]
[null,null,null,"FINANCEIRO",{"$f":"ORÇAMENTO!L17","v":880956},{"$f":"ROUND($E$9*F8,2)","v":176191.2},{"$f":"ROUND($E$9*G8,2)","v":176191.2},{"$f":"ROUND($E$9*H8,2)","v":132143.4},{"$f":"ROUND($E$9*I8,2)","v":132143.4},{"$f":"ROUND($E$9*J8,2)","v":132143.4},132143.4,880956.00000000012]
["C",{"$f":"VLOOKUP(A10,ORÇAMENTO!$A$10:$L$34,2)","v":3},{"$f":"VLOOKUP(A10,ORÇAMENTO!$A$10:$L$34,5)","v":"TRANSPORTE DE MATERIAIS"},"FISICO ",{"$f":"ROUND(E11/$G$2,4)","v":0.1027},0.2,0.2,0.15,0.15,0.15,0.15,1]
[null,null,null,"FINANCEIRO",{"$f":"ORÇAMENTO!L22","v":197300},{"$f":"ROUND($E$11*F10,2)","v":39460},{"$f":"ROUND($E$11*G10,2)","v":39460},{"$f":"ROUND($E$11*H10,2)","v":29595},{"$f":"ROUND($E$11*I10,2)","v":29595},{"$f":"ROUND($E$11*J10,2)","v":29595},29595,197300]
["D",{"$f":"VLOOKUP(A12,ORÇAMENTO!$A$10:$L$34,2)","v":4},{"$f":"VLOOKUP(A12,ORÇAMENTO!$A$10:$L$34,5)","v":"DRENAGEM E OBRAS COMPLEMENTARES"},"FISICO ",0.1,0.15,0.15,0.2,0.2,0.15,0.15,1]
[null,null,null,"FINANCEIRO",{"$f":"ORÇAMENTO!L27","v":641234.69999999995},{"$f":"ROUND($E$13*F12,2)","v":96185.21},{"$f":"ROUND($E$13*G12,2)","v":96185.21},{"$f":"ROUND($E$13*H12,2)","v":128246.94},{"$f":"ROUND($E$13*I12,2)","v":128246.94},{"$f":"ROUND($E$13*J12,2)","v":96185.21},96185.21,641234.72]
[null,"TOTAL",null,"FISICO ",{"$f":"SUM(F14:H14)","v":0.52805008651992313},{"$f":"F15/E15","v":0.18331873115933764},{"$f":"G15/$E$15","v":0.17805008079677684},{"$f":"H15/$E$15","v":0.1666812745638086},{"$f":"I15/$E$15","v":0.1666812745638086},0.15000000468257418,0.15526865504513496,1.000000020811441]
[null,null,null,"FINANCEIRO",{"$f":"E11+E9+E7+E13","v":1922019.74},{"$f":"F11+F9+F7+F13","v":352342.22000000003},{"$f":"G11+G9+G7+G13","v":342215.77},{"$f":"H11+H9+H7+H13","v":320364.7},{"$f":"I11+I9+I7+I13","v":320364.7},{"$f":"J11+J9+J7+J13","v":288302.97000000003},298429.42,{"$f":"ROUNDUP(SUM(F15:K15),2)-0.04","v":1922019.74}]
[]
[null,"OBSERVAÇÕES:"]