{"text_format":"2","workbook":"xlsx","n_sheets":6,"sheets":["ORÇAMENTO","CPU-SERV","CPU-FORNEC","BDI SERV","BDI FORN","CRONOGRAMA"],"not_rendered":{"charts":0,"images":2,"macros":0,"external_links":1,"defined_names":8,"comments":2,"pivot_tables":0},"unopened":[],"bounds":{"document_bytes":16777216,"sheet_cells":100000,"run_cost":"one","rows_first":2000,"rows_last":500,"rows_between":2000,"halvings":0,"cell_chars":16384,"cell_head_chars":4096},"cells_cut":0,"cells_raw":0,"read":"whole","date_system":"1900"}

{"sheet":"ORÇAMENTO","index":0,"n_rows":42,"n_cols":12,"rows_kept":42,"cut":false,"hidden":false,"merged":[[6,14,8,15],[41,1,41,4],[9,14,9,15],[41,14,41,15],[0,0,8,0],[0,4,0,11],[1,4,1,11],[2,4,2,11],[6,1,6,4],[4,8,4,10],[5,8,5,10],[6,8,6,10],[4,2,4,7],[5,2,5,7],[7,1,7,11]]}
["<---- NUMERAR SERVIÇOS PARA CPU",null,null,null,"Ministério do Desenvolvimento Regional"]
[{"$nulls":4},"Companhia de Desenvolvimento dos Vales do São Francisco e do Parnaíba"]
[{"$nulls":4},"1ª Superintendência Regional"]
[]
[null,"OBRA: "," PAVIMENTAÇÃO ASFÁLTICA EM CBUQ - VIAS URBANAS DIVERSAS - PEDRA AZUL / MG",{"$nulls":5},"BDI Serviços (%):",null,null,{"$f":"'BDI SERV'!E26","v":24.67}]
[null,"DATA:"," ABRIL / 2025",{"$nulls":5},"BDI Diferenciado Serviços (%):",null,null,{"$f":"'BDI FORN'!D31","v":15}]
[null,"PRAZO DE EXECUÇÃO:     120 DIAS",{"$nulls":6},"BDI Fornecimentos (%):",null,null,{"$f":"'BDI FORN'!D31","v":15}]
[null,"PLANILHA DE ORÇAMENTAÇÃO"]
[null,"ITEM","CÓDIGO","FONTE","DISCRIMINAÇÃO","TIPO","UNID.","QUANT.","VR.UNIT.S/BDI","PR. UNIT.C/BDI","C. TOT.S/BDI","P. TOT.C/BDI"]
["A",1,null,null,"SERVIÇOS PRELIMINARES ",{"$nulls":5},{"$f":"SUM(K11:K15)","v":124158.8},{"$f":"SUM(L11:L15)","v":154776.10999999999}]
{"$rows_left_out":33}
{"sheet":"CPU-SERV","index":1,"n_rows":1762,"n_cols":11,"rows_kept":1762,"cut":false,"hidden":false,"merged":[[656,0,693,0],[657,2,657,9],[658,1,659,3],[658,4,658,5],[659,4,659,5],[660,2,660,7],[660,8,660,9],[661,1,662,2],[661,3,662,3],[661,4,661,5],[661,6,661,7],[666,7,666,9],[669,3,669,7],[670,3,670,7],[671,3,671,7],[674,7,674,9],[677,3,677,7],[678,7,678,9],[681,3,681,7],[683,8,683,9],[686,3,686,7],[687,1,688,2],[687,3,688,3],[687,4,688,4],[687,5,687,7],[687,9,688,9],[691,3,691,7],[692,5,692,7],[1560,2,1560,9],[1526,7,1526,9],[1532,3,1532,7],[1533,7,1533,9],[1561,1,1562,3],[1561,4,1561,5],[1562,4,1562,5],[1563,2,1563,7],[1537,3,1537,7],[1539,8,1539,9],[1546,3,1546,7],[1547,1,1548,2],[1547,3,1548,3],[1547,4,1548,4],[1547,5,1547,7],[1547,9,1548,9],[1606,3,1606,7],[1607,5,1607,7],[1588,3,1588,7],[1590,8,1590,9],[1597,3,1597,7],[1598,1,1599,2],[1598,3,1599,3],[1598,4,1599,4],[1598,5,1598,7],[1598,9,1599,9],[1583,3,1583,7],[1584,7,1584,9],[1512,2,1512,7],[1555,3,1555,7],[1556,5,1556,7],[1559,0,1608,0],[1481,3,1481,7],[1482,7,1482,9],[1572,3,1572,7],[1573,3,1573,7],[1574,3,1574,7],[1577,7,1577,9],[1569,7,1569,9],[1467,7,1467,9],[1521,3,1521,7],[1522,3,1522,7],[1523,3,1523,7],[1406,0,1455,0],[1508,0,1557,0],[1512,8,1512,9],[1513,1,1514,2],[1513,3,1514,3],[1513,4,1513,5],[1513,6,1513,7],[1518,7,1518,9],[1504,3,1504,7],[1505,5,1505,7],[1563,8,1563,9],[1564,1,1565,2],[1564,3,1565,3],[1564,4,1564,5],[1564,6,1564,7],[1510,4,1510,5],[1511,4,1511,5],[1407,2,1407,9],[1408,1,1409,3],[1408,4,1408,5],[1409,4,1409,5],[1410,2,1410,7],[1453,3,1453,7],[1454,5,1454,7],[1457,0,1506,0],[1458,2,1458,9],[1459,1,1460,3],[1459,4,1459,5],[1460,4,1460,5],[1461,2,1461,7],[1435,3,1435,7],[1437,8,1437,9],[1444,3,1444,7],[1445,1,1446,2],[1445,3,1446,3],[1462,1,1463,2],[1462,3,1463,3],[1462,4,1462,5],[1462,6,1462,7],[1496,5,1496,7],[1496,9,1497,9],[1470,3,1470,7],[1471,3,1471,7],[1472,3,1472,7],[1475,7,1475,9],[1509,2,1509,9],[1510,1,1511,3],[1445,4,1446,4],[1445,5,1445,7],[1445,9,1446,9],[1486,3,1486,7],[1488,8,1488,9],[1495,3,1495,7],[1496,1,1497,2],[1496,3,1497,3],[1496,4,1497,4],[1461,8,1461,9],[1360,3,1361,3],[1360,4,1360,5],[1360,6,1360,7],[1365,7,1365,9],[1419,3,1419,7],[1420,3,1420,7],[1421,3,1421,7],[1424,7,1424,9],[1430,3,1430,7],[1431,7,1431,9],[1410,8,1410,9],[1411,1,1412,2],[1411,3,1412,3],[1411,4,1411,5],[1411,6,1411,7],[1416,7,1416,9],[1402,3,1402,7],[1403,5,1403,7],[1355,0,1404,0],[1356,2,1356,9],[1357,1,1358,3],[1357,4,1357,5],[1358,4,1358,5],[1359,2,1359,7],[1333,3,1333,7],[1335,8,1335,9],[1342,3,1342,7],[1343,1,1344,2],[1343,3,1344,3],[1343,4,1344,4],[1343,5,1343,7],[1343,9,1344,9],[1384,3,1384,7],[1386,8,1386,9],[1393,3,1393,7],[1394,1,1395,2],[1394,3,1395,3],[1394,4,1395,4],[1394,5,1394,7],[1394,9,1395,9],[1368,3,1368,7],[1369,3,1369,7],[1370,3,1370,7],[1373,7,1373,9],[1379,3,1379,7],[1380,7,1380,9],[1359,8,1359,9],[1360,1,1361,2],[1322,7,1322,9],[1328,3,1328,7],[1329,7,1329,9],[1308,8,1308,9],[1309,1,1310,2],[1309,3,1310,3],[1309,4,1309,5],[1309,6,1309,7],[1314,7,1314,9],[1300,3,1300,7],[1301,5,1301,7],[1304,0,1353,0],[1305,2,1305,9],[1306,1,1307,3],[1306,4,1306,5],[1307,4,1307,5],[1308,2,1308,7],[1351,3,1351,7],[1352,5,1352,7],[1317,3,1317,7],[1318,3,1318,7],[1319,3,1319,7],[1292,5,1292,7],[1292,9,1293,9],[1266,3,1266,7],[1267,3,1267,7],[1268,3,1268,7],[1271,7,1271,9],[1277,3,1277,7],[1278,7,1278,9],[1257,8,1257,9],[1258,1,1259,2],[1258,3,1259,3],[1258,4,1258,5],[1258,6,1258,7],[1263,7,1263,9],[1156,3,1157,3],[1156,4,1156,5],[1156,6,1156,7],[1161,7,1161,9],[1215,3,1215,7],[1216,3,1216,7],[1217,3,1217,7],[1220,7,1220,9],[1226,3,1226,7],[1227,7,1227,9],[1206,8,1206,9],[1207,1,1208,2],[1207,3,1208,3],[1207,4,1207,5],[1207,6,1207,7],[1212,7,1212,9],[1198,3,1198,7],[1199,5,1199,7],[1202,0,1251,0],[1203,2,1203,9],[1204,1,1205,3],[1204,4,1204,5],[1205,4,1205,5],[1206,2,1206,7],[1249,3,1249,7],[1250,5,1250,7],[1253,0,1302,0],[1254,2,1254,9],[1255,1,1256,3],[1255,4,1255,5],[1256,4,1256,5],[1257,2,1257,7],[1231,3,1231,7],[1233,8,1233,9],[1240,3,1240,7],[1241,1,1242,2],[1241,3,1242,3],[1241,4,1242,4],[1241,5,1241,7],[1241,9,1242,9],[1282,3,1282,7],[1284,8,1284,9],[1291,3,1291,7],[1292,1,1293,2],[1292,3,1293,3],[1292,4,1293,4],[1151,0,1200,0],[1152,2,1152,9],[1153,1,1154,3],[1153,4,1153,5],[1154,4,1154,5],[1155,2,1155,7],[1129,3,1129,7],[1131,8,1131,9],[1138,3,1138,7],[1139,1,1140,2],[1139,3,1140,3],[1139,4,1140,4],[1139,5,1139,7],[1139,9,1140,9],[1180,3,1180,7],[1182,8,1182,9],[1189,3,1189,7],[1190,1,1191,2],[1190,3,1191,3],[1190,4,1191,4],[1190,5,1190,7],[1190,9,1191,9],[1164,3,1164,7],[1165,3,1165,7],[1102,4,1102,5],[1103,4,1103,5],[1104,2,1104,7],[1147,3,1147,7],[1148,5,1148,7],[1088,5,1088,7],[1088,9,1089,9],[1062,3,1062,7],[1063,3,1063,7],[1064,3,1064,7],[1067,7,1067,9],[1073,3,1073,7],[1074,7,1074,9],[1166,3,1166,7],[1169,7,1169,9],[1175,3,1175,7],[1176,7,1176,9],[1155,8,1155,9],[1156,1,1157,2],[1118,7,1118,9],[1124,3,1124,7],[1125,7,1125,9],[1104,8,1104,9],[1105,1,1106,2],[1105,3,1106,3],[1105,4,1105,5],[1105,6,1105,7],[1110,7,1110,9],[1096,3,1096,7],[1097,5,1097,7],[1059,7,1059,9],[1113,3,1113,7],[1114,3,1114,7],[1115,3,1115,7],[998,0,1047,0],[999,2,999,9],[1000,1,1001,3],[1000,4,1000,5],[1001,4,1001,5],[1002,2,1002,7],[1045,3,1045,7],[1046,5,1046,7],[1049,0,1098,0],[1050,2,1050,9],[1051,1,1052,3],[1051,4,1051,5],[1052,4,1052,5],[1053,2,1053,7],[1027,3,1027,7],[1029,8,1029,9],[1036,3,1036,7],[1037,1,1038,2],[1037,3,1038,3],[1100,0,1149,0],[1101,2,1101,9],[1102,1,1103,3],[1037,4,1038,4],[1037,5,1037,7],[1037,9,1038,9],[1078,3,1078,7],[1080,8,1080,9],[1087,3,1087,7],[1088,1,1089,2],[1088,3,1089,3],[1088,4,1089,4],[952,3,953,3],[952,4,952,5],[952,6,952,7],[957,7,957,9],[1011,3,1011,7],[1012,3,1012,7],[1013,3,1013,7],[1016,7,1016,9],[1022,3,1022,7],[1023,7,1023,9],[1002,8,1002,9],[1003,1,1004,2],[1003,3,1004,3],[1003,4,1003,5],[1003,6,1003,7],[1008,7,1008,9],[994,3,994,7],[995,5,995,7],[1053,8,1053,9],[1054,1,1055,2],[1054,3,1055,3],[1054,4,1054,5],[1054,6,1054,7],[947,0,996,0],[948,2,948,9],[949,1,950,3],[949,4,949,5],[950,4,950,5],[951,2,951,7],[929,3,929,7],[931,8,931,9],[936,3,936,7],[937,1,938,2],[937,3,938,3],[937,4,938,4],[937,5,937,7],[937,9,938,9],[976,3,976,7],[978,8,978,9],[985,3,985,7],[986,1,987,2],[986,3,987,3],[986,4,987,4],[986,5,986,7],[986,9,987,9],[960,3,960,7],[961,3,961,7],[962,3,962,7],[965,7,965,9],[971,3,971,7],[972,7,972,9],[951,8,951,9],[952,1,953,2],[891,3,892,3],[891,4,892,4],[891,5,891,7],[891,9,892,9],[914,3,914,7],[915,3,915,7],[916,3,916,7],[919,7,919,9],[925,3,925,7],[926,7,926,9],[905,8,905,9],[906,1,907,2],[906,3,907,3],[906,4,906,5],[906,6,906,7],[911,7,911,9],[901,0,945,0],[902,2,902,9],[903,1,904,3],[903,4,903,5],[904,4,904,5],[905,2,905,7],[943,3,943,7],[944,5,944,7],[851,3,851,7],[852,5,852,7],[816,0,853,0],[817,2,817,9],[818,1,819,3],[818,4,818,5],[819,4,819,5],[820,2,820,7],[868,3,868,7],[869,3,869,7],[870,3,870,7],[873,7,873,9],[879,3,879,7],[880,7,880,9],[859,8,859,9],[860,1,861,2],[860,3,861,3],[860,4,860,5],[860,6,860,7],[865,7,865,9],[855,0,899,0],[856,2,856,9],[857,1,858,3],[857,4,857,5],[858,4,858,5],[859,2,859,7],[897,3,897,7],[898,5,898,7],[883,3,883,7],[885,8,885,9],[890,3,890,7],[891,1,892,2],[808,3,809,3],[808,4,809,4],[808,5,808,7],[808,9,809,9],[841,3,841,7],[843,8,843,9],[846,3,846,7],[847,1,848,2],[847,3,848,3],[847,4,848,4],[847,5,847,7],[847,9,848,9],[829,3,829,7],[830,3,830,7],[831,3,831,7],[834,7,834,9],[837,3,837,7],[838,7,838,9],[820,8,820,9],[821,1,822,2],[821,3,822,3],[821,4,821,5],[821,6,821,7],[826,7,826,9],[771,3,771,7],[772,5,772,7],[734,0,773,0],[735,2,735,9],[736,1,737,3],[736,4,736,5],[737,4,737,5],[738,2,738,7],[788,3,788,7],[789,3,789,7],[790,3,790,7],[793,7,793,9],[798,3,798,7],[799,7,799,9],[779,8,779,9],[780,1,781,2],[780,3,781,3],[780,4,780,5],[780,6,780,7],[785,7,785,9],[775,0,814,0],[776,2,776,9],[777,1,778,3],[777,4,777,5],[778,4,778,5],[779,2,779,7],[812,3,812,7],[813,5,813,7],[802,3,802,7],[804,8,804,9],[807,3,807,7],[808,1,809,2],[726,3,727,3],[726,4,727,4],[726,5,726,7],[726,9,727,9],[761,3,761,7],[763,8,763,9],[766,3,766,7],[767,1,768,2],[767,3,768,3],[767,4,768,4],[767,5,767,7],[767,9,768,9],[747,3,747,7],[748,3,748,7],[749,3,749,7],[752,7,752,9],[755,3,755,7],[756,7,756,9],[738,8,738,9],[739,1,740,2],[739,3,740,3],[739,4,739,5],[739,6,739,7],[744,7,744,9],[708,3,708,7],[709,3,709,7],[710,3,710,7],[713,7,713,9],[716,3,716,7],[717,7,717,9],[699,8,699,9],[700,1,701,2],[700,3,701,3],[700,4,700,5],[700,6,700,7],[705,7,705,9],[652,3,652,7],[653,5,653,7],[695,0,732,0],[696,2,696,9],[697,1,698,3],[697,4,697,5],[698,4,698,5],[699,2,699,7],[730,3,730,7],[731,5,731,7],[617,0,654,0],[618,2,618,9],[619,1,620,3],[619,4,619,5],[620,4,620,5],[621,2,621,7],[720,3,720,7],[722,8,722,9],[725,3,725,7],[726,1,727,2],[642,3,642,7],[644,8,644,9],[647,3,647,7],[648,1,649,2],[648,3,649,3],[648,4,649,4],[648,5,648,7],[648,9,649,9],[630,3,630,7],[631,3,631,7],[632,3,632,7],[635,7,635,9],[638,3,638,7],[639,7,639,9],[621,8,621,9],[622,1,623,2],[622,3,623,3],[622,4,622,5],[622,6,622,7],[627,7,627,9],[600,7,600,9],[582,8,582,9],[583,1,584,2],[583,3,584,3],[583,4,583,5],[583,6,583,7],[588,7,588,9],[535,3,535,7],[536,5,536,7],[578,0,615,0],[579,2,579,9],[580,1,581,3],[580,4,580,5],[581,4,581,5],[582,2,582,7],[613,3,613,7],[614,5,614,7],[500,0,537,0],[501,2,501,9],[502,1,503,3],[502,4,502,5],[503,4,503,5],[603,3,603,7],[605,8,605,9],[608,3,608,7],[609,1,610,2],[609,3,610,3],[609,4,610,4],[609,5,609,7],[609,9,610,9],[514,3,514,7],[515,3,515,7],[518,7,518,9],[521,3,521,7],[522,7,522,9],[504,8,504,9],[505,1,506,2],[505,3,506,3],[505,4,505,5],[505,6,505,7],[510,7,510,9],[591,3,591,7],[592,3,592,7],[593,3,593,7],[596,7,596,9],[599,3,599,7],[504,2,504,7],[434,8,434,9],[437,3,437,7],[438,1,439,2],[438,3,439,3],[438,4,439,4],[438,5,438,7],[438,9,439,9],[488,1,489,2],[488,3,489,3],[488,4,489,4],[488,5,488,7],[488,9,489,9],[496,3,496,7],[478,3,478,7],[480,8,480,9],[487,3,487,7],[513,3,513,7],[471,7,471,8],[497,5,497,7],[525,3,525,7],[527,8,527,9],[530,3,530,7],[531,1,532,2],[531,3,532,3],[531,4,532,4],[531,5,531,7],[531,9,532,9],[373,6,373,7],[378,7,378,9],[420,3,420,7],[421,3,421,7],[422,3,422,7],[425,7,425,9],[428,3,428,7],[429,7,429,9],[411,8,411,9],[412,1,413,2],[412,3,413,3],[412,4,412,5],[412,6,412,7],[418,7,418,9],[403,3,403,7],[404,5,404,7],[382,3,382,7],[383,3,383,7],[386,7,386,9],[389,3,389,7],[390,7,390,9],[476,7,476,9],[432,3,432,7],[407,0,444,0],[408,2,408,9],[409,1,410,3],[409,4,409,5],[410,4,410,5],[411,2,411,7],[442,3,442,7],[443,5,443,7],[387,7,387,8],[368,0,405,0],[369,2,369,9],[370,1,371,3],[370,4,370,5],[371,4,371,5],[372,2,372,7],[354,3,354,7],[356,8,356,9],[359,3,359,7],[360,1,361,2],[360,3,361,3],[360,4,361,4],[360,5,360,7],[360,9,361,9],[393,3,393,7],[395,8,395,9],[398,3,398,7],[399,1,400,2],[399,3,400,3],[399,4,400,4],[399,5,399,7],[399,9,400,9],[381,3,381,7],[372,8,372,9],[373,1,374,2],[373,3,374,3],[373,4,373,5],[342,3,342,7],[343,3,343,7],[344,3,344,7],[347,7,347,9],[350,3,350,7],[351,7,351,9],[333,8,333,9],[334,1,335,2],[334,3,335,3],[334,4,334,5],[334,6,334,7],[339,7,339,9],[329,0,366,0],[330,2,330,9],[331,1,332,3],[331,4,331,5],[332,4,332,5],[333,2,333,7],[364,3,364,7],[365,5,365,7],[348,7,348,8],[315,3,315,7],[317,8,317,9],[320,3,320,7],[321,1,322,2],[321,3,322,3],[321,4,322,4],[321,5,321,7],[321,9,322,9],[278,5,278,7],[278,9,279,9],[260,3,260,7],[261,3,261,7],[248,6,248,7],[257,7,257,9],[303,3,303,7],[304,3,304,7],[305,3,305,7],[308,7,308,9],[311,3,311,7],[312,7,312,9],[290,8,290,9],[291,1,292,2],[291,3,292,3],[291,4,291,5],[291,6,291,7],[300,7,300,9],[282,3,282,7],[283,5,283,7],[262,3,262,7],[265,7,265,9],[268,3,268,7],[269,7,269,9],[247,8,247,9],[248,1,249,2],[248,3,249,3],[248,4,248,5],[209,6,209,7],[214,7,214,9],[239,3,239,7],[240,5,240,7],[219,3,219,7],[222,7,222,9],[225,3,225,7],[226,7,226,9],[286,0,327,0],[287,2,287,9],[288,1,289,3],[288,4,288,5],[289,4,289,5],[290,2,290,7],[325,3,325,7],[326,5,326,7],[243,0,284,0],[244,2,244,9],[245,1,246,3],[245,4,245,5],[246,4,246,5],[247,2,247,7],[272,3,272,7],[274,8,274,9],[277,3,277,7],[278,1,279,2],[278,3,279,3],[278,4,279,4],[204,0,241,0],[205,2,205,9],[206,1,207,3],[206,4,206,5],[207,4,207,5],[208,2,208,7],[190,3,190,7],[192,8,192,9],[195,3,195,7],[196,1,197,2],[196,3,197,3],[196,4,197,4],[196,5,196,7],[196,9,197,9],[229,3,229,7],[231,8,231,9],[234,3,234,7],[235,1,236,2],[235,3,236,3],[235,4,236,4],[235,5,235,7],[235,9,236,9],[217,3,217,7],[218,3,218,7],[208,8,208,9],[209,1,210,2],[209,3,210,3],[209,4,209,5],[163,0,202,0],[200,3,200,7],[201,5,201,7],[178,3,178,7],[179,3,179,7],[180,3,180,7],[183,7,183,9],[186,3,186,7],[187,7,187,9],[167,8,167,9],[168,1,169,2],[168,3,169,3],[168,4,168,5],[168,6,168,7],[173,7,173,9],[164,2,164,9],[165,1,166,3],[165,4,165,5],[166,4,166,5],[167,2,167,7],[151,8,151,9],[154,3,154,7],[155,1,156,2],[155,3,156,3],[155,4,156,4],[155,5,155,7],[155,9,156,9],[136,3,136,7],[137,3,137,7],[140,7,140,9],[145,3,145,7],[146,7,146,9],[149,3,149,7],[127,1,128,2],[127,3,128,3],[127,4,127,5],[127,6,127,7],[132,7,132,9],[135,3,135,7],[119,5,119,7],[122,0,161,0],[123,2,123,9],[124,1,125,3],[124,4,124,5],[125,4,125,5],[126,2,126,7],[126,8,126,9],[159,3,159,7],[160,5,160,7],[114,1,115,2],[114,3,115,3],[114,4,115,4],[114,5,114,7],[114,9,115,9],[118,3,118,7],[93,7,93,9],[98,3,98,7],[101,7,101,9],[104,3,104,7],[105,7,105,9],[108,3,108,7],[83,0,120,0],[84,2,84,9],[85,1,86,3],[86,4,86,5],[87,2,87,7],[87,8,87,9],[88,1,89,2],[110,8,110,9],[113,3,113,7],[96,3,96,7],[97,3,97,7],[88,3,89,3],[88,4,88,5],[88,6,88,7],[79,3,79,7],[80,5,80,7],[85,4,85,5],[74,3,74,7],[75,1,76,2],[75,3,76,3],[75,4,76,4],[75,5,75,7],[75,9,76,9],[57,3,57,7],[60,7,60,9],[63,3,63,7],[64,7,64,9],[69,3,69,7],[71,8,71,9],[44,3,45,3],[44,4,44,5],[44,6,44,7],[49,7,49,9],[55,3,55,7],[56,3,56,7],[41,1,42,3],[41,4,41,5],[42,4,42,5],[43,2,43,7],[43,8,43,9],[44,1,45,2],[0,0,37,0],[3,4,3,5],[2,4,2,5],[1,2,1,9],[2,1,3,3],[31,3,32,3],[31,4,32,4],[31,5,31,7],[31,9,32,9],[35,3,35,7],[36,5,36,7],[10,7,10,9],[13,3,13,7],[14,3,14,7],[15,3,15,7],[18,7,18,9],[30,3,30,7],[31,1,32,2],[22,7,22,9],[25,3,25,7],[1649,5,1649,7],[1649,9,1650,9],[1657,3,1657,7],[1658,5,1658,7],[27,8,27,9],[21,3,21,7],[4,2,4,7],[4,8,4,9],[5,1,6,2],[5,3,6,3],[5,4,5,5],[5,6,5,7],[446,0,498,0],[447,2,447,9],[448,1,449,3],[448,4,448,5],[449,4,449,5],[450,2,450,7],[450,8,450,9],[451,1,452,2],[451,3,452,3],[451,4,451,5],[451,6,451,7],[459,7,459,9],[461,3,461,7],[462,3,462,7],[463,3,463,7],[466,7,466,9],[475,3,475,7],[39,0,81,0],[40,2,40,9],[539,0,576,0],[1663,4,1663,5],[1674,3,1674,7],[1675,3,1675,7],[1661,0,1710,0],[1662,2,1662,9],[1610,0,1659,0],[1611,2,1611,9],[1612,1,1613,3],[1612,4,1612,5],[1613,4,1613,5],[1614,2,1614,7],[1614,8,1614,9]],"merged_total":1095,"flags":["merged_cut"]}
[1,"1ª/GRD",{"$nulls":8},{"$f":"J37","v":14242.13}]
[null,"OBRA:"," PAVIMENTAÇÃO ASFÁLTICA EM CBUQ - VIAS URBANAS DIVERSAS - PEDRA AZUL / MG"]
[null,"Custo Unitário de Referência",null,null,"Minas Gerais"]
[{"$nulls":4}," Janeiro/2025 ",null,null,"Produção da equipe ",0.5,{"$f":"VLOOKUP(A1,ORÇAMENTO!$A$10:$L$42,7,1)","v":"GL"}]
[null,"CPU.1","MOBILIZAÇÃO E DESMOBILIZAÇÃO",{"$nulls":5},"Valores em reais (R$)"]
[null,"A - EQUIPAMENTOS",null,"Quantidade","Utilização",null,"Custo Horário",null,null,"Custo"]
[{"$nulls":4},"Operativa","Improdutiva","Produtivo","Improdutivo",null,"Horário Total"]
[null,"E9687","Caminhão carroceria com capacidade de 5 t - 115 kW",8,0.6,0.4,146.88079999999999,57.423099999999998,null,{"$f":"D8*(E8*G8+F8*H8)","v":888.78175999999996}]
[null,"E9575","Caminhão basculante com caçamba estanque com capacidade de 14 m³ - 210 kW",12,1,0,309.83940000000001,90.412199999999999,null,{"$f":"D9*(E9*G9+F9*H9)","v":3718.0727999999999}]
[{"$nulls":7},"Custo horário total de equipamentos",null,{"$f":"SUM(J8:J9)","v":4606.8545599999998}]
{"$rows_left_out":1753}
{"sheet":"CPU-FORNEC","index":2,"n_rows":92,"n_cols":14,"rows_kept":92,"cut":false,"hidden":false,"merged":[[81,1,81,7],[82,0,91,0],[82,1,82,3],[82,4,82,7],[83,2,83,5],[84,2,84,3],[85,1,85,7],[88,1,88,3],[88,5,88,6],[89,1,89,6],[90,1,90,6],[91,1,91,6],[60,0,69,0],[60,1,60,3],[60,4,60,7],[61,2,61,5],[62,2,62,3],[63,1,63,7],[66,1,66,3],[66,5,66,6],[67,1,67,6],[68,1,68,6],[69,1,69,6],[38,0,47,0],[38,1,38,3],[38,4,38,7],[39,2,39,5],[40,2,40,3],[41,1,41,7],[44,1,44,3],[44,5,44,6],[45,1,45,6],[46,1,46,6],[47,1,47,6],[22,5,22,6],[23,1,23,6],[24,1,24,6],[25,1,25,6],[5,1,5,7],[9,1,9,7],[13,1,13,7],[17,1,17,7],[0,10,0,11],[1,2,1,5],[1,10,1,11],[2,2,2,3],[3,1,3,7],[27,4,27,7],[28,2,28,5],[27,0,36,0],[29,2,29,3],[30,1,30,7],[33,1,33,3],[33,5,33,6],[34,1,34,6],[35,1,35,6],[36,1,36,6],[0,0,26,0],[0,1,0,3],[0,4,0,7],[22,1,22,3],[49,0,58,0],[49,1,49,3],[49,4,49,7],[50,2,50,5],[51,2,51,3],[52,1,52,7],[55,1,55,3],[55,5,55,6],[56,1,56,6],[57,1,57,6],[58,1,58,6],[27,1,27,3],[71,0,80,0],[71,1,71,3],[71,4,71,7],[72,2,72,5],[73,2,73,3],[74,1,74,7],[77,1,77,3],[77,5,77,6],[78,1,78,6],[79,1,79,6],[80,1,80,6]]}
[1,"CODEVASF",null,null," COMPOSIÇÃO DE PREÇO UNITÁRIO",null,null,null,{"$f":"H24","v":0},{"$f":"H26","v":0},"BDI CALCULADO:",null,{"$f":"ORÇAMENTO!L5","v":24.67}]
[null,"OBRA:  "," PAVIMENTAÇÃO ASFÁLTICA EM CBUQ - VIAS URBANAS DIVERSAS - PEDRA AZUL / MG",null,null,null,"DATA: ",{"$f":"ORÇAMENTO!C6","v":" ABRIL / 2025"},null,null,"BDI DIFERENCIADO:",null,{"$f":"'BDI FORN'!D31/100","v":0.15}]
[null,"SERVIÇO:  ","CPU.1",null,"Referência:","CODEVASF","UNIDADE: ",{"$f":"VLOOKUP(A1,ORÇAMENTO!A11:L31,5)","v":"MOBILIZAÇÃO E DESMOBILIZAÇÃO"}]
[]
[null,"TIPO ITEM","CODIGO ITEM","DESCRIÇÃO ITEM","UNIDADE ITEM","COEFICIENTE","PRECO UNITARIO","CUSTO TOTAL",null,"distancia =",90,"B.DESPACHO"]
[null,"EQUIPAMENTOS",{"$nulls":7},"Pá carregadeira ",null,null,10.1," ton"]
[null,null,"E9001","E9001","E9001",null,"E9001"]
[]
[]
[null,"MÃO DE OBRA"]
{"$rows_left_out":83}
{"sheet":"BDI SERV","index":3,"n_rows":60,"n_cols":5,"rows_kept":60,"cut":false,"hidden":false,"merged":[[35,0,35,5],[36,0,36,5],[38,1,38,4],[39,2,39,3],[0,1,2,4],[25,1,25,3],[26,1,26,2],[26,3,26,4],[27,3,27,4]]}
[null,"DETALHAMENTO DO BDI - SERVIÇOS"]
[]
[]
[null,"Item","Descrição dos Serviços","% - PV","% - CD"]
[]
[null,1,"ADMINISTRAÇÃO CENTRAL"," ",{"$f":"SUM(E7:E9)","v":4.01}]
[null,"1.1","ESCRITÓRIO CENTRAL",null,4.01]
[null,"1.2","VIAGENS"]
[null,"1.3","OUTROS"]
[null," "," "," "," "]
{"$rows_left_out":51}
{"sheet":"BDI FORN","index":4,"n_rows":37,"n_cols":5,"rows_kept":37,"cut":false,"hidden":false,"merged":[[31,1,31,2],[32,0,34,5],[36,0,36,5],[0,1,2,4],[3,1,4,1],[3,2,4,2],[28,0,28,5],[30,1,30,2]]}
[null,"DETALHAMENTO DO BDI - FORNECIMENTO \n(MATERIAL ASFÁLTICO)"]
[]
[]
[null,"Item","Descrição dos Serviços","%","%"]
[null,null,null,"PV","CD"]
[]
[null,1,"ADMINISTRAÇÃO CENTRAL"," ",3.45]
[null,"1.1","ESCRITÓRIO CENTRAL"," "," "]
[null,"1.2","VIAGENS"," "," "]
[null,"1.3","OUTROS"," "," "]
{"$rows_left_out":28}
{"sheet":"CRONOGRAMA","index":5,"n_rows":19,"n_cols":10,"rows_kept":19,"cut":false,"hidden":false,"merged":[[0,1,0,9],[1,1,2,1],[1,2,2,4],[1,6,1,9],[2,6,2,9],[9,0,10,0],[9,1,10,1],[9,2,10,2],[3,1,3,8],[5,0,6,0],[5,1,6,1],[5,2,6,2],[7,0,8,0],[7,1,8,1],[7,2,8,2],[15,1,16,2],[18,1,22,9],[11,0,12,0],[11,1,12,1],[11,2,12,2],[13,0,14,0],[13,1,14,1],[13,2,14,2]]}
[null,"CRONOGRAMA FÍSICO-FINANCEIRO"]
[null,"OBRA: ",{"$f":"ORÇAMENTO!C5","v":" PAVIMENTAÇÃO ASFÁLTICA EM CBUQ - VIAS URBANAS DIVERSAS - PEDRA AZUL / MG"},null,null,"VALOR:",{"$f":"ORÇAMENTO!L42","v":2000154.31}]
[{"$nulls":5},"PRAZO: ","120 DIAS "]
[]
[null,"ITEM","ETAPAS/DESCRIÇAO","FISICO/  FINANCEIRO","TOTAL    ETAPAS","MÊS 1","MÊS 2","MÊS 3","MÊS 4","TOTAL"]
["A",{"$f":"VLOOKUP(A6,ORÇAMENTO!$A$10:$L$42,2)","v":1},{"$f":"VLOOKUP(A6,ORÇAMENTO!$A$10:$L$42,5)","v":"SERVIÇOS PRELIMINARES "},"FISICO ",{"$f":"ROUND(E7/$G$2,4)","v":7.7399999999999997E-2},0.4,0.2,0.2,0.2,{"$f":"SUM(F6:I6)","v":1}]
[null,null,null,"FINANCEIRO",{"$f":"ORÇAMENTO!L10","v":154776.10999999999},{"$f":"ROUND($E$7*F6,2)","v":61910.44},{"$f":"ROUND($E$7*G6,2)","v":30955.22},{"$f":"ROUND($E$7*H6,2)","v":30955.22},{"$f":"ROUND($E$7*I6,2)","v":30955.22},{"$f":"SUM(F7:I7)","v":154776.1}]
["B",{"$f":"VLOOKUP(A8,ORÇAMENTO!$A$10:$L$42,2)","v":2},{"$f":"VLOOKUP(A8,ORÇAMENTO!$A$10:$L$42,5)","v":"TERRAPLANAGEM E PAVIMENTAÇÃO"},"FISICO ",{"$f":"ROUND(E9/$G$2,4)","v":0.22650000000000001},0.25,0.25,0.25,0.25,{"$f":"SUM(F8:I8)","v":1}]
[null,null,null,"FINANCEIRO",{"$f":"ORÇAMENTO!L16","v":453043},{"$f":"ROUND($E$9*F8,2)","v":113260.75},{"$f":"ROUND($E$9*G8,2)","v":113260.75},{"$f":"ROUND($E$9*H8,2)","v":113260.75},{"$f":"ROUND($E$9*I8,2)","v":113260.75},{"$f":"SUM(F9:I9)","v":453043}]
["C",{"$f":"VLOOKUP(A10,ORÇAMENTO!$A$10:$L$42,2)","v":3},{"$f":"VLOOKUP(A10,ORÇAMENTO!$A$10:$L$42,5)","v":"TRANSPORTE DE MATERIAIS"},"FISICO ",{"$f":"ROUND(E11/$G$2,4)","v":0.17849999999999999},0.25,0.25,0.25,0.25,{"$f":"SUM(F10:I10)","v":1}]
{"$rows_left_out":9}