{"text_format":"2","workbook":"xlsx","n_sheets":10,"sheets":["ORÇAMENTO","CPU-SERV","CPU-FORNEC","BDI SERV","BDI FORN","CRONOGRAMA","EAI","RR-1C","CAP","MAT.ASF"],"not_rendered":{"charts":0,"images":3,"macros":0,"external_links":2,"defined_names":12,"comments":5,"pivot_tables":0},"unopened":[],"bounds":{"document_bytes":16777216,"sheet_cells":100000,"run_cost":"one","rows_first":2000,"rows_last":500,"rows_between":2000,"halvings":0,"cell_chars":16384,"cell_head_chars":4096},"cells_cut":0,"cells_raw":0,"read":"whole","date_system":"1900"}

{"sheet":"ORÇAMENTO","index":0,"n_rows":42,"n_cols":12,"rows_kept":42,"cut":false,"hidden":false,"merged":[[4,9,4,10],[5,8,5,10],[6,8,6,10],[41,1,41,4],[0,0,8,0],[0,4,0,11],[1,4,1,11],[2,4,2,11],[6,1,6,4],[7,1,7,11],[4,2,4,8],[5,2,5,7]]}
["<---- NUMERAR SERVIÇOS PARA CPU",null,null,null,"Ministério do Desenvolvimento Regional"]
[{"$nulls":4},"Companhia de Desenvolvimento dos Vales do São Francisco e do Parnaíba"]
[{"$nulls":4},"1ª Superintendência Regional"]
[]
[null,"OBRA: ","    PAVIMENTAÇÃO ASFÁLTICA EM CBUQ - VIAS URBANAS DIVERSAS - SEDE E COMUNIDADE RIO DAS PEDRAS (GLAUCILÂNDIA / MG)",{"$nulls":6},"BDI Serviços (%):",null,{"$f":"'BDI SERV'!E26","v":23.32}]
[null,"DATA:","     ABRIL / 2025 ",{"$nulls":5},"BDI Diferenciado Serviços (%):",null,null,{"$f":"'BDI FORN'!D31","v":15}]
[null,"PRAZO DE EXECUÇÃO:     180 DIAS",{"$nulls":6},"BDI Fornecimentos (%):",null,null,{"$f":"'BDI FORN'!D31","v":15}]
[null,"PLANILHA DE ORÇAMENTAÇÃO"]
{"$rows_left_out":35}
{"sheet":"CPU-SERV","index":1,"n_rows":904,"n_cols":11,"rows_kept":904,"cut":false,"hidden":false,"merged":[[887,3,887,7],[889,8,889,9],[894,3,894,7],[895,1,896,2],[895,3,896,3],[895,4,896,4],[895,5,895,7],[895,9,896,9],[849,3,850,3],[849,4,850,4],[849,5,849,7],[849,9,850,9],[872,3,872,7],[873,3,873,7],[874,3,874,7],[877,7,877,9],[883,3,883,7],[884,7,884,9],[863,8,863,9],[864,1,865,2],[864,3,865,3],[864,4,864,5],[864,6,864,7],[869,7,869,9],[859,0,903,0],[860,2,860,9],[861,1,862,3],[861,4,861,5],[862,4,862,5],[863,2,863,7],[901,3,901,7],[902,5,902,7],[809,3,809,7],[810,5,810,7],[774,0,811,0],[775,2,775,9],[776,1,777,3],[776,4,776,5],[777,4,777,5],[778,2,778,7],[826,3,826,7],[827,3,827,7],[828,3,828,7],[831,7,831,9],[837,3,837,7],[838,7,838,9],[817,8,817,9],[818,1,819,2],[818,3,819,3],[818,4,818,5],[818,6,818,7],[823,7,823,9],[813,0,857,0],[814,2,814,9],[815,1,816,3],[815,4,815,5],[816,4,816,5],[817,2,817,7],[855,3,855,7],[856,5,856,7],[841,3,841,7],[843,8,843,9],[848,3,848,7],[849,1,850,2],[766,3,767,3],[766,4,767,4],[766,5,766,7],[766,9,767,9],[799,3,799,7],[801,8,801,9],[804,3,804,7],[805,1,806,2],[805,3,806,3],[805,4,806,4],[805,5,805,7],[805,9,806,9],[787,3,787,7],[788,3,788,7],[789,3,789,7],[792,7,792,9],[795,3,795,7],[796,7,796,9],[778,8,778,9],[779,1,780,2],[779,3,780,3],[779,4,779,5],[779,6,779,7],[784,7,784,9],[729,3,729,7],[730,5,730,7],[694,0,731,0],[695,2,695,9],[696,1,697,3],[696,4,696,5],[697,4,697,5],[698,2,698,7],[746,3,746,7],[747,3,747,7],[748,3,748,7],[751,7,751,9],[756,3,756,7],[757,7,757,9],[737,8,737,9],[738,1,739,2],[738,3,739,3],[738,4,738,5],[738,6,738,7],[743,7,743,9],[733,0,772,0],[734,2,734,9],[735,1,736,3],[735,4,735,5],[736,4,736,5],[737,2,737,7],[770,3,770,7],[771,5,771,7],[760,3,760,7],[762,8,762,9],[765,3,765,7],[766,1,767,2],[686,3,687,3],[686,4,687,4],[686,5,686,7],[686,9,687,9],[719,3,719,7],[721,8,721,9],[724,3,724,7],[725,1,726,2],[725,3,726,3],[725,4,726,4],[725,5,725,7],[725,9,726,9],[707,3,707,7],[708,3,708,7],[709,3,709,7],[712,7,712,9],[715,3,715,7],[716,7,716,9],[698,8,698,9],[699,1,700,2],[699,3,700,3],[699,4,699,5],[699,6,699,7],[704,7,704,9],[668,3,668,7],[669,3,669,7],[670,3,670,7],[673,7,673,9],[676,3,676,7],[677,7,677,9],[659,8,659,9],[660,1,661,2],[660,3,661,3],[660,4,660,5],[660,6,660,7],[665,7,665,9],[651,3,651,7],[652,5,652,7],[655,0,692,0],[656,2,656,9],[657,1,658,3],[657,4,657,5],[658,4,658,5],[659,2,659,7],[690,3,690,7],[691,5,691,7],[616,0,653,0],[617,2,617,9],[618,1,619,3],[618,4,618,5],[619,4,619,5],[620,2,620,7],[680,3,680,7],[682,8,682,9],[685,3,685,7],[686,1,687,2],[641,3,641,7],[643,8,643,9],[646,3,646,7],[647,1,648,2],[647,3,648,3],[647,4,648,4],[647,5,647,7],[647,9,648,9],[629,3,629,7],[630,3,630,7],[631,3,631,7],[634,7,634,9],[637,3,637,7],[638,7,638,9],[620,8,620,9],[621,1,622,2],[621,3,622,3],[621,4,621,5],[621,6,621,7],[626,7,626,9],[599,7,599,9],[581,8,581,9],[582,1,583,2],[582,3,583,3],[582,4,582,5],[582,6,582,7],[587,7,587,9],[534,3,534,7],[535,5,535,7],[577,0,614,0],[578,2,578,9],[579,1,580,3],[579,4,579,5],[580,4,580,5],[581,2,581,7],[612,3,612,7],[613,5,613,7],[499,0,536,0],[500,2,500,9],[501,1,502,3],[501,4,501,5],[502,4,502,5],[602,3,602,7],[604,8,604,9],[607,3,607,7],[608,1,609,2],[608,3,609,3],[608,4,609,4],[608,5,608,7],[608,9,609,9],[513,3,513,7],[514,3,514,7],[517,7,517,9],[520,3,520,7],[521,7,521,9],[503,8,503,9],[504,1,505,2],[504,3,505,3],[504,4,504,5],[504,6,504,7],[509,7,509,9],[590,3,590,7],[591,3,591,7],[592,3,592,7],[595,7,595,9],[598,3,598,7],[503,2,503,7],[433,8,433,9],[436,3,436,7],[437,1,438,2],[437,3,438,3],[437,4,438,4],[437,5,437,7],[437,9,438,9],[487,1,488,2],[487,3,488,3],[487,4,488,4],[487,5,487,7],[487,9,488,9],[495,3,495,7],[477,3,477,7],[479,8,479,9],[486,3,486,7],[512,3,512,7],[470,7,470,8],[496,5,496,7],[524,3,524,7],[526,8,526,9],[529,3,529,7],[530,1,531,2],[530,3,531,3],[530,4,531,4],[530,5,530,7],[530,9,531,9],[371,6,371,7],[376,7,376,9],[419,3,419,7],[420,3,420,7],[421,3,421,7],[424,7,424,9],[427,3,427,7],[428,7,428,9],[409,8,409,9],[410,1,411,2],[410,3,411,3],[410,4,410,5],[410,6,410,7],[416,7,416,9],[401,3,401,7],[402,5,402,7],[380,3,380,7],[381,3,381,7],[384,7,384,9],[387,3,387,7],[388,7,388,9],[475,7,475,9],[431,3,431,7],[405,0,443,0],[406,2,406,9],[407,1,408,3],[407,4,407,5],[408,4,408,5],[409,2,409,7],[441,3,441,7],[442,5,442,7],[385,7,385,8],[366,0,403,0],[367,2,367,9],[368,1,369,3],[368,4,368,5],[369,4,369,5],[370,2,370,7],[352,3,352,7],[354,8,354,9],[357,3,357,7],[358,1,359,2],[358,3,359,3],[358,4,359,4],[358,5,358,7],[358,9,359,9],[391,3,391,7],[393,8,393,9],[396,3,396,7],[397,1,398,2],[397,3,398,3],[397,4,398,4],[397,5,397,7],[397,9,398,9],[379,3,379,7],[370,8,370,9],[371,1,372,2],[371,3,372,3],[371,4,371,5],[340,3,340,7],[341,3,341,7],[342,3,342,7],[345,7,345,9],[348,3,348,7],[349,7,349,9],[331,8,331,9],[332,1,333,2],[332,3,333,3],[332,4,332,5],[332,6,332,7],[337,7,337,9],[327,0,364,0],[328,2,328,9],[329,1,330,3],[329,4,329,5],[330,4,330,5],[331,2,331,7],[362,3,362,7],[363,5,363,7],[346,7,346,8],[313,3,313,7],[315,8,315,9],[318,3,318,7],[319,1,320,2],[319,3,320,3],[319,4,320,4],[319,5,319,7],[319,9,320,9],[278,5,278,7],[278,9,279,9],[260,3,260,7],[261,3,261,7],[248,6,248,7],[257,7,257,9],[301,3,301,7],[302,3,302,7],[303,3,303,7],[306,7,306,9],[309,3,309,7],[310,7,310,9],[290,8,290,9],[291,1,292,2],[291,3,292,3],[291,4,291,5],[291,6,291,7],[298,7,298,9],[282,3,282,7],[283,5,283,7],[262,3,262,7],[265,7,265,9],[268,3,268,7],[269,7,269,9],[247,8,247,9],[248,1,249,2],[248,3,249,3],[248,4,248,5],[209,6,209,7],[214,7,214,9],[239,3,239,7],[240,5,240,7],[219,3,219,7],[222,7,222,9],[225,3,225,7],[226,7,226,9],[286,0,325,0],[287,2,287,9],[288,1,289,3],[288,4,288,5],[289,4,289,5],[290,2,290,7],[323,3,323,7],[324,5,324,7],[243,0,284,0],[244,2,244,9],[245,1,246,3],[245,4,245,5],[246,4,246,5],[247,2,247,7],[272,3,272,7],[274,8,274,9],[277,3,277,7],[278,1,279,2],[278,3,279,3],[278,4,279,4],[204,0,241,0],[205,2,205,9],[206,1,207,3],[206,4,206,5],[207,4,207,5],[208,2,208,7],[190,3,190,7],[192,8,192,9],[195,3,195,7],[196,1,197,2],[196,3,197,3],[196,4,197,4],[196,5,196,7],[196,9,197,9],[229,3,229,7],[231,8,231,9],[234,3,234,7],[235,1,236,2],[235,3,236,3],[235,4,236,4],[235,5,235,7],[235,9,236,9],[217,3,217,7],[218,3,218,7],[208,8,208,9],[209,1,210,2],[209,3,210,3],[209,4,209,5],[163,0,202,0],[200,3,200,7],[201,5,201,7],[178,3,178,7],[179,3,179,7],[180,3,180,7],[183,7,183,9],[186,3,186,7],[187,7,187,9],[167,8,167,9],[168,1,169,2],[168,3,169,3],[168,4,168,5],[168,6,168,7],[173,7,173,9],[164,2,164,9],[165,1,166,3],[165,4,165,5],[166,4,166,5],[167,2,167,7],[151,8,151,9],[154,3,154,7],[155,1,156,2],[155,3,156,3],[155,4,156,4],[155,5,155,7],[155,9,156,9],[136,3,136,7],[137,3,137,7],[140,7,140,9],[145,3,145,7],[146,7,146,9],[149,3,149,7],[127,1,128,2],[127,3,128,3],[127,4,127,5],[127,6,127,7],[132,7,132,9],[135,3,135,7],[119,5,119,7],[122,0,161,0],[123,2,123,9],[124,1,125,3],[124,4,124,5],[125,4,125,5],[126,2,126,7],[126,8,126,9],[159,3,159,7],[160,5,160,7],[114,1,115,2],[114,3,115,3],[114,4,115,4],[114,5,114,7],[114,9,115,9],[118,3,118,7],[93,7,93,9],[98,3,98,7],[101,7,101,9],[104,3,104,7],[105,7,105,9],[108,3,108,7],[83,0,120,0],[84,2,84,9],[85,1,86,3],[86,4,86,5],[87,2,87,7],[87,8,87,9],[88,1,89,2],[110,8,110,9],[113,3,113,7],[96,3,96,7],[97,3,97,7],[88,3,89,3],[88,4,88,5],[88,6,88,7],[79,3,79,7],[80,5,80,7],[85,4,85,5],[74,3,74,7],[75,1,76,2],[75,3,76,3],[75,4,76,4],[75,5,75,7],[75,9,76,9],[57,3,57,7],[60,7,60,9],[63,3,63,7],[64,7,64,9],[69,3,69,7],[71,8,71,9],[44,3,45,3],[44,4,44,5],[44,6,44,7],[49,7,49,9],[55,3,55,7],[56,3,56,7],[41,1,42,3],[41,4,41,5],[42,4,42,5],[43,2,43,7],[43,8,43,9],[44,1,45,2],[0,0,37,0],[3,4,3,5],[2,4,2,5],[1,2,1,9],[2,1,3,3],[31,3,32,3],[31,4,32,4],[31,5,31,7],[31,9,32,9],[35,3,35,7],[36,5,36,7],[10,7,10,9],[13,3,13,7],[14,3,14,7],[15,3,15,7],[18,7,18,9],[30,3,30,7],[31,1,32,2],[22,7,22,9],[25,3,25,7],[27,8,27,9],[21,3,21,7],[4,2,4,7],[4,8,4,9],[5,1,6,2],[5,3,6,3],[5,4,5,5],[5,6,5,7],[445,0,497,0],[446,2,446,9],[447,1,448,3],[447,4,447,5],[448,4,448,5],[449,2,449,7],[449,8,449,9],[450,1,451,2],[450,3,451,3],[450,4,450,5],[450,6,450,7],[458,7,458,9],[460,3,460,7],[461,3,461,7],[462,3,462,7],[465,7,465,9],[474,3,474,7],[39,0,81,0],[40,2,40,9],[538,0,575,0],[563,3,563,7],[565,8,565,9],[568,3,568,7],[569,1,570,2],[569,3,570,3],[569,4,570,4],[569,5,569,7],[569,9,570,9],[573,3,573,7],[574,5,574,7],[539,2,539,9],[540,1,541,3],[540,4,540,5],[541,4,541,5],[542,2,542,7],[542,8,542,9],[543,1,544,2],[543,3,544,3],[543,4,543,5],[543,6,543,7],[548,7,548,9],[551,3,551,7],[552,3,552,7],[553,3,553,7],[556,7,556,9],[559,3,559,7],[560,7,560,9]]}
[1,"1ª/GRD",{"$nulls":8},{"$f":"J37","v":4944.29}]
[null,"OBRA:","    PAVIMENTAÇÃO ASFÁLTICA EM CBUQ - VIAS URBANAS DIVERSAS - SEDE E COMUNIDADE RIO DAS PEDRAS (GLAUCILÂNDIA / MG)"]
[null,"Custo Unitário de Referência",null,null,"Minas Gerais"]
[{"$nulls":4}," Janeiro/2025",null,null,"Produção da equipe ",1,{"$f":"VLOOKUP(A1,ORÇAMENTO!$A$10:$L$42,7,1)","v":"GL"}]
[null,"CPU.1","MOBILIZAÇÃO E DESMOBILIZAÇÃO",{"$nulls":5},"Valores em reais (R$)"]
[null,"A - EQUIPAMENTOS",null,"Quantidade","Utilização",null,"Custo Horário",null,null,"Custo"]
[{"$nulls":4},"Operativa","Improdutiva","Produtivo","Improdutivo",null,"Horário Total"]
[null,"E9687","Caminhão carroceria com capacidade de 5 t - 115 kW",8,0.6,0.4,146.88079999999999,57.423099999999998,null,{"$f":"D8*(E8*G8+F8*H8)","v":888.78175999999996}]
{"$rows_left_out":897}
{"sheet":"CPU-FORNEC","index":2,"n_rows":92,"n_cols":14,"rows_kept":92,"cut":false,"hidden":false,"merged":[[81,1,81,7],[82,0,91,0],[82,1,82,3],[82,4,82,7],[83,2,83,5],[84,2,84,3],[85,1,85,7],[88,1,88,3],[88,5,88,6],[89,1,89,6],[90,1,90,6],[91,1,91,6],[60,0,69,0],[60,1,60,3],[60,4,60,7],[61,2,61,5],[62,2,62,3],[63,1,63,7],[66,1,66,3],[66,5,66,6],[67,1,67,6],[68,1,68,6],[69,1,69,6],[38,0,47,0],[38,1,38,3],[38,4,38,7],[39,2,39,5],[40,2,40,3],[41,1,41,7],[44,1,44,3],[44,5,44,6],[45,1,45,6],[46,1,46,6],[47,1,47,6],[22,5,22,6],[23,1,23,6],[24,1,24,6],[25,1,25,6],[5,1,5,7],[9,1,9,7],[13,1,13,7],[17,1,17,7],[0,10,0,11],[1,2,1,5],[1,10,1,11],[2,2,2,3],[3,1,3,7],[27,4,27,7],[28,2,28,5],[27,0,36,0],[29,2,29,3],[30,1,30,7],[33,1,33,3],[33,5,33,6],[34,1,34,6],[35,1,35,6],[36,1,36,6],[0,0,26,0],[0,1,0,3],[0,4,0,7],[22,1,22,3],[49,0,58,0],[49,1,49,3],[49,4,49,7],[50,2,50,5],[51,2,51,3],[52,1,52,7],[55,1,55,3],[55,5,55,6],[56,1,56,6],[57,1,57,6],[58,1,58,6],[27,1,27,3],[71,0,80,0],[71,1,71,3],[71,4,71,7],[72,2,72,5],[73,2,73,3],[74,1,74,7],[77,1,77,3],[77,5,77,6],[78,1,78,6],[79,1,79,6],[80,1,80,6]]}
[1,"CODEVASF",null,null," COMPOSIÇÃO DE PREÇO UNITÁRIO",null,null,null,{"$f":"H24","v":0},{"$f":"H26","v":0},"BDI CALCULADO:",null,{"$f":"ORÇAMENTO!L6","v":15}]
[null,"OBRA:  ","    PAVIMENTAÇÃO ASFÁLTICA EM CBUQ - VIAS URBANAS DIVERSAS - SEDE E COMUNIDADE RIO DAS PEDRAS (GLAUCILÂNDIA / MG)",null,null,null,"DATA: ",{"$f":"ORÇAMENTO!C6","v":"     ABRIL / 2025 "},null,null,"BDI DIFERENCIADO:",null,{"$f":"'BDI FORN'!D31/100","v":0.15}]
[null,"SERVIÇO:  ","CPU.1",null,"Referência:","CODEVASF","UNIDADE: ",{"$f":"VLOOKUP(A1,ORÇAMENTO!A11:L30,5)","v":"MOBILIZAÇÃO E DESMOBILIZAÇÃO"}]
[]
[null,"TIPO ITEM","CODIGO ITEM","DESCRIÇÃO ITEM","UNIDADE ITEM","COEFICIENTE","PRECO UNITARIO","CUSTO TOTAL",null,"distancia =",90,"B.DESPACHO"]
[null,"EQUIPAMENTOS",{"$nulls":7},"Pá carregadeira ",null,null,10.1," ton"]
[null,null,"E9001","E9001","E9001",null,"E9001"]
[]
{"$rows_left_out":85}
{"sheet":"BDI SERV","index":3,"n_rows":60,"n_cols":5,"rows_kept":60,"cut":false,"hidden":false,"merged":[[35,0,35,5],[36,0,36,5],[38,1,38,4],[39,2,39,3],[0,1,2,4],[25,1,25,3],[26,1,26,2],[26,3,26,4],[27,3,27,4]]}
[null,"DETALHAMENTO DO BDI - SERVIÇOS"]
[]
[]
[null,"Item","Descrição dos Serviços","% - PV","% - CD"]
[]
[null,1,"ADMINISTRAÇÃO CENTRAL"," ",{"$f":"SUM(E7:E9)","v":4.01}]
[null,"1.1","ESCRITÓRIO CENTRAL",null,4.01]
[null,"1.2","VIAGENS"]
{"$rows_left_out":53}
{"sheet":"BDI FORN","index":4,"n_rows":37,"n_cols":5,"rows_kept":37,"cut":false,"hidden":false,"merged":[[31,1,31,2],[32,0,34,5],[36,0,36,5],[0,1,2,4],[3,1,4,1],[3,2,4,2],[28,0,28,5],[30,1,30,2]]}
[null,"DETALHAMENTO DO BDI - FORNECIMENTO \n(MATERIAL ASFÁLTICO)"]
[]
[]
[null,"Item","Descrição dos Serviços","%","%"]
[null,null,null,"PV","CD"]
[]
[null,1,"ADMINISTRAÇÃO CENTRAL"," ",3.45]
[null,"1.1","ESCRITÓRIO CENTRAL"," "," "]
{"$rows_left_out":30}
{"sheet":"CRONOGRAMA","index":5,"n_rows":19,"n_cols":12,"rows_kept":19,"cut":false,"hidden":false,"merged":[[0,1,0,11],[1,1,2,1],[1,2,2,4],[1,6,1,11],[2,6,2,11],[9,0,10,0],[9,1,10,1],[9,2,10,2],[3,1,3,10],[5,0,6,0],[5,1,6,1],[5,2,6,2],[7,0,8,0],[7,1,8,1],[7,2,8,2],[15,1,16,2],[18,1,22,11],[11,0,12,0],[11,1,12,1],[11,2,12,2],[13,0,14,0],[13,1,14,1],[13,2,14,2]]}
[null,"CRONOGRAMA FÍSICO-FINANCEIRO"]
[null,"OBRA: ",{"$f":"ORÇAMENTO!C5","v":"    PAVIMENTAÇÃO ASFÁLTICA EM CBUQ - VIAS URBANAS DIVERSAS - SEDE E COMUNIDADE RIO DAS PEDRAS (GLAUCILÂNDIA / MG)"},null,null,"VALOR:",{"$f":"ORÇAMENTO!L42","v":1999753.71}]
[{"$nulls":5},"PRAZO: ","180 DIAS "]
[]
[null,"ITEM","ETAPAS/DESCRIÇAO","FISICO/  FINANCEIRO","TOTAL    ETAPAS","MÊS 1","MÊS 2","MÊS 3","MÊS 4","MÊS 5","MÊS 6","TOTAL"]
["A",{"$f":"VLOOKUP(A6,ORÇAMENTO!$A$10:$L$42,2)","v":1},{"$f":"VLOOKUP(A6,ORÇAMENTO!$A$10:$L$42,5)","v":"SERVIÇOS PRELIMINARES "},"FISICO ",{"$f":"ROUND(E7/$G$2,4)","v":0.10199999999999999},0.25,0.15,0.15,0.15,0.15,0.15,{"$f":"SUM(F6:K6)","v":1}]
[null,null,null,"FINANCEIRO",{"$f":"ORÇAMENTO!L10","v":203988.03},{"$f":"ROUND($E$7*F6,2)","v":50997.01},{"$f":"ROUND($E$7*G6,2)","v":30598.2},{"$f":"ROUND($E$7*H6,2)","v":30598.2},{"$f":"ROUND($E$7*I6,2)","v":30598.2},30598.2,30598.2,{"$f":"SUM(F7:K7)","v":203988.01000000004}]
["B",{"$f":"VLOOKUP(A8,ORÇAMENTO!$A$10:$L$42,2)","v":2},{"$f":"VLOOKUP(A8,ORÇAMENTO!$A$10:$L$42,5)","v":"TERRAPLANAGEM E PAVIMENTAÇÃO"},"FISICO ",{"$f":"ROUND(E9/$G$2,4)","v":0.34260000000000002},0.1,0.2,0.2,0.2,0.2,0.1,{"$f":"SUM(F8:K8)","v":0.99999999999999989}]
{"$rows_left_out":12}
{"sheet":"EAI","index":6,"n_rows":90,"n_cols":34,"rows_kept":90,"cut":false,"hidden":false,"merged":[[12,3,24,3],[1,2,3,26],[5,2,7,2],[5,12,7,12],[6,6,7,6],[6,19,6,20],[10,4,10,8],[10,9,10,10],[10,22,10,23],[5,6,5,7],[5,8,5,9],[6,21,6,24],[7,21,7,24]]}
[]
[null,null,"MEMÓRIA DE CÁLCULO"]
[]
[]
[]
[{"$nulls":6},"TIPOLOGIA DO MATERIAL",null,"Emulsão Asfáltica para Serviço de Imprimação",null,null,null,"IMPOSTOS","COFINS",6.4999999999999997E-3,6.4999999999999997E-3]
[{"$nulls":6},"ÍNDICE DE PAVIMENTAÇÃO DNIT","2014-07-01","ÍNDICE INICIAL",270.23700000000002,null,null,null,"PIS",0.03,0.03,null,null,null,"LEGENDA",{"$nulls":8},"As empresas tributadas pelo Lucro Presumido pagam 0,65% de PIS e 3% de COFINS"]
[{"$nulls":7},{"$f":"H9","v":"2025-02-01"},"ÍNDICE FINAL",587.95899999999995,null,null,null," ICMS",0.18,0.18,{"$f":"1-(O8/1)","v":0.82000000000000006},{"$f":"1-(P8/1)","v":0.82000000000000006},{"$f":"1-(Q8/1)","v":0.17999999999999994},"ENTRADA DE DADOS",null,"QUANT.ESTIMADA DE EMULSÃO ASFÁLTICA PARA IMPRIMAÇÃO (TON.):",null,null,null,{"$f":"ORÇAMENTO!H36","v":17.5},"TONELADAS",null,"As empresas tributadas pelo Lucro Real pagam 1,65% de PIS e 7,60% de COFINS"]
{"$rows_left_out":76}
{"sheet":"RR-1C","index":7,"n_rows":92,"n_cols":34,"rows_kept":92,"cut":false,"hidden":false,"merged":[[12,3,26,3],[6,19,6,20],[6,6,7,6],[5,12,7,12],[5,6,5,7],[5,8,5,9],[1,2,3,26],[5,2,7,2],[10,4,10,8],[10,9,10,10],[10,22,10,23],[6,21,6,24],[7,21,7,24]]}
[]
[null,null,"MEMÓRIA DE CÁLCULO"]
[]
[]
[]
[{"$nulls":6},"TIPOLOGIA DO MATERIAL",null,"EMULSÕES ASFÁLTICAS RR-1C",null,null,null,"IMPOSTOS","COFINS",6.4999999999999997E-3,6.4999999999999997E-3]
[{"$nulls":6},"ÍNDICE DE PAVIMENTAÇÃO DNIT","2014-07-01","ÍNDICE INICIAL",270.23700000000002,null,null,null,"PIS",0.03,0.03,null,null,null,"LEGENDA",{"$nulls":8},"As empresas tributadas pelo Lucro Presumido pagam 0,65% de PIS e 3% de COFINS"]
[{"$nulls":7},"2023-10-01","ÍNDICE FINAL",{"$f":"EAI!J8","v":587.95899999999995},null,null,null," ICMS",0.18,0.18,{"$f":"1-(O8/1)","v":0.82000000000000006},{"$f":"1-(P8/1)","v":0.82000000000000006},{"$f":"1-(Q8/1)","v":0.17999999999999994},"ENTRADA DE DADOS",null,"QUANT.ESTIMADA DE RR-1C (TON.):",null,null,null,{"$f":"ORÇAMENTO!H38","v":5.2950000000000017},"TONELADAS",null,"As empresas tributadas pelo Lucro Real pagam 1,65% de PIS e 7,60% de COFINS"]
{"$rows_left_out":78}
{"sheet":"CAP","index":8,"n_rows":91,"n_cols":34,"rows_kept":91,"cut":false,"hidden":false,"merged":[[10,4,10,8],[10,9,10,10],[10,22,10,23],[12,3,24,3],[1,2,3,26],[5,2,7,2],[5,12,7,12],[6,6,7,6],[6,19,6,20],[6,21,6,24],[7,21,7,24],[5,6,5,7],[5,8,5,9]]}
[]
[null,null,"MEMÓRIA DE CÁLCULO"]
[]
[]
[]
[{"$nulls":6},"TIPOLOGIA DO MATERIAL",null,"CIMENTOS ASFÁLTICOS CAP-50-70",null,null,null,"IMPOSTOS","COFINS",6.4999999999999997E-3,6.4999999999999997E-3]
[{"$nulls":6},"ÍNDICE DE PAVIMENTAÇÃO DNIT","2014-07-01","ÍNDICE INICIAL",270.23700000000002,null,null,null,"PIS",0.03,0.03,null,null,null,"LEGENDA",{"$nulls":8},"As empresas tributadas pelo Lucro Presumido pagam 0,65% de PIS e 3% de COFINS"]
[{"$nulls":7},"2023-10-01","ÍNDICE FINAL",{"$f":"EAI!J8","v":587.95899999999995},null,null,null," ICMS",0.18,0.18,{"$f":"1-(O8/1)","v":0.82000000000000006},{"$f":"1-(P8/1)","v":0.82000000000000006},{"$f":"1-(Q8/1)","v":0.17999999999999994},"ENTRADA DE DADOS",{"$nulls":5},169.96,null,null,"As empresas tributadas pelo Lucro Real pagam 1,65% de PIS e 7,60% de COFINS"]
{"$rows_left_out":76}
{"sheet":"MAT.ASF","index":9,"n_rows":33,"n_cols":23,"rows_kept":33,"cut":false,"hidden":false,"merged":[[20,2,25,2],[27,2,32,2],[19,1,19,22],[26,1,26,22],[11,2,12,2],[11,3,11,6],[11,7,11,8],[11,18,11,19],[13,2,18,2],[7,1,7,19],[8,1,10,22],[2,1,2,8],[3,1,3,8],[4,1,4,8],[5,1,5,8],[6,1,6,22]]}
{"$rows_empty":8}
[null,"PLANILHA RESUMO - MATERIAIS ASFÁLTICOS"]
[]
[]
[null,"DATA-BASE","PRODUTOS","LOCALIDADES",null,null,null,"CUSTO ANP (R$/Kg)",null,"CUSTO ANP","IMPOSTOS DO PRODUTO","CUSTO DO PRODUTO COM IMPOSTOS","DMT's","DMT's","CUSTO DO TRANSPORTE TOTAL","ICMS","ATUALIZAÇÃO DO CUSTO DE TRANSPORTE","CUSTO DO TRANSPORTE RODOVIA PAVIMENTADA COM IMPOSTOS E ATUALIZAÇÃO MONETÁRIA","PEDÁGIO ",null,"TOTAL TRANSPORTE","TOTAL PRODUTO","TOTAL GERAL"]
[null,{"$f":"CAP!H9","v":"2025-02-01"},null,"REFINARIAS","ENDEREÇO","ORIGEM - REFINARIAS / DISTRIBUIDORAS","DESTINO","ESTADO","REGIÃO","R$/t","R$/t","R$/t","KM","KM","R$/t","R$/t","R$/t","R$/t","CUSTO POR EIXO","R$/t","R$/t","R$/t","R$/t"]
[null,1,"CAP 50/70","Refinaria Abreu e Lima","Rodovia PE 60, Km 10 - Ipojuca - PE CEP:55590-000",{"$f":"VLOOKUP($W14,CAP!$B:$AA,7,FALSE)","v":"BETIM - MG"},{"$f":"VLOOKUP($W14,CAP!$B:$AA,8,FALSE)","v":"Montes Claros - MG"},{"$f":"VLOOKUP($W14,CAP!$B:$AA,9,FALSE)","v":3.7727151307564442},{"$f":"VLOOKUP($W14,CAP!$B:$AA,10,FALSE)","v":3.814083778291931},{"$f":"VLOOKUP($W14,CAP!$B:$AA,11,FALSE)","v":3772.7151307564441},{"$f":"VLOOKUP($W14,CAP!$B:$AA,12,FALSE)","v":1042.49},{"$f":"VLOOKUP($W14,CAP!$B:$AA,13,FALSE)","v":4815.2051307564443},{"$f":"VLOOKUP($W14,CAP!$B$13:$AA$25,14,FALSE)","v":431},{"$f":"VLOOKUP($W14,'[2]Transporte Cap 50-70'!$B:$AA,15,FALSE)","v":{"$error":"#N/A"}},{"$f":"VLOOKUP($W14,CAP!$B:$AA,18,FALSE)","v":135.97999999999999},{"$f":"VLOOKUP($W14,CAP!$B:$AA,19,FALSE)","v":29.84},{"$f":"VLOOKUP($W14,CAP!$B:$AA,20,FALSE)","v":194.95},{"$f":"VLOOKUP($W14,CAP!$B:$AA,21,FALSE)","v":360.77},{"$f":"VLOOKUP($W14,CAP!$B:$AA,22,FALSE)","v":325.8},{"$f":"VLOOKUP($W14,CAP!$B:$AA,23,FALSE)","v":26.836902800658976},{"$f":"VLOOKUP($W14,CAP!$B:$AA,24,FALSE)","v":387.60690280065899},{"$f":"VLOOKUP($W14,CAP!$B:$AA,25,FALSE)","v":4815.2051307564443},{"$f":"SMALL(CAP!$AA$13:$AA$25,1)","v":5202.8120335571029}]
[null,2,null,"Refinaria Potiguar Clara Camarão","Rodovia RN 221, KM 25 - Guamaré - RN CEP:59598-000",{"$f":"VLOOKUP($W15,CAP!$B:$AA,7,FALSE)","v":"DUQUE DE CAXIAS - RJ"},{"$f":"VLOOKUP($W15,CAP!$B:$AA,8,FALSE)","v":"Montes Claros - MG"},{"$f":"VLOOKUP($W15,CAP!$B:$AA,9,FALSE)","v":3.8276222608052461},{"$f":"VLOOKUP($W15,CAP!$B:$AA,10,FALSE)","v":3.814083778291931},{"$f":"VLOOKUP($W15,CAP!$B:$AA,11,FALSE)","v":3827.6222608052462},{"$f":"VLOOKUP($W15,CAP!$B:$AA,12,FALSE)","v":1057.6600000000001},{"$f":"VLOOKUP($W15,CAP!$B:$AA,13,FALSE)","v":4885.2822608052466},{"$f":"VLOOKUP($W15,CAP!$B$13:$AA$25,14,FALSE)","v":827},{"$f":"VLOOKUP($W15,'[2]Transporte Cap 50-70'!$B:$AA,15,FALSE)","v":{"$error":"#N/A"}},{"$f":"VLOOKUP($W15,CAP!$B:$AA,18,FALSE)","v":236.17},{"$f":"VLOOKUP($W15,CAP!$B:$AA,19,FALSE)","v":51.84},{"$f":"VLOOKUP($W15,CAP!$B:$AA,20,FALSE)","v":338.61},{"$f":"VLOOKUP($W15,CAP!$B:$AA,21,FALSE)","v":626.62},{"$f":"VLOOKUP($W15,CAP!$B:$AA,22,FALSE)","v":700.2},{"$f":"VLOOKUP($W15,CAP!$B:$AA,23,FALSE)","v":57.67710049423394},{"$f":"VLOOKUP($W15,CAP!$B:$AA,24,FALSE)","v":684.29710049423397},{"$f":"VLOOKUP($W15,CAP!$B:$AA,25,FALSE)","v":4885.2822608052466},{"$f":"SMALL(CAP!$AA$13:$AA$25,2)","v":5569.5793612994803}]
{"$rows_left_out":18}