{"text_format":"2","workbook":"xlsx","n_sheets":10,"sheets":["ORÇAMENTO","CPU-SERV","CPU-FORNEC","BDI SERV","BDI FORN","CRONOGRAMA","EAI","RR-1C","CAP","MAT.ASF"],"not_rendered":{"charts":0,"images":3,"macros":0,"external_links":2,"defined_names":12,"comments":5,"pivot_tables":0},"unopened":[],"bounds":{"document_bytes":16777216,"sheet_cells":100000,"run_cost":"one","rows_first":2000,"rows_last":500,"rows_between":2000,"halvings":0,"cell_chars":16384,"cell_head_chars":4096},"cells_cut":0,"cells_raw":0,"read":"whole","date_system":"1900"}

{"sheet":"ORÇAMENTO","index":0,"n_rows":42,"n_cols":12,"rows_kept":42,"cut":false,"hidden":false,"merged":[[4,9,4,10],[5,8,5,10],[6,8,6,10],[41,1,41,4],[0,0,8,0],[0,4,0,11],[1,4,1,11],[2,4,2,11],[6,1,6,4],[7,1,7,11],[4,2,4,8],[5,2,5,7]]}
["<---- NUMERAR SERVIÇOS PARA CPU",null,null,null,"Ministério do Desenvolvimento Regional"]
[{"$nulls":4},"Companhia de Desenvolvimento dos Vales do São Francisco e do Parnaíba"]
[{"$nulls":4},"1ª Superintendência Regional"]
[]
[null,"OBRA: ","    PAVIMENTAÇÃO ASFÁLTICA EM CBUQ - VIAS URBANAS DIVERSAS - SEDE E COMUNIDADE RIO DAS PEDRAS (GLAUCILÂNDIA / MG)",{"$nulls":6},"BDI Serviços (%):",null,{"$f":"'BDI SERV'!E26","v":23.32}]
[null,"DATA:","     ABRIL / 2025 ",{"$nulls":5},"BDI Diferenciado Serviços (%):",null,null,{"$f":"'BDI FORN'!D31","v":15}]
[null,"PRAZO DE EXECUÇÃO:     180 DIAS",{"$nulls":6},"BDI Fornecimentos (%):",null,null,{"$f":"'BDI FORN'!D31","v":15}]
[null,"PLANILHA DE ORÇAMENTAÇÃO"]
[null,"ITEM","CÓDIGO","FONTE","DISCRIMINAÇÃO","TIPO","UNID.","QUANT.","VR.UNIT.S/BDI","PR. UNIT.C/BDI","C. TOT.S/BDI","P. TOT.C/BDI"]
["A",1,null,null,"SERVIÇOS PRELIMINARES ",{"$nulls":5},{"$f":"SUM(K11:K15)","v":165459.99},{"$f":"SUM(L11:L15)","v":203988.03}]
[1,"1.1","CPU.1","CODEVASF","MOBILIZAÇÃO E DESMOBILIZAÇÃO","SERV","GL",2,{"$f":"VLOOKUP(A11,'CPU-SERV'!A:K,11,0)","v":4944.29},{"$f":"TRUNC(_xlfn.IFS(F11=\"SERV\",I11*(1+$L$5/100),F11=\"SERV DIF\",I11*(1+$L$6/100),F11=\"FORN\",I11*(1+$L$7/100)),2)","v":6097.29},{"$f":"TRUNC(H11*I11,2)","v":9888.58},{"$f":"TRUNC(H11*J11,2)","v":12194.58}]
[2,"1.2","CPU.2","CODEVASF","ADMINISTRAÇÃO LOCAL ","SERV","GL",1,{"$f":"VLOOKUP(A12,'CPU-SERV'!A:K,11,0)","v":132621.79},{"$f":"TRUNC(_xlfn.IFS(F12=\"SERV\",I12*(1+$L$5/100),F12=\"SERV DIF\",I12*(1+$L$6/100),F12=\"FORN\",I12*(1+$L$7/100)),2)","v":163549.19},{"$f":"TRUNC(H12*I12,2)","v":132621.79},{"$f":"TRUNC(H12*J12,2)","v":163549.19}]
[3,"1.3","CPU.3","CODEVASF","CANTEIRO DE OBRAS ","SERV","GL",2,{"$f":"VLOOKUP(A13,'CPU-SERV'!A:K,11,0)","v":7137.55},{"$f":"TRUNC(_xlfn.IFS(F13=\"SERV\",I13*(1+$L$5/100),F13=\"SERV DIF\",I13*(1+$L$6/100),F13=\"FORN\",I13*(1+$L$7/100)),2)","v":8802.02},14275.1,17604.04]
[4,"1.4",103689,"SINAPI","PLACA DE OBRA EM CHAPA DE AÇO GALVANIZADO","SERV","M2",6,{"$f":"VLOOKUP(A14,'CPU-SERV'!A:K,11,0)","v":351.42},{"$f":"TRUNC(_xlfn.IFS(F14=\"SERV\",I14*(1+$L$5/100),F14=\"SERV DIF\",I14*(1+$L$6/100),F14=\"FORN\",I14*(1+$L$7/100)),2)","v":433.37},2108.52,2600.2199999999998]
[6,"1.5",78472,"SINAPI","SERVIÇOS TOPOGRÁFICOS PARA PAVIMENTAÇÃO, INCLUSIVE LEVANTAMENTO PLANIALTIMÉTRICO CADASTRAL, GERAÇÃO DE NOTAS DE SERVIÇO, SEÇÕES TRANSVERSAIS E GREIDE, ESTAQUEAMENTO E ACOMPANHAMENTO EXECUTIVO","SERV","M2",13400,{"$f":"VLOOKUP(A15,'CPU-SERV'!A:K,11,0)","v":0.49},{"$f":"TRUNC(_xlfn.IFS(F15=\"SERV\",I15*(1+$L$5/100),F15=\"SERV DIF\",I15*(1+$L$6/100),F15=\"FORN\",I15*(1+$L$7/100)),2)","v":0.6},6566,8040]
["B",2,null,null,"TERRAPLANAGEM E PAVIMENTAÇÃO",{"$nulls":5},{"$f":"SUM(K17:K22)","v":555748.57999999996},{"$f":"SUM(L17:L22)","v":685124.17999999993}]
[7,"2.1",5502140,"SICRO","ESCAVAÇÃO, CARGA E TRANSPORTE DE MATERIAL DE 1ª CATEGORIA - DMT 1.000 A 1.200M, CAMINHO DE SERVIÇO EM REVESTIMENTO PRIMÁRIO","SERV","M3",1999.9985000000001,{"$f":"VLOOKUP(A17,'CPU-SERV'!A:K,11,0)","v":6.74},{"$f":"TRUNC(_xlfn.IFS(F17=\"SERV\",I17*(1+$L$5/100),F17=\"SERV DIF\",I17*(1+$L$6/100),F17=\"FORN\",I17*(1+$L$7/100)),2)","v":8.31},{"$f":"TRUNC(H17*I17,2)","v":13479.98},{"$f":"TRUNC(H17*J17,2)","v":16619.98}]
[9,"2.2",4011209,"SICRO","REGULARIZAÇÃO E COMPACTAÇÃO DO SUBLEITO ","SERV","M2",13400,{"$f":"VLOOKUP(A18,'CPU-SERV'!A:K,11,0)","v":1.54},{"$f":"TRUNC(_xlfn.IFS(F18=\"SERV\",I18*(1+$L$5/100),F18=\"SERV DIF\",I18*(1+$L$6/100),F18=\"FORN\",I18*(1+$L$7/100)),2)","v":1.89},20636,25326]
[10,"2.3",4011276,"SICRO","EXECUÇÃO E COMPACTAÇÃO DE BASE E OU SUB BASE PARA PAVIMENTAÇÃO DE BICA CORRIDA - EXCLUSIVE TRANSPORTE","SERV","M3",2000,{"$f":"VLOOKUP(A19,'CPU-SERV'!A:K,11,0)","v":149.72},{"$f":"TRUNC(_xlfn.IFS(F19=\"SERV\",I19*(1+$L$5/100),F19=\"SERV DIF\",I19*(1+$L$6/100),F19=\"FORN\",I19*(1+$L$7/100)),2)","v":184.63},299440,369260]
[12,"2.4",4011352,"SICRO","IMPRIMAÇÃO COM EMULSÃO ASFÁLTICA (EAI)","SERV","M2",13400,{"$f":"VLOOKUP(A20,'CPU-SERV'!A:K,11,0)","v":0.4},{"$f":"TRUNC(_xlfn.IFS(F20=\"SERV\",I20*(1+$L$5/100),F20=\"SERV DIF\",I20*(1+$L$6/100),F20=\"FORN\",I20*(1+$L$7/100)),2)","v":0.49},5360,6566]
[13,"2.5",4011353,"SICRO","PINTURA DE LIGAÇÃO COM EMULSÃO ASFÁLTICA RR-1C","SERV","M2",11700.000000000002,{"$f":"VLOOKUP(A21,'CPU-SERV'!A:K,11,0)","v":0.27},{"$f":"TRUNC(_xlfn.IFS(F21=\"SERV\",I21*(1+$L$5/100),F21=\"SERV DIF\",I21*(1+$L$6/100),F21=\"FORN\",I21*(1+$L$7/100)),2)","v":0.33},3159,3861]
[14,"2.6",4011463,"SICRO","EXECUÇÃO DE PAVIMENTO COM APLICAÇÃO DE CONCRETO ASFÁLTICO USINADO A QUENTE (CBUQ), CAMADA DE ROLAMENTO - EXCLUSIVE TRANSPORTE","SERV","T",1120,{"$f":"VLOOKUP(A22,'CPU-SERV'!A:K,11,0)","v":190.78},{"$f":"TRUNC(_xlfn.IFS(F22=\"SERV\",I22*(1+$L$5/100),F22=\"SERV DIF\",I22*(1+$L$6/100),F22=\"FORN\",I22*(1+$L$7/100)),2)","v":235.26},213673.60000000001,263491.20000000001]
["C",3,null,null,"TRANSPORTE DE MATERIAIS",{"$nulls":5},{"$f":"SUM(K24:K28)","v":174298},{"$f":"SUM(L24:L28)","v":213308}]
[15,"3.1",5915321,"SICRO","TRANSPORTE COM CAMINHÃO BASCULANTE, EM RODOVIA PAVIMENTADA","SERV","TXKM",190000.00225000002,{"$f":"VLOOKUP(A24,'CPU-SERV'!A:K,11,0)","v":0.54},{"$f":"TRUNC(_xlfn.IFS(F24=\"SERV\",I24*(1+$L$5/100),F24=\"SERV DIF\",I24*(1+$L$6/100),F24=\"FORN\",I24*(1+$L$7/100)),2)","v":0.66},{"$f":"TRUNC(H24*I24,2)","v":102600},{"$f":"TRUNC(H24*J24,2)","v":125400}]
[16,"3.2",5915320,"SICRO","TRANSPORTE COM CAMINHÃO BASCULANTE, RODOVIA EM REVESTIMENTO PRIMÁRIO","SERV","TXKM",18000.000887500002,{"$f":"VLOOKUP(A25,'CPU-SERV'!A:K,11,0)","v":0.72},{"$f":"TRUNC(_xlfn.IFS(F25=\"SERV\",I25*(1+$L$5/100),F25=\"SERV DIF\",I25*(1+$L$6/100),F25=\"FORN\",I25*(1+$L$7/100)),2)","v":0.88},12960,15840]
[17,"3.3",5914434,"SICRO","TRANSPORTE COM CAMINHÃO CARROCERIA 9T, EM VIA URBANA PREDOMINANTEMENTE PAVIMENTADA","SERV","TXKM",20000.0007018832,{"$f":"VLOOKUP(A26,'CPU-SERV'!A:K,11,0)","v":0.74},{"$f":"TRUNC(_xlfn.IFS(F26=\"SERV\",I26*(1+$L$5/100),F26=\"SERV DIF\",I26*(1+$L$6/100),F26=\"FORN\",I26*(1+$L$7/100)),2)","v":0.91},14800,18200]
[18,"3.4",5914612,"SICRO","TRANSPORTE DE MASSA ASFÁLTICA COM CAMINHÃO BASCULANTE, EM VIA URBANA PREDOMINANTEMENTE PAVIMENTADA","SERV","TXKM",45000.000000000007,{"$f":"VLOOKUP(A27,'CPU-SERV'!A:K,11,0)","v":0.93},{"$f":"TRUNC(_xlfn.IFS(F27=\"SERV\",I27*(1+$L$5/100),F27=\"SERV DIF\",I27*(1+$L$6/100),F27=\"FORN\",I27*(1+$L$7/100)),2)","v":1.1399999999999999},41850,51300]
[19,"3.5",5914622,"SICRO","TRANSPORTE COM CAMINHÃO TANQUE DE TRANSPORTE DE MATERIAL ASFÁLTICO DE 30000 L, EM VIA URBANA PREDOMINANTEMENTE PAVIMENTADA","SERV","TXKM",1200,{"$f":"VLOOKUP(A28,'CPU-SERV'!A:K,11,0)","v":1.74},{"$f":"TRUNC(_xlfn.IFS(F28=\"SERV\",I28*(1+$L$5/100),F28=\"SERV DIF\",I28*(1+$L$6/100),F28=\"FORN\",I28*(1+$L$7/100)),2)","v":2.14},2088,2568]
["E",4,null,null,"DRENAGEM E OBRAS COMPLEMENTARES",{"$nulls":5},{"$f":"SUM(K30:K34)","v":343114.33999999997},{"$f":"SUM(L30:L34)","v":423105.85}]
[20,"4.1",94273,"SINAPI","ASSENTAMENTO DE GUIA (MEIO-FIO) PRÉ-MOLDADO DE CONCRETO - 100X15X13X30 CM (COMPRIMENTO X BASE INFERIOR X BASE SUPERIOR X ALTURA) - USO VIÁRIO","SERV","M",3699.9999999999995,{"$f":"VLOOKUP(A30,'CPU-SERV'!A:K,11,0)","v":53.22},{"$f":"TRUNC(_xlfn.IFS(F30=\"SERV\",I30*(1+$L$5/100),F30=\"SERV DIF\",I30*(1+$L$6/100),F30=\"FORN\",I30*(1+$L$7/100)),2)","v":65.63},{"$f":"TRUNC(H30*I30,2)","v":196914},{"$f":"TRUNC(H30*J30,2)","v":242831}]
[23,"4.2","94287a","SINAPI","EXECUÇÃO DE SARJETA EM CONCRETO USINADO, MOLDADO IN LOCO - 30CM DE BASE X 5CM DE ALTURA","SERV","M",3699.9999999999995,{"$f":"VLOOKUP(A31,'CPU-SERV'!A:K,11,0)","v":25.19},{"$f":"TRUNC(_xlfn.IFS(F31=\"SERV\",I31*(1+$L$5/100),F31=\"SERV DIF\",I31*(1+$L$6/100),F31=\"FORN\",I31*(1+$L$7/100)),2)","v":31.06},93203,114922]
[46,"4.3",5213440,"SICRO","PLACA DE REGULAMENTAÇÃO EM AÇO, D=60CM - PELÍCULA RETRORREFLETIVA - FORNECIMENTO E INSTALAÇÃO, INCLUSIVE  SUPORTE","SERV","UN.",27,{"$f":"VLOOKUP(A32,'CPU-SERV'!A:K,11,0)","v":259.45999999999998},{"$f":"TRUNC(_xlfn.IFS(F32=\"SERV\",I32*(1+$L$5/100),F32=\"SERV DIF\",I32*(1+$L$6/100),F32=\"FORN\",I32*(1+$L$7/100)),2)","v":319.95999999999998},7005.42,8638.92]
[49,"4.4",5213401,"SICRO","PINTURA DE EIXO VIÁRIO SOBRE ASFALTO COM TINTA RETRORREFLETIVA A BASE DE RESINA ACRÍLICA COM MICROESFERAS DE VIDRO, APLICAÇÃO MECÂNICA COM DEMARCADORA AUTOPROPELIDA","SERV","M2",570.00100000000009,{"$f":"VLOOKUP(A33,'CPU-SERV'!A:K,11,0)","v":29.17},{"$f":"TRUNC(_xlfn.IFS(F33=\"SERV\",I33*(1+$L$5/100),F33=\"SERV DIF\",I33*(1+$L$6/100),F33=\"FORN\",I33*(1+$L$7/100)),2)","v":35.97},16626.919999999998,20502.93]
[51,"4.5",5213405,"SICRO","PINTURA DE FAIXA DE PEDESTRE OU ZEBRADA TINTA RETRORREFLETIVA A BASE DE RESINA ACRÍLICA COM MICROESFERAS DE VIDRO, APLICAÇÃO MANUAL","SERV","M2",700.00000000000011,{"$f":"VLOOKUP(A34,'CPU-SERV'!A:K,11,0)","v":41.95},{"$f":"TRUNC(_xlfn.IFS(F34=\"SERV\",I34*(1+$L$5/100),F34=\"SERV DIF\",I34*(1+$L$6/100),F34=\"FORN\",I34*(1+$L$7/100)),2)","v":51.73},29365,36211]
["F",5,null,null,"FORNECIMENTOS - MATERIAL ASFÁLTICO (BDI DIFERENCIADO)",{"$nulls":5},{"$f":"SUM(K36:K41)","v":412372.06},{"$f":"SUM(L36:L41)","v":474227.65}]
["F1","5.1","CPU.7","CODEVASF","AQUISIÇÃO DE EMULSÃO ASFÁLTICA PARA IMPRIMAÇÃO (EAI) - EXCLUSIVE TRANSPORTE","FORN","T",17.5,{"$f":"VLOOKUP(A36,'CPU-FORNEC'!A:J,9,0)","v":3532.13},{"$f":"TRUNC(_xlfn.IFS(F36=\"SERV\",I36*(1+$L$5/100),F36=\"SERV DIF\",I36*(1+$L$6/100),F36=\"FORN\",I36*(1+$L$7/100)),2)","v":4061.94},{"$f":"TRUNC(H36*I36,2)","v":61812.27},{"$f":"TRUNC(H36*J36,2)","v":71083.95}]
["F2","5.2","CPU.8","CODEVASF","TRANSPORTE DE EMULSÃO ASFÁLTICA PARA IMPRIMAÇÃO (EAI)","SERV DIF","T",17.5,{"$f":"VLOOKUP(A37,'CPU-FORNEC'!A:J,9,0)","v":398},{"$f":"TRUNC(_xlfn.IFS(F37=\"SERV\",I37*(1+$L$5/100),F37=\"SERV DIF\",I37*(1+$L$6/100),F37=\"FORN\",I37*(1+$L$7/100)),2)","v":457.7},6965,8009.75]
["F3","5.3","CPU.9","CODEVASF","AQUISIÇÃO DE EMULSAO ASFALTICA CATIONICA RR-1C - EXCLUSIVE TRANSPORTE","FORN","T",5.2950000000000017,{"$f":"VLOOKUP(A38,'CPU-FORNEC'!A:J,9,0)","v":3480.79},{"$f":"TRUNC(_xlfn.IFS(F38=\"SERV\",I38*(1+$L$5/100),F38=\"SERV DIF\",I38*(1+$L$6/100),F38=\"FORN\",I38*(1+$L$7/100)),2)","v":4002.9},18430.78,21195.35]
["F4","5.4","CPU.10","CODEVASF","TRANSPORTE DE EMULSÃO ASFÁLTICA CATIONICA RR-1C","SERV DIF","T",5.2950000000000017,{"$f":"VLOOKUP(A39,'CPU-FORNEC'!A:J,9,0)","v":489.22},{"$f":"TRUNC(_xlfn.IFS(F39=\"SERV\",I39*(1+$L$5/100),F39=\"SERV DIF\",I39*(1+$L$6/100),F39=\"FORN\",I39*(1+$L$7/100)),2)","v":562.6},2590.41,2978.96]
["F5","5.5","CPU.11","CODEVASF","AQUISIÇÃO DE CONCRETO ASFÁLTICO DE PETRÓLEO - CAP 50/70 - EXCLUSIVE TRANSPORTE","FORN","T",62,{"$f":"VLOOKUP(A40,'CPU-FORNEC'!A:J,9,0)","v":4815.2},{"$f":"TRUNC(_xlfn.IFS(F40=\"SERV\",I40*(1+$L$5/100),F40=\"SERV DIF\",I40*(1+$L$6/100),F40=\"FORN\",I40*(1+$L$7/100)),2)","v":5537.48},298542.40000000002,343323.76]
["F6","5.6","CPU.12","CODEVASF","TRANSPORTE DE CONCRETO ASFÁLTICO DE PETRÓLEO - CAP 50/70","SERV DIF","T",62,{"$f":"VLOOKUP(A41,'CPU-FORNEC'!A:J,9,0)","v":387.6},{"$f":"TRUNC(_xlfn.IFS(F41=\"SERV\",I41*(1+$L$5/100),F41=\"SERV DIF\",I41*(1+$L$6/100),F41=\"FORN\",I41*(1+$L$7/100)),2)","v":445.74},24031.200000000001,27635.88]
[null,"TOTAL GERAL DA OBRA COM BDI ",{"$nulls":8},{"$f":"SUM(K10,K16,K23,K29,K35)","v":1650992.97},{"$f":"SUM(L10,L16,L23,L29,L35)","v":1999753.71}]

{"sheet":"CPU-SERV","index":1,"n_rows":904,"n_cols":11,"rows_kept":904,"cut":false,"hidden":false,"merged":[[887,3,887,7],[889,8,889,9],[894,3,894,7],[895,1,896,2],[895,3,896,3],[895,4,896,4],[895,5,895,7],[895,9,896,9],[849,3,850,3],[849,4,850,4],[849,5,849,7],[849,9,850,9],[872,3,872,7],[873,3,873,7],[874,3,874,7],[877,7,877,9],[883,3,883,7],[884,7,884,9],[863,8,863,9],[864,1,865,2],[864,3,865,3],[864,4,864,5],[864,6,864,7],[869,7,869,9],[859,0,903,0],[860,2,860,9],[861,1,862,3],[861,4,861,5],[862,4,862,5],[863,2,863,7],[901,3,901,7],[902,5,902,7],[809,3,809,7],[810,5,810,7],[774,0,811,0],[775,2,775,9],[776,1,777,3],[776,4,776,5],[777,4,777,5],[778,2,778,7],[826,3,826,7],[827,3,827,7],[828,3,828,7],[831,7,831,9],[837,3,837,7],[838,7,838,9],[817,8,817,9],[818,1,819,2],[818,3,819,3],[818,4,818,5],[818,6,818,7],[823,7,823,9],[813,0,857,0],[814,2,814,9],[815,1,816,3],[815,4,815,5],[816,4,816,5],[817,2,817,7],[855,3,855,7],[856,5,856,7],[841,3,841,7],[843,8,843,9],[848,3,848,7],[849,1,850,2],[766,3,767,3],[766,4,767,4],[766,5,766,7],[766,9,767,9],[799,3,799,7],[801,8,801,9],[804,3,804,7],[805,1,806,2],[805,3,806,3],[805,4,806,4],[805,5,805,7],[805,9,806,9],[787,3,787,7],[788,3,788,7],[789,3,789,7],[792,7,792,9],[795,3,795,7],[796,7,796,9],[778,8,778,9],[779,1,780,2],[779,3,780,3],[779,4,779,5],[779,6,779,7],[784,7,784,9],[729,3,729,7],[730,5,730,7],[694,0,731,0],[695,2,695,9],[696,1,697,3],[696,4,696,5],[697,4,697,5],[698,2,698,7],[746,3,746,7],[747,3,747,7],[748,3,748,7],[751,7,751,9],[756,3,756,7],[757,7,757,9],[737,8,737,9],[738,1,739,2],[738,3,739,3],[738,4,738,5],[738,6,738,7],[743,7,743,9],[733,0,772,0],[734,2,734,9],[735,1,736,3],[735,4,735,5],[736,4,736,5],[737,2,737,7],[770,3,770,7],[771,5,771,7],[760,3,760,7],[762,8,762,9],[765,3,765,7],[766,1,767,2],[686,3,687,3],[686,4,687,4],[686,5,686,7],[686,9,687,9],[719,3,719,7],[721,8,721,9],[724,3,724,7],[725,1,726,2],[725,3,726,3],[725,4,726,4],[725,5,725,7],[725,9,726,9],[707,3,707,7],[708,3,708,7],[709,3,709,7],[712,7,712,9],[715,3,715,7],[716,7,716,9],[698,8,698,9],[699,1,700,2],[699,3,700,3],[699,4,699,5],[699,6,699,7],[704,7,704,9],[668,3,668,7],[669,3,669,7],[670,3,670,7],[673,7,673,9],[676,3,676,7],[677,7,677,9],[659,8,659,9],[660,1,661,2],[660,3,661,3],[660,4,660,5],[660,6,660,7],[665,7,665,9],[651,3,651,7],[652,5,652,7],[655,0,692,0],[656,2,656,9],[657,1,658,3],[657,4,657,5],[658,4,658,5],[659,2,659,7],[690,3,690,7],[691,5,691,7],[616,0,653,0],[617,2,617,9],[618,1,619,3],[618,4,618,5],[619,4,619,5],[620,2,620,7],[680,3,680,7],[682,8,682,9],[685,3,685,7],[686,1,687,2],[641,3,641,7],[643,8,643,9],[646,3,646,7],[647,1,648,2],[647,3,648,3],[647,4,648,4],[647,5,647,7],[647,9,648,9],[629,3,629,7],[630,3,630,7],[631,3,631,7],[634,7,634,9],[637,3,637,7],[638,7,638,9],[620,8,620,9],[621,1,622,2],[621,3,622,3],[621,4,621,5],[621,6,621,7],[626,7,626,9],[599,7,599,9],[581,8,581,9],[582,1,583,2],[582,3,583,3],[582,4,582,5],[582,6,582,7],[587,7,587,9],[534,3,534,7],[535,5,535,7],[577,0,614,0],[578,2,578,9],[579,1,580,3],[579,4,579,5],[580,4,580,5],[581,2,581,7],[612,3,612,7],[613,5,613,7],[499,0,536,0],[500,2,500,9],[501,1,502,3],[501,4,501,5],[502,4,502,5],[602,3,602,7],[604,8,604,9],[607,3,607,7],[608,1,609,2],[608,3,609,3],[608,4,609,4],[608,5,608,7],[608,9,609,9],[513,3,513,7],[514,3,514,7],[517,7,517,9],[520,3,520,7],[521,7,521,9],[503,8,503,9],[504,1,505,2],[504,3,505,3],[504,4,504,5],[504,6,504,7],[509,7,509,9],[590,3,590,7],[591,3,591,7],[592,3,592,7],[595,7,595,9],[598,3,598,7],[503,2,503,7],[433,8,433,9],[436,3,436,7],[437,1,438,2],[437,3,438,3],[437,4,438,4],[437,5,437,7],[437,9,438,9],[487,1,488,2],[487,3,488,3],[487,4,488,4],[487,5,487,7],[487,9,488,9],[495,3,495,7],[477,3,477,7],[479,8,479,9],[486,3,486,7],[512,3,512,7],[470,7,470,8],[496,5,496,7],[524,3,524,7],[526,8,526,9],[529,3,529,7],[530,1,531,2],[530,3,531,3],[530,4,531,4],[530,5,530,7],[530,9,531,9],[371,6,371,7],[376,7,376,9],[419,3,419,7],[420,3,420,7],[421,3,421,7],[424,7,424,9],[427,3,427,7],[428,7,428,9],[409,8,409,9],[410,1,411,2],[410,3,411,3],[410,4,410,5],[410,6,410,7],[416,7,416,9],[401,3,401,7],[402,5,402,7],[380,3,380,7],[381,3,381,7],[384,7,384,9],[387,3,387,7],[388,7,388,9],[475,7,475,9],[431,3,431,7],[405,0,443,0],[406,2,406,9],[407,1,408,3],[407,4,407,5],[408,4,408,5],[409,2,409,7],[441,3,441,7],[442,5,442,7],[385,7,385,8],[366,0,403,0],[367,2,367,9],[368,1,369,3],[368,4,368,5],[369,4,369,5],[370,2,370,7],[352,3,352,7],[354,8,354,9],[357,3,357,7],[358,1,359,2],[358,3,359,3],[358,4,359,4],[358,5,358,7],[358,9,359,9],[391,3,391,7],[393,8,393,9],[396,3,396,7],[397,1,398,2],[397,3,398,3],[397,4,398,4],[397,5,397,7],[397,9,398,9],[379,3,379,7],[370,8,370,9],[371,1,372,2],[371,3,372,3],[371,4,371,5],[340,3,340,7],[341,3,341,7],[342,3,342,7],[345,7,345,9],[348,3,348,7],[349,7,349,9],[331,8,331,9],[332,1,333,2],[332,3,333,3],[332,4,332,5],[332,6,332,7],[337,7,337,9],[327,0,364,0],[328,2,328,9],[329,1,330,3],[329,4,329,5],[330,4,330,5],[331,2,331,7],[362,3,362,7],[363,5,363,7],[346,7,346,8],[313,3,313,7],[315,8,315,9],[318,3,318,7],[319,1,320,2],[319,3,320,3],[319,4,320,4],[319,5,319,7],[319,9,320,9],[278,5,278,7],[278,9,279,9],[260,3,260,7],[261,3,261,7],[248,6,248,7],[257,7,257,9],[301,3,301,7],[302,3,302,7],[303,3,303,7],[306,7,306,9],[309,3,309,7],[310,7,310,9],[290,8,290,9],[291,1,292,2],[291,3,292,3],[291,4,291,5],[291,6,291,7],[298,7,298,9],[282,3,282,7],[283,5,283,7],[262,3,262,7],[265,7,265,9],[268,3,268,7],[269,7,269,9],[247,8,247,9],[248,1,249,2],[248,3,249,3],[248,4,248,5],[209,6,209,7],[214,7,214,9],[239,3,239,7],[240,5,240,7],[219,3,219,7],[222,7,222,9],[225,3,225,7],[226,7,226,9],[286,0,325,0],[287,2,287,9],[288,1,289,3],[288,4,288,5],[289,4,289,5],[290,2,290,7],[323,3,323,7],[324,5,324,7],[243,0,284,0],[244,2,244,9],[245,1,246,3],[245,4,245,5],[246,4,246,5],[247,2,247,7],[272,3,272,7],[274,8,274,9],[277,3,277,7],[278,1,279,2],[278,3,279,3],[278,4,279,4],[204,0,241,0],[205,2,205,9],[206,1,207,3],[206,4,206,5],[207,4,207,5],[208,2,208,7],[190,3,190,7],[192,8,192,9],[195,3,195,7],[196,1,197,2],[196,3,197,3],[196,4,197,4],[196,5,196,7],[196,9,197,9],[229,3,229,7],[231,8,231,9],[234,3,234,7],[235,1,236,2],[235,3,236,3],[235,4,236,4],[235,5,235,7],[235,9,236,9],[217,3,217,7],[218,3,218,7],[208,8,208,9],[209,1,210,2],[209,3,210,3],[209,4,209,5],[163,0,202,0],[200,3,200,7],[201,5,201,7],[178,3,178,7],[179,3,179,7],[180,3,180,7],[183,7,183,9],[186,3,186,7],[187,7,187,9],[167,8,167,9],[168,1,169,2],[168,3,169,3],[168,4,168,5],[168,6,168,7],[173,7,173,9],[164,2,164,9],[165,1,166,3],[165,4,165,5],[166,4,166,5],[167,2,167,7],[151,8,151,9],[154,3,154,7],[155,1,156,2],[155,3,156,3],[155,4,156,4],[155,5,155,7],[155,9,156,9],[136,3,136,7],[137,3,137,7],[140,7,140,9],[145,3,145,7],[146,7,146,9],[149,3,149,7],[127,1,128,2],[127,3,128,3],[127,4,127,5],[127,6,127,7],[132,7,132,9],[135,3,135,7],[119,5,119,7],[122,0,161,0],[123,2,123,9],[124,1,125,3],[124,4,124,5],[125,4,125,5],[126,2,126,7],[126,8,126,9],[159,3,159,7],[160,5,160,7],[114,1,115,2],[114,3,115,3],[114,4,115,4],[114,5,114,7],[114,9,115,9],[118,3,118,7],[93,7,93,9],[98,3,98,7],[101,7,101,9],[104,3,104,7],[105,7,105,9],[108,3,108,7],[83,0,120,0],[84,2,84,9],[85,1,86,3],[86,4,86,5],[87,2,87,7],[87,8,87,9],[88,1,89,2],[110,8,110,9],[113,3,113,7],[96,3,96,7],[97,3,97,7],[88,3,89,3],[88,4,88,5],[88,6,88,7],[79,3,79,7],[80,5,80,7],[85,4,85,5],[74,3,74,7],[75,1,76,2],[75,3,76,3],[75,4,76,4],[75,5,75,7],[75,9,76,9],[57,3,57,7],[60,7,60,9],[63,3,63,7],[64,7,64,9],[69,3,69,7],[71,8,71,9],[44,3,45,3],[44,4,44,5],[44,6,44,7],[49,7,49,9],[55,3,55,7],[56,3,56,7],[41,1,42,3],[41,4,41,5],[42,4,42,5],[43,2,43,7],[43,8,43,9],[44,1,45,2],[0,0,37,0],[3,4,3,5],[2,4,2,5],[1,2,1,9],[2,1,3,3],[31,3,32,3],[31,4,32,4],[31,5,31,7],[31,9,32,9],[35,3,35,7],[36,5,36,7],[10,7,10,9],[13,3,13,7],[14,3,14,7],[15,3,15,7],[18,7,18,9],[30,3,30,7],[31,1,32,2],[22,7,22,9],[25,3,25,7],[27,8,27,9],[21,3,21,7],[4,2,4,7],[4,8,4,9],[5,1,6,2],[5,3,6,3],[5,4,5,5],[5,6,5,7],[445,0,497,0],[446,2,446,9],[447,1,448,3],[447,4,447,5],[448,4,448,5],[449,2,449,7],[449,8,449,9],[450,1,451,2],[450,3,451,3],[450,4,450,5],[450,6,450,7],[458,7,458,9],[460,3,460,7],[461,3,461,7],[462,3,462,7],[465,7,465,9],[474,3,474,7],[39,0,81,0],[40,2,40,9],[538,0,575,0],[563,3,563,7],[565,8,565,9],[568,3,568,7],[569,1,570,2],[569,3,570,3],[569,4,570,4],[569,5,569,7],[569,9,570,9],[573,3,573,7],[574,5,574,7],[539,2,539,9],[540,1,541,3],[540,4,540,5],[541,4,541,5],[542,2,542,7],[542,8,542,9],[543,1,544,2],[543,3,544,3],[543,4,543,5],[543,6,543,7],[548,7,548,9],[551,3,551,7],[552,3,552,7],[553,3,553,7],[556,7,556,9],[559,3,559,7],[560,7,560,9]]}
[1,"1ª/GRD",{"$nulls":8},{"$f":"J37","v":4944.29}]
[null,"OBRA:","    PAVIMENTAÇÃO ASFÁLTICA EM CBUQ - VIAS URBANAS DIVERSAS - SEDE E COMUNIDADE RIO DAS PEDRAS (GLAUCILÂNDIA / MG)"]
[null,"Custo Unitário de Referência",null,null,"Minas Gerais"]
[{"$nulls":4}," Janeiro/2025",null,null,"Produção da equipe ",1,{"$f":"VLOOKUP(A1,ORÇAMENTO!$A$10:$L$42,7,1)","v":"GL"}]
[null,"CPU.1","MOBILIZAÇÃO E DESMOBILIZAÇÃO",{"$nulls":5},"Valores em reais (R$)"]
[null,"A - EQUIPAMENTOS",null,"Quantidade","Utilização",null,"Custo Horário",null,null,"Custo"]
[{"$nulls":4},"Operativa","Improdutiva","Produtivo","Improdutivo",null,"Horário Total"]
[null,"E9687","Caminhão carroceria com capacidade de 5 t - 115 kW",8,0.6,0.4,146.88079999999999,57.423099999999998,null,{"$f":"D8*(E8*G8+F8*H8)","v":888.78175999999996}]
[null,"E9575","Caminhão basculante com caçamba estanque com capacidade de 14 m³ - 210 kW",8,1,0,309.83940000000001,90.412199999999999,null,{"$f":"D9*(E9*G9+F9*H9)","v":2478.7152000000001}]
[{"$nulls":7},"Custo horário total de equipamentos",null,{"$f":"SUM(J8:J9)","v":3367.4969599999999}]
[null,"B - MÃO DE OBRA",null,"Quantidade","Unidade",null,"Custo Horário","Custo Horário Total"]
[null,"P9824","Servente",8,"h",null,21.3355,null,null,{"$f":"D12*G12","v":170.684}]
[{"$nulls":9},{"$f":"D13*G13","v":0}]
[null,null,null,"Custo horário total de mão de obra",{"$nulls":5},{"$f":"SUM(J12:J13)","v":170.684}]
[null,null,null,"Custo horário total de execução",{"$nulls":5},{"$f":"J10+J14","v":3538.1809600000001}]
[null,null,null,"Custo unitário de execução",{"$nulls":5},{"$f":"J15/I4","v":3538.1809600000001}]
[{"$nulls":7},"Custo do FIC",null,0]
[{"$nulls":7},"Custo do FIT",null,0]
[null,"C - MATERIAL",null,"Quantidade","Unidade",null,"Preço Unitário","Custo Unitário"]
[null,"-",0,null,0,null,0,null,null,{"$f":"D20*G20","v":0}]
[null,"-",0,null,0,null,0,null,null,{"$f":"D21*G21","v":0}]
[null,null,null,"Custo unitário total de material",{"$nulls":5},{"$f":"SUM(J20:J21)","v":0}]
[null,"D - ATIVIDADES AUXILIARES",null,"Quantidade","Unidade",null,"Custo Unitário","Custo Unitário"]
[null,5914640,"Transporte com cavalo mecânico com semirreboque com capacidade de 30 t - rodovia pavimentada",2466.8700000000003,"tkm",null,0.56999999999999995,null,null,{"$f":"D24*G24","v":1406.1159}]
[null,"-",0,0,0,null,0,null,null,{"$f":"D25*G25","v":0}]
[null,null,null,"Custo total de atividades auxiliares",{"$nulls":5},{"$f":"SUM(J24:J25)","v":1406.1159}]
[{"$nulls":7},"Subtotal",null,{"$f":"J16+J22+J26+J17+J18","v":4944.2968600000004}]
[null,"E - TEMPO FIXO",null,"Código","Quantidade","Unidade",null,"Custo Unitário","Custo Unitário"]
[null,"-",0,"-",null,0,null,0,null,{"$f":"ROUNDDOWN(E29*H29,4)","v":0}]
[null,"-",0,"-",null,0,null,0,null,{"$f":"ROUNDDOWN(E30*H30,4)","v":0}]
[null,null,null,"Custo unitário total de tempo fixo",{"$nulls":5},{"$f":"SUM(J29:J30)","v":0}]
[null,"F - MOMENTO DE TRANSPORTE",null,"Quantidade","Unidade","DMT",null,null,null,"Custo Unitário"]
[{"$nulls":5},"LN","RP","P"]
[null,"-",0,null,"tkm"]
[null,"-",0,null,"tkm"]
[null,null,null,"Custo unitário total de transporte"]
[{"$nulls":5},"Custo unitário direto total",null,null,null,{"$f":"TRUNC(J27+J31,2)","v":4944.29}]
[null,"Obs."]
[]
[{"$f":"A1+1","v":2},"1ª/GRD",{"$nulls":8},{"$f":"J81","v":132621.79}]
[null,"OBRA:","    PAVIMENTAÇÃO ASFÁLTICA EM CBUQ - VIAS URBANAS DIVERSAS - SEDE E COMUNIDADE RIO DAS PEDRAS (GLAUCILÂNDIA / MG)"]
[null,"Custo Unitário de Referência",null,null,"Minas Gerais"]
[{"$nulls":4}," Janeiro/2025",null,null,"Produção da equipe ",0.16666666666666666,{"$f":"VLOOKUP(A40,ORÇAMENTO!$A$10:$L$42,7,1)","v":"GL"}]
[null,"CPU.2","ADMINISTRAÇÃO LOCAL ",{"$nulls":5},"Valores em reais (R$)"]
[null,"A - EQUIPAMENTOS",null,"Quantidade","Utilização",null,"Custo Horário",null,null,"Custo"]
[{"$nulls":4},"Operativa","Improdutiva","Produtivo","Improdutivo",null,"Horário Total"]
[null,"-",0,null,null,null,0,0,null,{"$f":"D47*(E47*G47+F47*H47)","v":0}]
[null,"-",0,null,null,null,0,0,null,{"$f":"D48*(E48*G48+F48*H48)","v":0}]
[{"$nulls":7},"Custo horário total de equipamentos",null,{"$f":"SUM(J47:J48)","v":0}]
[null,"B - MÃO DE OBRA",null,"Quantidade","Unidade",null,"Custo Horário","Custo Horário Total"]
[null,"P9812","Engenheiro",0.20773292183204414,"mês",null,26055.551500000001,null,null,{"$f":"D51*G51","v":5412.5958430403007}]
[null,"P9840","Encarregado geral",1,"mês",null,9987.8731842974994,null,null,{"$f":"D52*G52","v":9987.8731842974994}]
[null,"P9876","Técnico de segurança do trabalho",0.5,"mês",null,5884.1547,null,null,2942.07735]
[null,"P9858","Laboratorista",0.5,"mês",null,4782.9530249999998,null,null,2391.4765124999999]
[null,"P9806","Auxiliar administrativo",0.25,"mês",null,3354.0398249999998,null,null,838.50995624999996]
[null,null,null,"Custo horário total de mão de obra",{"$nulls":5},{"$f":"SUM(J51:J55)","v":21572.532846087801}]
[null,null,null,"Custo horário total de execução",{"$nulls":5},{"$f":"J49+J56","v":21572.532846087801}]
[null,null,null,"Custo unitário de execução",{"$nulls":5},{"$f":"J57/I43","v":129435.19707652681}]
[{"$nulls":7},"Custo do FIC",null,"-"]
[{"$nulls":7},"Custo do FIT",null,"-"]
[null,"C - MATERIAL",null,"Quantidade","Unidade",null,"Preço Unitário","Custo Unitário"]
[null,"-",0,0,0,null,0,null,null,{"$f":"D62*G62","v":0}]
[null,"-",0,0,0,null,0,null,null,0]
[null,null,null,"Custo unitário total de material",{"$nulls":5},{"$f":"SUM(J62:J63)","v":0}]
[null,"D - ATIVIDADES AUXILIARES",null,"Quantidade","Unidade",null,"Custo Unitário","Custo Unitário"]
[null,14250,"Energia Elétrica",360,"kwh",null,0.95,null,null,{"$f":"D66*G66","v":342}]
[null,44480,"Tarifa A - Água e Esgoto",24,"m³",null,17.97,null,null,{"$f":"D67*G67","v":431.28}]
[null,5212560,"Placa de advertência para sinalização de obras montada em suporte metálico móvel, lado 1,00 m - utilização de 600 ciclos - fornecimento, 01 implantação e 01 retirada diária",528,"un.dia",null,3.89,null,null,{"$f":"D68*G68","v":2053.92}]
[null,"Cotação","Telefone",6,"mês",null,59.9,null,null,{"$f":"D69*G69","v":359.4}]
[null,null,null,"Custo total de atividades auxiliares",{"$nulls":5},{"$f":"SUM(J66:J69)","v":3186.6}]
[{"$nulls":7},"Subtotal",null,{"$f":"J58+J64+J70","v":132621.7970765268}]
[null,"E - TEMPO FIXO",null,"Código","Quantidade","Unidade",null,"Custo Unitário","Custo Unitário"]
[null,"-",0,"-",0,"t",null,0,null,{"$f":"ROUNDDOWN(E73*H73,4)","v":0}]
[null,"-",0,"-",0,"t",null,0,null,{"$f":"ROUNDDOWN(E74*H74,4)","v":0}]
[null,null,null,"Custo unitário total de tempo fixo",{"$nulls":5},{"$f":"SUM(J73:J74)","v":0}]
[null,"F - MOMENTO DE TRANSPORTE",null,"Quantidade","Unidade","DMT",null,null,null,"Custo Unitário"]
[{"$nulls":5},"LN","RP","P"]
[null,"-",0,null,"tkm"]
[null,"-",0,null,"tkm"]
[null,null,null,"Custo unitário total de transporte"]
[{"$nulls":5},"Custo unitário direto total",null,null,null,{"$f":"TRUNC(J71+J75,2)","v":132621.79}]
[null,"Obs."]
[]
[{"$f":"A40+1","v":3},"1ª/GRD",{"$nulls":8},{"$f":"J120","v":7137.55}]
[null,"OBRA:","    PAVIMENTAÇÃO ASFÁLTICA EM CBUQ - VIAS URBANAS DIVERSAS - SEDE E COMUNIDADE RIO DAS PEDRAS (GLAUCILÂNDIA / MG)"]
[null,"Custo Unitário de Referência",null,null,"Minas Gerais"]
[{"$nulls":4}," Janeiro/2025",null,null,"Produção da equipe ",1,{"$f":"VLOOKUP(A84,ORÇAMENTO!$A$10:$L$42,7,1)","v":"GL"}]
[null,"CPU.3","CANTEIRO DE OBRAS ",{"$nulls":5},"Valores em reais (R$)"]
[null,"A - EQUIPAMENTOS",null,"Quantidade","Utilização",null,"Custo Horário",null,null,"Custo"]
[{"$nulls":4},"Operativa","Improdutiva","Produtivo","Improdutivo",null,"Horário Total"]
[null,"-",0,null,null,null,0,0,null,{"$f":"D91*(E91*G91+F91*H91)","v":0}]
[null,"-",0,null,null,null,0,0,null,{"$f":"D92*(E92*G92+F92*H92)","v":0}]
[{"$nulls":7},"Custo horário total de equipamentos",null,{"$f":"SUM(J91:J92)","v":0}]
[null,"B - MÃO DE OBRA",null,"Quantidade","Unidade",null,"Custo Horário","Custo Horário Total"]
[null,"P9824","Servente",8,"h",null,21.3355,null,null,{"$f":"D95*G95","v":170.684}]
[null,"P9808","Carpinteiro",8,"h",null,26.4529,null,null,{"$f":"D96*G96","v":211.6232}]
[null,null,null,"Custo horário total de mão de obra",{"$nulls":5},{"$f":"SUM(J95:J96)","v":382.30719999999997}]
[null,null,null,"Custo horário total de execução",{"$nulls":5},{"$f":"J93+J97","v":382.30719999999997}]
[null,null,null,"Custo unitário de execução",{"$nulls":5},{"$f":"J98/I87","v":382.30719999999997}]
[{"$nulls":7},"Custo do FIC",null,"-"]
[{"$nulls":7},"Custo do FIT",null,"-"]
[null,"C - MATERIAL",null,"Quantidade","Unidade",null,"Preço Unitário","Custo Unitário"]
[null,"M0053","Tela plástica em polipropileno na cor laranja para tapume - L = 1,2 m",60,"m",null,1.7749999999999999,null,null,{"$f":"D103*G103","v":106.5}]
[null,"-",0,0,0,null,0,null,null,{"$f":"D104*G104","v":0}]
[null,null,null,"Custo unitário total de material",{"$nulls":5},{"$f":"SUM(J103:J104)","v":106.5}]
[null,"D - ATIVIDADES AUXILIARES",null,"Quantidade","Unidade",null,"Custo Unitário","Custo Unitário"]
[null,10775,"Locação de container 2,30 X 6,00 m, alt. 2,50 m, com 1 sanitário, para escritório, completo, sem divisórias internas",3,"mês",null,985,null,null,{"$f":"D107*G107","v":2955}]
[null,10779,"Locação de container 2,30 X 4,30 m, alt. 2,50 M, p/ sanitário, c/ 5 bacias, 1 lavatório e 4 mictórios",3,"mês",null,1231.25,null,null,{"$f":"D108*G108","v":3693.75}]
[null,null,null,"Custo total de atividades auxiliares",{"$nulls":5},{"$f":"SUM(J107:J108)","v":6648.75}]
[{"$nulls":7},"Subtotal",null,{"$f":"J99+J105+J109","v":7137.5572000000002}]
[null,"E - TEMPO FIXO",null,"Código","Quantidade","Unidade",null,"Custo Unitário","Custo Unitário"]
[null,"-",0,"-",0,"t",null,0,null,{"$f":"ROUNDDOWN(E112*H112,4)","v":0}]
[null,"-",0,"-",0,"t",null,0,null,{"$f":"ROUNDDOWN(E113*H113,4)","v":0}]
[null,null,null,"Custo unitário total de tempo fixo",{"$nulls":5},{"$f":"SUM(J112:J113)","v":0}]
[null,"F - MOMENTO DE TRANSPORTE",null,"Quantidade","Unidade","DMT",null,null,null,"Custo Unitário"]
[{"$nulls":5},"LN","RP","P"]
[null,"-",0,0,"tkm"]
[null,"-",0,0,"tkm"]
[null,null,null,"Custo unitário total de transporte"]
[{"$nulls":5},"Custo unitário direto total",null,null,null,{"$f":"TRUNC(J110+J114,2)","v":7137.55}]
[null,"Obs."]
[]
[{"$f":"A84+1","v":4},"1ª/GRD",{"$nulls":8},{"$f":"J161","v":351.42}]
[null,"OBRA:","    PAVIMENTAÇÃO ASFÁLTICA EM CBUQ - VIAS URBANAS DIVERSAS - SEDE E COMUNIDADE RIO DAS PEDRAS (GLAUCILÂNDIA / MG)"]
[null,"Custo Unitário de Referência",null,null,"Minas Gerais"]
[{"$nulls":4}," Janeiro/2025",null,null,"Produção da equipe ",1,{"$f":"VLOOKUP(A123,ORÇAMENTO!$A$10:$L$42,7,1)","v":"M2"}]
[null,103689,"PLACA DE OBRA EM CHAPA DE AÇO GALVANIZADO",{"$nulls":5},"Valores em reais (R$)"]
[null,"A - EQUIPAMENTOS",null,"Quantidade","Utilização",null,"Custo Horário",null,null,"Custo"]
[{"$nulls":4},"Operativa","Improdutiva","Produtivo","Improdutivo",null,"Horário Total"]
[null,"-",0,null,null,null,0,0,null,{"$f":"D130*(E130*G130+F130*H130)","v":0}]
[null,"-",0,null,null,null,0,0,null,{"$f":"D131*(E131*G131+F131*H131)","v":0}]
[{"$nulls":7},"Custo horário total de equipamentos",null,{"$f":"SUM(J130:J131)","v":0}]
[null,"B - MÃO DE OBRA",null,"Quantidade","Unidade",null,"Custo Horário","Custo Horário Total"]
[null,"P9824","Servente",1.1186,"h",null,21.3355,null,null,{"$f":"D134*G134","v":23.8658903}]
[null,"P9808","Carpinteiro",0.37290000000000001,"h",null,26.4529,null,null,{"$f":"D135*G135","v":9.8642864100000001}]
[null,null,null,"Custo horário total de mão de obra",{"$nulls":5},{"$f":"SUM(J134:J135)","v":33.730176710000002}]
[null,null,null,"Custo horário total de execução",{"$nulls":5},{"$f":"J132+J136","v":33.730176710000002}]
[null,null,null,"Custo unitário de execução",{"$nulls":5},{"$f":"J137/I126","v":33.730176710000002}]
[{"$nulls":7},"Custo do FIC",null,"-"]
[{"$nulls":7},"Custo do FIT",null,"-"]
[null,"C - MATERIAL",null,"Quantidade","Unidade",null,"Preço Unitário","Custo Unitário"]
[null,"M1358","Sarrafo em madeira de terceira - E = 2,5 cm e L = 5 cm",6.4165999999999999,"m",null,1.9665999999999999,null,null,{"$f":"D142*G142","v":12.618885559999999}]
[null,"M1205","Prego de ferro",2.4500000000000001E-2,"kg",null,16.544499999999999,null,null,{"$f":"D143*G143","v":0.40534025000000001}]
[null,"M0998","Madeira estrutural de eucalipto",2.2608E-2,"m³",null,2418.0391,null,null,{"$f":"D144*G144","v":54.6670279728}]
[null,4813,"Placa de obra (para construção civil) em chapa galvanizada *N. 22*, adesivada, de *2,4 X 1,2* m (sem postes para fixação)",1,"m²",null,250,null,null,250]
[null,null,null,"Custo unitário total de material",{"$nulls":5},{"$f":"SUM(J142:J145)","v":317.6912537828}]
[null,"D - ATIVIDADES AUXILIARES",null,"Quantidade","Unidade",null,"Custo Unitário","Custo Unitário"]
[null,"-",0,0,0,null,0,null,null,{"$f":"D148*G148","v":0}]
[null,"-",0,0,0,null,0,null,null,{"$f":"D149*G149","v":0}]
[null,null,null,"Custo total de atividades auxiliares",{"$nulls":5},{"$f":"SUM(J148:J149)","v":0}]
[{"$nulls":7},"Subtotal",null,{"$f":"J138+J146+J150","v":351.42143049280003}]
[null,"E - TEMPO FIXO",null,"Código","Quantidade","Unidade",null,"Custo Unitário","Custo Unitário"]
[null,"-",0,"-",0,"t",null,0,null,{"$f":"ROUNDDOWN(E153*H153,4)","v":0}]
[null,"-",0,"-",0,"t",null,0,null,{"$f":"ROUNDDOWN(E154*H154,4)","v":0}]
[null,null,null,"Custo unitário total de tempo fixo",{"$nulls":5},{"$f":"SUM(J153:J154)","v":0}]
[null,"F - MOMENTO DE TRANSPORTE",null,"Quantidade","Unidade","DMT",null,null,null,"Custo Unitário"]
[{"$nulls":5},"LN","RP","P"]
[null,"-",0,0,"tkm"]
[null,"-",0,0,"tkm"]
[null,null,null,"Custo unitário total de transporte"]
[{"$nulls":5},"Custo unitário direto total",null,null,null,{"$f":"TRUNC(J151+J155,2)","v":351.42}]
[null,"Obs."]
[]
[6,"1ª/GRD",{"$nulls":8},{"$f":"J202","v":0.49}]
[null,"OBRA:","    PAVIMENTAÇÃO ASFÁLTICA EM CBUQ - VIAS URBANAS DIVERSAS - SEDE E COMUNIDADE RIO DAS PEDRAS (GLAUCILÂNDIA / MG)"]
[null,"Custo Unitário de Referência",null,null,"Minas Gerais"]
[{"$nulls":4}," Janeiro/2025",null,null,"Produção da equipe ",1,{"$f":"VLOOKUP(A164,ORÇAMENTO!$A$10:$L$42,7,1)","v":"M2"}]
[null,78472,"SERVIÇOS TOPOGRÁFICOS PARA PAVIMENTAÇÃO, INCLUSIVE LEVANTAMENTO PLANIALTIMÉTRICO CADASTRAL, GERAÇÃO DE NOTAS DE SERVIÇO, SEÇÕES TRANSVERSAIS E GREIDE, ESTAQUEAMENTO E ACOMPANHAMENTO EXECUTIVO",{"$nulls":5},"Valores em reais (R$)"]
[null,"A - EQUIPAMENTOS",null,"Quantidade","Utilização",null,"Custo Horário",null,null,"Custo"]
[{"$nulls":4},"Operativa","Improdutiva","Produtivo","Improdutivo",null,"Horário Total"]
[null,92145,"Caminhonete cabine simples com motor 1.6 flex, câmbio manual, potência 101/104 cv, 2 portas",5.0000000000000001E-4,1,0,76.5,0,null,{"$f":"D171*(E171*G171+F171*H171)","v":3.8249999999999999E-2}]
[null,"-",0,0,1,0,0,0,null,{"$f":"D172*(E172*G172+F172*H172)","v":0}]
[{"$nulls":7},"Custo horário total de equipamentos",null,{"$f":"SUM(J171:J172)","v":3.8249999999999999E-2}]
[null,"B - MÃO DE OBRA",null,"Quantidade","Unidade",null,"Custo Horário","Custo Horário Total"]
[null,"P9949","Topógrafo",1.590909090909091E-5,"mês",null,6816.9715999999999,28.404048333333332,null,{"$f":"D175*G175","v":0.10845182090909092}]
[null,"P9950","Auxiliar de topografia",1.590909090909091E-5,"mês",null,6157.8463000000002,22.806838148148149,null,{"$f":"D176*G176","v":9.7965736590909097E-2}]
[null,"P9824","Servente",7.4999999999999997E-3,"h",null,21.3355,8.889791666666666E-2,null,{"$f":"D177*G177","v":0.16001625}]
[null,"P9848","Desenhista",9.090909090909091E-6,"mês",null,10307.748600000001,38.17684666666667,null,{"$f":"D178*G178","v":9.3706805454545461E-2}]
[null,null,null,"Custo horário total de mão de obra",{"$nulls":5},{"$f":"SUM(J175:J178)","v":0.46014061295454545}]
[null,null,null,"Custo horário total de execução",{"$nulls":5},{"$f":"J173+J179","v":0.49839061295454545}]
[null,null,null,"Custo unitário de execução",{"$nulls":5},{"$f":"J180/I167","v":0.49839061295454545}]
[{"$nulls":7},"Custo do FIC",null,"-"]
[{"$nulls":7},"Custo do FIT",null,"-"]
[null,"C - MATERIAL",null,"Quantidade","Unidade",null,"Preço Unitário","Custo Unitário"]
[null,"-",0,0,0,null,0,null,null,{"$f":"D185*G185","v":0}]
[null,"-",0,0,0,null,0,null,null,0]
[null,null,null,"Custo unitário total de material",{"$nulls":5},{"$f":"SUM(J185:J186)","v":0}]
[null,"D - ATIVIDADES AUXILIARES",null,"Quantidade","Unidade",null,"Custo Unitário","Custo Unitário"]
[null,"-",0,0,0,null,0,null,null,{"$f":"D189*G189","v":0}]
[null,"-",0,0,0,null,0,null,null,{"$f":"D190*G190","v":0}]
[null,null,null,"Custo total de atividades auxiliares",{"$nulls":5},{"$f":"SUM(J189:J190)","v":0}]
[{"$nulls":7},"Subtotal",null,{"$f":"J181+J187+J191","v":0.49839061295454545}]
[null,"E - TEMPO FIXO",null,"Código","Quantidade","Unidade",null,"Custo Unitário","Custo Unitário"]
[null,"-",0,"-",0,"t",null,0,null,{"$f":"ROUNDDOWN(E194*H194,4)","v":0}]
[null,"-",0,"-",0,"t",null,0,null,{"$f":"ROUNDDOWN(E195*H195,4)","v":0}]
[null,null,null,"Custo unitário total de tempo fixo",{"$nulls":5},{"$f":"SUM(J194:J195)","v":0}]
[null,"F - MOMENTO DE TRANSPORTE",null,"Quantidade","Unidade","DMT",null,null,null,"Custo Unitário"]
[{"$nulls":5},"LN","RP","P"]
[null,"-",0,0,"tkm"]
[null,"-",0,0,"tkm"]
[null,null,null,"Custo unitário total de transporte"]
[{"$nulls":5},"Custo unitário direto total",null,null,null,{"$f":"TRUNC(J192+J196,2)","v":0.49}]
[null,"Obs."]
[]
[{"$f":"A164+1","v":7},"1ª/GRD",{"$nulls":8},{"$f":"J241","v":6.74}]
[null,"OBRA:","    PAVIMENTAÇÃO ASFÁLTICA EM CBUQ - VIAS URBANAS DIVERSAS - SEDE E COMUNIDADE RIO DAS PEDRAS (GLAUCILÂNDIA / MG)"]
[null,"Custo Unitário de Referência",null,null,"Minas Gerais"]
[{"$nulls":4}," Janeiro/2025",null,null,"Produção da equipe ",230.19,{"$f":"VLOOKUP(A205,ORÇAMENTO!$A$10:$L$42,7,1)","v":"M3"}]
[null,5502140,"ESCAVAÇÃO, CARGA E TRANSPORTE DE MATERIAL DE 1ª CATEGORIA - DMT 1.000 A 1.200M, CAMINHO DE SERVIÇO EM REVESTIMENTO PRIMÁRIO",{"$nulls":5},"Valores em reais (R$)"]
[null,"A - EQUIPAMENTOS",null,"Quantidade","Utilização",null,"Custo Horário",null,null,"Custo"]
[{"$nulls":4},"Operativa","Improdutiva","Produtivo","Improdutivo",null,"Horário Total"]
[null,"E9667","Caminhão basculante com capacidade de 14 m³ - 210 kW",4,0.97,0.03,309.83940000000001,90.412199999999999,null,{"$f":"D212*(E212*G212+F212*H212)","v":1213.0263359999999}]
[null,"E9515","Escavadeira hidráulica sobre esteiras com caçamba com capacidade de 1,56 m³ - 118 kW",1,1,0,287.62189999999998,129.0472,null,{"$f":"D213*(E213*G213+F213*H213)","v":287.62189999999998}]
[{"$nulls":7},"Custo horário total de equipamentos",null,{"$f":"SUM(J212:J213)","v":1500.648236}]
[null,"B - MÃO DE OBRA",null,"Quantidade","Unidade",null,"Custo Horário","Custo Horário Total"]
[null,"P9824","Servente",1,"h",null,21.3355,null,null,{"$f":"D216*G216","v":21.3355}]
[{"$nulls":9},{"$f":"D217*G217","v":0}]
[null,null,null,"Custo horário total de mão de obra",{"$nulls":5},{"$f":"SUM(J216:J217)","v":21.3355}]
[null,null,null,"Custo horário total de execução",{"$nulls":5},{"$f":"J214+J218","v":1521.9837359999999}]
[null,null,null,"Custo unitário de execução",{"$nulls":5},{"$f":"J219/I208","v":6.6118586211390591}]
[{"$nulls":7},"Custo do FIC",null,0.1313]
[{"$nulls":7},"Custo do FIT",null,0]
[null,"C - MATERIAL",null,"Quantidade","Unidade",null,"Preço Unitário","Custo Unitário"]
[null,"-",0,null,0,null,0,null,null,{"$f":"D224*G224","v":0}]
[null,"-",0,null,0,null,0,null,null,{"$f":"D225*G225","v":0}]
[null,null,null,"Custo unitário total de material",{"$nulls":5},{"$f":"SUM(J224:J225)","v":0}]
[null,"D - ATIVIDADES AUXILIARES",null,"Quantidade","Unidade",null,"Custo Unitário","Custo Unitário"]
[null,"-",0,0,0,null,0,null,null,{"$f":"D228*G228","v":0}]
[null,"-",0,0,0,null,0,null,null,{"$f":"D229*G229","v":0}]
[null,null,null,"Custo total de atividades auxiliares",{"$nulls":5},{"$f":"SUM(J228:J229)","v":0}]
[{"$nulls":7},"Subtotal",null,{"$f":"J220+J226+J230+J221+J222","v":6.7431586211390595}]
[null,"E - TEMPO FIXO",null,"Código","Quantidade","Unidade",null,"Custo Unitário","Custo Unitário"]
[null,"-",0,"-",0,"t",null,0,null,{"$f":"ROUNDDOWN(E233*H233,4)","v":0}]
[null,"-",0,"-",0,"t",null,0,null,{"$f":"ROUNDDOWN(E234*H234,4)","v":0}]
[null,null,null,"Custo unitário total de tempo fixo",{"$nulls":5},{"$f":"SUM(J233:J234)","v":0}]
[null,"F - MOMENTO DE TRANSPORTE",null,"Quantidade","Unidade","DMT",null,null,null,"Custo Unitário"]
[{"$nulls":5},"LN","RP","P"]
[null,"-",0,null,"tkm","5914449","5914464","5914479"]
[null,"-",0,null,"tkm","5914449","5914464","5914479"]
[null,null,null,"Custo unitário total de transporte"]
[{"$nulls":5},"Custo unitário direto total",null,null,null,{"$f":"TRUNC(J231+J235,2)","v":6.74}]
[null,"Obs."]
[]
[9,"1ª/GRD",{"$nulls":8},{"$f":"J284","v":1.54}]
[null,"OBRA:","    PAVIMENTAÇÃO ASFÁLTICA EM CBUQ - VIAS URBANAS DIVERSAS - SEDE E COMUNIDADE RIO DAS PEDRAS (GLAUCILÂNDIA / MG)"]
[null,"Custo Unitário de Referência",null,null,"Minas Gerais"]
[{"$nulls":4}," Janeiro/2025",null,null,"Produção da equipe ",672.8,{"$f":"VLOOKUP(A244,ORÇAMENTO!$A$10:$L$42,7,1)","v":"M2"}]
[null,4011209,"REGULARIZAÇÃO E COMPACTAÇÃO DO SUBLEITO ",{"$nulls":5},"Valores em reais (R$)"]
[null,"A - EQUIPAMENTOS",null,"Quantidade","Utilização",null,"Custo Horário",null,null,"Custo"]
[{"$nulls":4},"Operativa","Improdutiva","Produtivo","Improdutivo",null,"Horário Total"]
[null,"E9571","Caminhão tanque com capacidade de 10.000 l - 188 kW",1,0.61,0.39,323.59019999999998,80.173299999999998,null,{"$f":"D251*(E251*G251+F251*H251)","v":228.65760899999998}]
[null,"E9518","Grade de 24 discos rebocável de D = 60 cm (24\")",1,0.41,0.59000000000000008,4.9436,3.4426000000000001,null,{"$f":"D252*(E252*G252+F252*H252)","v":4.0580099999999995}]
[null,"E9524","Motoniveladora - 93 kW",1,0.43,0.57000000000000006,288.51479999999998,125.7629,null,195.746217]
[null,"E9762","Rolo compactador de pneus autopropelido de 27 t - 85 kW",1,0.96,4.0000000000000036E-2,255.65049999999999,124.5621,null,250.40696399999999]
[null,"E9685","Rolo compactador pé de carneiro vibratório autopropelido por pneus de 11,6 t - 82 kW",1,1,0,225.9264,101.55289999999999,null,225.9264]
[null,"E9577","Trator agrícola sobre pneus - 77 kW",1,0.41,0.59000000000000008,152.69229999999999,55.394399999999997,null,95.286538999999991]
[{"$nulls":7},"Custo horário total de equipamentos",null,{"$f":"SUM(J251:J256)","v":1000.081739}]
[null,"B - MÃO DE OBRA",null,"Quantidade","Unidade",null,"Custo Horário","Custo Horário Total"]
[null,"P9824","Servente",1,"h",null,21.3355,null,null,{"$f":"D259*G259","v":21.3355}]
[null,"-",null,0,0,null,0,null,null,{"$f":"D260*G260","v":0}]
[null,null,null,"Custo horário total de mão de obra",{"$nulls":5},{"$f":"SUM(J259:J260)","v":21.3355}]
[null,null,null,"Custo horário total de execução",{"$nulls":5},{"$f":"J257+J261","v":1021.417239}]
[null,null,null,"Custo unitário de execução",{"$nulls":5},{"$f":"J262/I247","v":1.5181587975624258}]
[{"$nulls":7},"Custo do FIC",null,2.2700000000000001E-2]
[{"$nulls":7},"Custo do FIT",null,0]
[null,"C - MATERIAL",null,"Quantidade","Unidade",null,"Preço Unitário","Custo Unitário"]
[null,"-",0,null,0,null,0,null,null,{"$f":"D267*G267","v":0}]
[null,"-",0,null,0,null,0,null,null,{"$f":"D268*G268","v":0}]
[null,null,null,"Custo unitário total de material",{"$nulls":5},{"$f":"SUM(J267:J268)","v":0}]
[null,"D - ATIVIDADES AUXILIARES",null,"Quantidade","Unidade",null,"Custo Unitário","Custo Unitário"]
[null,"-",0,0,0,null,0,null,null,{"$f":"D271*G271","v":0}]
[null,"-",0,0,0,null,0,null,null,{"$f":"D272*G272","v":0}]
[null,null,null,"Custo total de atividades auxiliares",{"$nulls":5},{"$f":"SUM(J271:J272)","v":0}]
[{"$nulls":7},"Subtotal",null,{"$f":"J263+J269+J273+J264+J265","v":1.5408587975624257}]
[null,"E - TEMPO FIXO",null,"Código","Quantidade","Unidade",null,"Custo Unitário","Custo Unitário"]
[null,"-",0,"-",0,"t",null,0,null,{"$f":"ROUNDDOWN(E276*H276,4)","v":0}]
[null,"-",0,"-",0,"t",null,0,null,{"$f":"ROUNDDOWN(E277*H277,4)","v":0}]
[null,null,null,"Custo unitário total de tempo fixo",{"$nulls":5},{"$f":"SUM(J276:J277)","v":0}]
[null,"F - MOMENTO DE TRANSPORTE",null,"Quantidade","Unidade","DMT",null,null,null,"Custo Unitário"]
[{"$nulls":5},"LN","RP","P"]
[null,"-",0,null,"tkm","5914449","5914464","5914479"]
[null,"-",0,null,"tkm","5914449","5914464","5914479"]
[null,null,null,"Custo unitário total de transporte"]
[{"$nulls":5},"Custo unitário direto total",null,null,null,{"$f":"TRUNC(J274+J278,2)","v":1.54}]
[null,"Obs."]
[]
[{"$f":"A244+1","v":10},"1ª/GRD",{"$nulls":8},{"$f":"J325","v":149.72}]
[null,"OBRA:","    PAVIMENTAÇÃO ASFÁLTICA EM CBUQ - VIAS URBANAS DIVERSAS - SEDE E COMUNIDADE RIO DAS PEDRAS (GLAUCILÂNDIA / MG)"]
[null,"Custo Unitário de Referência",null,null,"Minas Gerais"]
[{"$nulls":4}," Janeiro/2025",null,null,"Produção da equipe ",113.18,{"$f":"VLOOKUP(A287,ORÇAMENTO!$A$10:$L$42,7,1)","v":"M3"}]
[null,4011276,"EXECUÇÃO E COMPACTAÇÃO DE BASE E OU SUB BASE PARA PAVIMENTAÇÃO DE BICA CORRIDA - EXCLUSIVE TRANSPORTE",{"$nulls":5},"Valores em reais (R$)"]
[null,"A - EQUIPAMENTOS",null,"Quantidade","Utilização",null,"Custo Horário",null,null,"Custo"]
[{"$nulls":4},"Operativa","Improdutiva","Produtivo","Improdutivo",null,"Horário Total"]
[null,"E9571","Caminhão tanque com capacidade de 10.000 l - 188 kW",1,0.34,0.66,323.59019999999998,80.173299999999998,null,{"$f":"D294*(E294*G294+F294*H294)","v":162.935046}]
[null,"E9514","Distribuidor de agregados sobre pneus autopropelido - 130 kW",1,1,0,292.00130000000001,107.6279,null,{"$f":"D295*(E295*G295+F295*H295)","v":292.00130000000001}]
[null,"E9762","Rolo compactador de pneus autopropelido de 27 t - 85 kW",1,0.97,0.03,255.65049999999999,124.5621,null,251.71784799999998]
[null,"E9530","Rolo compactador liso vibratório autopropelido por pneus de 11 t - 97 kW",1,0.79,0.21,259.53739999999999,112.9601,null,228.756167]
[{"$nulls":7},"Custo horário total de equipamentos",null,{"$f":"SUM(J294:J297)","v":935.41036099999997}]
[null,"B - MÃO DE OBRA",null,"Quantidade","Unidade",null,"Custo Horário","Custo Horário Total"]
[null,"P9824","Servente",1,"h",null,21.3355,null,null,{"$f":"D300*G300","v":21.3355}]
[null,"-",0,0,0,null,0,null,null,{"$f":"D301*G301","v":0}]
[null,null,null,"Custo horário total de mão de obra",{"$nulls":5},{"$f":"SUM(J300:J301)","v":21.3355}]
[null,null,null,"Custo horário total de execução",{"$nulls":5},{"$f":"J298+J302","v":956.74586099999999}]
[null,null,null,"Custo unitário de execução",{"$nulls":5},{"$f":"J303/I290","v":8.4533120781056716}]
[{"$nulls":7},"Custo do FIC",null,5.0900000000000001E-2]
[{"$nulls":7},"Custo do FIT",null,0]
[null,"C - MATERIAL",null,"Quantidade","Unidade",null,"Preço Unitário","Custo Unitário"]
[null,"-",0,null,0,null,0,null,null,{"$f":"D308*G308","v":0}]
[null,"-",0,null,0,null,0,null,null,{"$f":"D309*G309","v":0}]
[null,null,null,"Custo unitário total de material",{"$nulls":5},{"$f":"SUM(J308:J309)","v":0}]
[null,"D - ATIVIDADES AUXILIARES",null,"Quantidade","Unidade",null,"Custo Unitário","Custo Unitário"]
[null,6416040,"Usinagem de brita graduada com brita comercial em usina de 300 t/h",1,"m³",null,133.5,null,null,{"$f":"D312*G312","v":133.5}]
[null,"-",0,0,0,null,0,null,null,{"$f":"D313*G313","v":0}]
[null,null,null,"Custo total de atividades auxiliares",{"$nulls":5},{"$f":"SUM(J312:J313)","v":133.5}]
[{"$nulls":7},"Subtotal",null,{"$f":"J304+J310+J314+J305+J306","v":142.0042120781057}]
[null,"E - TEMPO FIXO",null,"Código","Quantidade","Unidade",null,"Custo Unitário","Custo Unitário"]
[null,6416040,"Usinagem de brita graduada com brita comercial em usina de 300 t/h",5914652,2.2000000000000002,"t",null,3.51,null,{"$f":"ROUNDDOWN(E317*H317,4)","v":7.7220000000000004}]
[null,"-",0,"-",null,"t",null,0,null,{"$f":"ROUNDDOWN(E318*H318,4)","v":0}]
[null,null,null,"Custo unitário total de tempo fixo",{"$nulls":5},{"$f":"SUM(J317:J318)","v":7.7220000000000004}]
[null,"F - MOMENTO DE TRANSPORTE",null,"Quantidade","Unidade","DMT",null,null,null,"Custo Unitário"]
[{"$nulls":5},"LN","RP","P"]
[null,6416040,"Usinagem de brita graduada com brita comercial em usina de 300 t/h",2.2000000000000002,"tkm","5914359","5914374","5914389"]
[null,"-",0,0,"tkm"]
[null,null,null,"Custo unitário total de transporte"]
[{"$nulls":5},"Custo unitário direto total",null,null,null,{"$f":"TRUNC(J315+J319,2)","v":149.72}]
[null,"Obs."]
[]
[12,"1ª/GRD",{"$nulls":8},{"$f":"J364","v":0.4}]
[null,"OBRA:","    PAVIMENTAÇÃO ASFÁLTICA EM CBUQ - VIAS URBANAS DIVERSAS - SEDE E COMUNIDADE RIO DAS PEDRAS (GLAUCILÂNDIA / MG)"]
[null,"Custo Unitário de Referência",null,null,"Minas Gerais"]
[{"$nulls":4}," Janeiro/2025",null,null,"Produção da equipe ",1038.46,{"$f":"VLOOKUP(A328,ORÇAMENTO!$A$10:$L$42,7,1)","v":"M2"}]
[null,4011352,"IMPRIMAÇÃO COM EMULSÃO ASFÁLTICA (EAI)",{"$nulls":5},"Valores em reais (R$)"]
[null,"A - EQUIPAMENTOS",null,"Quantidade","Utilização",null,"Custo Horário",null,null,"Custo"]
[{"$nulls":4},"Operativa","Improdutiva","Produtivo","Improdutivo",null,"Horário Total"]
[null,"E9509","Caminhão tanque distribuidor de asfalto com capacidade de 6.000 l - 7 kW/136 kW",1,1,0,261.03050000000002,72.388300000000001,null,{"$f":"D335*(E335*G335+F335*H335)","v":261.03050000000002}]
[null,"E9558","Tanque de estocagem de asfalto com capacidade de 30.000 l",2,1,0,56.138500000000001,38.346699999999998,null,{"$f":"D336*(E336*G336+F336*H336)","v":112.277}]
[{"$nulls":7},"Custo horário total de equipamentos",null,{"$f":"SUM(J335:J336)","v":373.3075}]
[null,"B - MÃO DE OBRA",null,"Quantidade","Unidade",null,"Custo Horário","Custo Horário Total"]
[null,"P9824","Servente",2,"h",null,21.3355,null,null,{"$f":"D339*G339","v":42.670999999999999}]
[null,"-",{"$nulls":7},{"$f":"D340*G340","v":0}]
[null,null,null,"Custo horário total de mão de obra",{"$nulls":5},{"$f":"SUM(J339:J340)","v":42.670999999999999}]
[null,null,null,"Custo horário total de execução",{"$nulls":5},{"$f":"J337+J341","v":415.9785}]
[null,null,null,"Custo unitário de execução",{"$nulls":5},{"$f":"J342/I331","v":0.40057248232960341}]
[{"$nulls":7},"Custo do FIC",null,1.4E-3]
[{"$nulls":7},"Custo do FIT",null,0]
[null,"C - MATERIAL",null,"Quantidade","Unidade",null,"Preço Unitário","Custo Unitário"]
[null,"M2092","Emulsão asfáltica para imprimação",1.2999999999999999E-3,"t",null,0,"FORNECIMENTO COM BDI DIFERENCIADO",null,{"$f":"D347*G347","v":0}]
[null,"-",0,89.28,0,null,0,null,null,{"$f":"D348*G348","v":0}]
[null,null,null,"Custo unitário total de material",{"$nulls":5},{"$f":"SUM(J347:J348)","v":0}]
[null,"D - ATIVIDADES AUXILIARES",null,"Quantidade","Unidade",null,"Custo Unitário","Custo Unitário"]
[null,"-",0,0,0,null,0,null,null,{"$f":"D351*G351","v":0}]
[null,"-",0,0,0,null,0,null,null,{"$f":"D352*G352","v":0}]
[null,null,null,"Custo total de atividades auxiliares",{"$nulls":5},{"$f":"SUM(J351:J352)","v":0}]
[{"$nulls":7},"Subtotal",null,{"$f":"J343+J349+J353+J344+J345","v":0.40197248232960342}]
[null,"E - TEMPO FIXO",null,"Código","Quantidade","Unidade",null,"Custo Unitário","Custo Unitário"]
[null,"-",0,"-",0,"t",null,0,null,{"$f":"ROUNDDOWN(E356*H356,4)","v":0}]
[null,"-",0,"-",0,"t",null,0,null,{"$f":"ROUNDDOWN(E357*H357,4)","v":0}]
[null,null,null,"Custo unitário total de tempo fixo",{"$nulls":5},{"$f":"SUM(J356:J357)","v":0}]
[null,"F - MOMENTO DE TRANSPORTE",null,"Quantidade","Unidade","DMT",null,null,null,"Custo Unitário"]
[{"$nulls":5},"LN","RP","P"]
[null,"-",0,null,"tkm"]
[null,"-",0,null,"tkm"]
[null,null,null,"Custo unitário total de transporte"]
[{"$nulls":5},"Custo unitário direto total",null,null,null,{"$f":"TRUNC(J354+J358,2)","v":0.4}]
[null,"Obs."]
[]
[{"$f":"A328+1","v":13},"1ª/GRD",{"$nulls":8},{"$f":"J403","v":0.27}]
[null,"OBRA:","    PAVIMENTAÇÃO ASFÁLTICA EM CBUQ - VIAS URBANAS DIVERSAS - SEDE E COMUNIDADE RIO DAS PEDRAS (GLAUCILÂNDIA / MG)"]
[null,"Custo Unitário de Referência",null,null,"Minas Gerais"]
[{"$nulls":4}," Janeiro/2025",null,null,"Produção da equipe ",1500,{"$f":"VLOOKUP(A367,ORÇAMENTO!$A$10:$L$42,7,1)","v":"M2"}]
[null,4011353,"PINTURA DE LIGAÇÃO COM EMULSÃO ASFÁLTICA RR-1C",{"$nulls":5},"Valores em reais (R$)"]
[null,"A - EQUIPAMENTOS",null,"Quantidade","Utilização",null,"Custo Horário",null,null,"Custo"]
[{"$nulls":4},"Operativa","Improdutiva","Produtivo","Improdutivo",null,"Horário Total"]
[null,"E9509","Caminhão tanque distribuidor de asfalto com capacidade de 6.000 l - 7 kW/136 kW",1,1,0,261.03050000000002,72.388300000000001,null,{"$f":"D374*(E374*G374+F374*H374)","v":261.03050000000002}]
[null,"E9558","Tanque de estocagem de asfalto com capacidade de 30.000 l",2,1,0,56.138500000000001,38.346699999999998,null,{"$f":"D375*(E375*G375+F375*H375)","v":112.277}]
[{"$nulls":7},"Custo horário total de equipamentos",null,{"$f":"SUM(J374:J375)","v":373.3075}]
[null,"B - MÃO DE OBRA",null,"Quantidade","Unidade",null,"Custo Horário","Custo Horário Total"]
[null,"P9824","Servente",2,"h",null,21.3355,null,null,{"$f":"D378*G378","v":42.670999999999999}]
[null,"-",{"$nulls":7},{"$f":"D379*G379","v":0}]
[null,null,null,"Custo horário total de mão de obra",{"$nulls":5},{"$f":"SUM(J378:J379)","v":42.670999999999999}]
[null,null,null,"Custo horário total de execução",{"$nulls":5},{"$f":"J376+J380","v":415.9785}]
[null,null,null,"Custo unitário de execução",{"$nulls":5},{"$f":"J381/I370","v":0.27731899999999998}]
[{"$nulls":7},"Custo do FIC",null,8.9999999999999998E-4]
[{"$nulls":7},"Custo do FIT",null,0]
[null,"C - MATERIAL",null,"Quantidade","Unidade",null,"Preço Unitário","Custo Unitário"]
[null,"M1946","Emulsão asfáltica - RR-1C",4.4999999999999999E-4,"t",null,0,"FORNECIMENTO COM BDI DIFERENCIADO",null,{"$f":"D386*G386","v":0}]
[null,"-",0,null,0,null,0,null,null,{"$f":"D387*G387","v":0}]
[null,null,null,"Custo unitário total de material",{"$nulls":5},{"$f":"SUM(J386:J387)","v":0}]
[null,"D - ATIVIDADES AUXILIARES",null,"Quantidade","Unidade",null,"Custo Unitário","Custo Unitário"]
[null,"-",0,0,0,null,0,null,null,{"$f":"D390*G390","v":0}]
[null,"-",0,0,0,null,0,null,null,{"$f":"D391*G391","v":0}]
[null,null,null,"Custo total de atividades auxiliares",{"$nulls":5},{"$f":"SUM(J390:J391)","v":0}]
[{"$nulls":7},"Subtotal",null,{"$f":"J382+J388+J392+J383+J384","v":0.27821899999999999}]
[null,"E - TEMPO FIXO",null,"Código","Quantidade","Unidade",null,"Custo Unitário","Custo Unitário"]
[null,"-",0,"-",0,"t",null,0,null,{"$f":"ROUNDDOWN(E395*H395,4)","v":0}]
[null,"-",0,"-",0,"t",null,0,null,{"$f":"ROUNDDOWN(E396*H396,4)","v":0}]
[null,null,null,"Custo unitário total de tempo fixo",{"$nulls":5},{"$f":"SUM(J395:J396)","v":0}]
[null,"F - MOMENTO DE TRANSPORTE",null,"Quantidade","Unidade","DMT",null,null,null,"Custo Unitário"]
[{"$nulls":5},"LN","RP","P"]
[null,"-",0,null,"tkm"]
[null,"-",0,null,"tkm"]
[null,null,null,"Custo unitário total de transporte"]
[{"$nulls":5},"Custo unitário direto total",null,null,null,{"$f":"TRUNC(J393+J397,2)","v":0.27}]
[null,"Obs."]
[]
[{"$f":"A367+1","v":14},"1ª/GRD",{"$nulls":8},{"$f":"J443","v":190.78}]
[null,"OBRA:","    PAVIMENTAÇÃO ASFÁLTICA EM CBUQ - VIAS URBANAS DIVERSAS - SEDE E COMUNIDADE RIO DAS PEDRAS (GLAUCILÂNDIA / MG)"]
[null,"Custo Unitário de Referência",null,null,"Minas Gerais"]
[{"$nulls":4}," Janeiro/2025",null,null,"Produção da equipe ",99.6,{"$f":"VLOOKUP(A406,ORÇAMENTO!$A$10:$L$42,7,1)","v":"T"}]
[null,4011463,"EXECUÇÃO DE PAVIMENTO COM APLICAÇÃO DE CONCRETO ASFÁLTICO USINADO A QUENTE (CBUQ), CAMADA DE ROLAMENTO - EXCLUSIVE TRANSPORTE",{"$nulls":5},"Valores em reais (R$)"]
[null,"A - EQUIPAMENTOS",null,"Quantidade","Utilização",null,"Custo Horário",null,null,"Custo"]
[{"$nulls":4},"Operativa","Improdutiva","Produtivo","Improdutivo",null,"Horário Total"]
[null,"E9762","Rolo compactador de pneus autopropelido de 27 t - 85 kW",1,0.71,0.28999999999999998,255.65049999999999,124.5621,null,{"$f":"D413*(E413*G413+F413*H413)","v":217.63486399999999}]
[null,"E9681","Rolo compactador liso tandem vibratório autopropelido de 10,4 t - 82 kW",1,0.82,0.18,296.77460000000002,113.3899,null,{"$f":"D414*(E414*G414+F414*H414)","v":263.765354}]
[null,"E9545","Vibroacabadora de asfalto sobre esteiras - 97 kW",1,1,0,359.27379999999999,154.22659999999999,null,{"$f":"D415*(E415*G415+F415*H415)","v":359.27379999999999}]
[{"$nulls":7},"Custo horário total de equipamentos",null,{"$f":"SUM(J413:J415)","v":840.67401799999993}]
[null,"B - MÃO DE OBRA",null,"Quantidade","Unidade",null,"Custo Horário","Custo Horário Total"]
[null,"P9824","Servente",8,"h",null,21.3355,null,null,{"$f":"D418*G418","v":170.684}]
[null,"-",0,null,0,null,0,null,null,{"$f":"D419*G419","v":0}]
[null,null,null,"Custo horário total de mão de obra",{"$nulls":5},{"$f":"SUM(J418:J419)","v":170.684}]
[null,null,null,"Custo horário total de execução",{"$nulls":5},{"$f":"J416+J420","v":1011.3580179999999}]
[null,null,null,"Custo unitário de execução",{"$nulls":5},{"$f":"J421/I409","v":10.154196967871485}]
[{"$nulls":7},"Custo do FIC",null,3.8600000000000002E-2]
[{"$nulls":7},"Custo do FIT",null,0]
[null,"C - MATERIAL",null,"Quantidade","Unidade",null,"Preço Unitário","Custo Unitário"]
[null,"-",0,null,0,null,0,null,null,{"$f":"D426*G426","v":0}]
[null,"-",0,null,0,null,0,null,null,{"$f":"D427*G427","v":0}]
[null,null,null,"Custo unitário total de material",{"$nulls":5},{"$f":"SUM(J426:J427)","v":0}]
[null,"D - ATIVIDADES AUXILIARES",null,"Quantidade","Unidade",null,"Custo Unitário","Custo Unitário"]
[null,6416078,"Usinagem de concreto asfáltico - faixa C-12,5 - areia e brita comerciais",1,"t",null,172.54536519476304,null,null,{"$f":"D430*G430","v":172.54536519476304}]
[null,"-",0,0,0,null,0,null,null,{"$f":"D431*G431","v":0}]
[null,null,null,"Custo total de atividades auxiliares",{"$nulls":5},{"$f":"SUM(J430:J431)","v":172.54536519476304}]
[{"$nulls":7},"Subtotal",null,{"$f":"J422+J428+J432+J423+J424","v":182.73816216263452}]
[null,"E - TEMPO FIXO",null,"Código","Quantidade","Unidade",null,"Custo Unitário","Custo Unitário"]
[null,6416078,"Usinagem de concreto asfáltico - faixa C-12,5 - areia e brita comerciais",5914649,1,"t",null,8.0500000000000007,null,{"$f":"ROUNDDOWN(E435*H435,4)","v":8.0500000000000007}]
[null,"-",0,"-",0,"t",null,0,null,{"$f":"ROUNDDOWN(E436*H436,4)","v":0}]
[null,null,null,"Custo unitário total de tempo fixo",{"$nulls":5},{"$f":"SUM(J435:J436)","v":8.0500000000000007}]
[null,"F - MOMENTO DE TRANSPORTE",null,"Quantidade","Unidade","DMT",null,null,null,"Custo Unitário"]
[{"$nulls":5},"LN","RP","P"]
[null,6416078,"Usinagem de concreto asfáltico - faixa C-12,5 - areia e brita comerciais",1,"tkm"]
[null,"-",0,0,"tkm"]
[null,null,null,"Custo unitário total de transporte"]
[{"$nulls":5},"Custo unitário direto total",null,null,null,{"$f":"TRUNC(J433+J437,2)","v":190.78}]
[null,"Obs."]
[]
[null,"1ª/GRD",{"$nulls":8},{"$f":"J497","v":172.54536519476304}]
[null,"OBRA:","    PAVIMENTAÇÃO ASFÁLTICA EM CBUQ - VIAS URBANAS DIVERSAS - SEDE E COMUNIDADE RIO DAS PEDRAS (GLAUCILÂNDIA / MG)"]
[null,"Custo Unitário de Referência - Auxiliar",null,null,"Minas Gerais"]
[{"$nulls":4}," Janeiro/2025",null,null,"Produção da equipe ",99.6,"t"]
[null,6416078,"Usinagem de concreto asfáltico - faixa C - areia e brita comerciais",{"$nulls":5},"Valores em reais (R$)"]
[null,"A - EQUIPAMENTOS",null,"Quantidade","Utilização",null,"Custo Horário",null,null,"Custo"]
[{"$nulls":4},"Operativa","Improdutiva","Produtivo","Improdutivo",null,"Horário Total"]
[null,"E9559","Aquecedor de fluido térmico - 12 kW",1,1,0,70.491399999999999,40.1297,null,{"$f":"D453*(E453*G453+F453*H453)","v":70.491399999999999}]
[null,"E9584","Carregadeira de pneus com capacidade de 1,72 m³ - 113 kW",1,0.86,0.14000000000000001,207.59360000000001,103.7398,null,{"$f":"D454*(E454*G454+F454*H454)","v":193.054068}]
[null,"E9021","Grupo gerador - 456 kVA",1,1,0,415.94510000000002,22.186399999999999,null,415.94510000000002]
[null,"E9558","Tanque de estocagem de asfalto com capacidade de 30.000 l",2,1,0,56.138500000000001,38.346699999999998,null,112.277]
[null,"E9689","Usina de asfalto a quente gravimétrica com capacidade de 100/140 t/h - 260 kW",1,1,0,1239.9634000000001,657.78120000000001,null,{"$f":"D457*(E457*G457+F457*H457)","v":1239.9634000000001}]
[{"$nulls":7},"Custo horário total de equipamentos",null,{"$f":"SUM(J453:J457)","v":2031.7309680000003}]
[null,"B - MÃO DE OBRA",null,"Quantidade","Unidade",null,"Custo Horário","Custo Horário Total"]
[null,"P9824","Servente",4,"h",null,21.3355,null,null,{"$f":"D460*G460","v":85.341999999999999}]
[null,null,null,"Custo horário total de mão de obra",{"$nulls":5},{"$f":"SUM(J460:J460)","v":85.341999999999999}]
[null,null,null,"Custo horário total de execução",{"$nulls":5},{"$f":"J458+J461","v":2117.0729680000004}]
[null,null,null,"Custo unitário de execução",{"$nulls":5},{"$f":"J462/I449","v":21.255752690763057}]
[{"$nulls":7},"Custo do FIC",null,0]
[{"$nulls":7},"Custo do FIT",null,0]
[null,"C - MATERIAL",null,"Quantidade","Unidade",null,"Preço Unitário","Custo Unitário"]
[null,"M0028","Areia média",2.7009999999999999E-2,"m³",null,158.15639999999999,null,null,{"$f":"D467*G467","v":4.2718043639999994}]
[null,"M0005","Brita 0",9.0029999999999999E-2,"m³",null,116.2,null,null,{"$f":"D468*G468","v":10.461486000000001}]
[null,"M0191","Brita 1",3.2149999999999998E-2,"m³",null,116.2,null,null,3.73583]
[null,"M0344","Cal hidratada - a granel",14.4636,"kg",null,0.61650000000000005,null,null,8.9168094]
[null,"M1943","Cimento asfáltico de petróleo - CAP 50/70",5.5449999999999999E-2,"t",null,0,"FORNECIMENTO COM BDI DIFERENCIADO",null,0]
[null,"M1941","Óleo tipo A1",8,"l",null,6.3849,null,null,51.0792]
[null,"M1103","Pedrisco",0.1479,"m³",null,176.94059999999999,null,null,{"$f":"D473*G473","v":26.16951474}]
[null,"M1135","Pó de pedra",0.33631,"m³",null,132.80000000000001,null,null,44.661968000000002]
[null,null,null,"Custo unitário total de material",{"$nulls":5},{"$f":"SUM(J467:J474)","v":149.296612504}]
[null,"D - ATIVIDADES AUXILIARES",null,"Quantidade","Unidade",null,"Custo Unitário","Custo Unitário"]
[null,"-",0,0,0,null,0,null,null,{"$f":"D477*G477","v":0}]
[null,null,null,"Custo total de atividades auxiliares",{"$nulls":5},{"$f":"SUM(J477:J477)","v":0}]
[{"$nulls":7},"Subtotal",null,{"$f":"J463+J475+J478+J464+J465","v":170.55236519476304}]
[null,"E - TEMPO FIXO",null,"Código","Quantidade","Unidade",null,"Custo Unitário","Custo Unitário"]
[null,"M0028","Areia média",5914647,4.052E-2,"t",null,1.83,null,{"$f":"ROUNDDOWN(E481*H481,4)","v":7.4099999999999999E-2}]
[null,"M0005","Brita 0",5914647,0.13505,"t",null,1.83,null,0.24709999999999999]
[null,"M0191","Brita 1",5914647,4.8230000000000002E-2,"t",null,1.83,null,8.8200000000000001E-2]
[null,"M0344","Cal hidratada - a granel",5914363,1.4460000000000001E-2,"t",null,17.61,null,0.25459999999999999]
[null,"M1103","Pedrisco",5914647,0.22184999999999999,"t",null,1.83,null,0.40589999999999998]
[null,"M1135","Pó de pedra",5914647,0.50446999999999997,"t",null,1.83,null,{"$f":"ROUNDDOWN(E486*H486,4)","v":0.92310000000000003}]
[null,null,null,"Custo unitário total de tempo fixo",{"$nulls":5},{"$f":"SUM(J481:J486)","v":1.9929999999999999}]
[null,"F - MOMENTO DE TRANSPORTE",null,"Quantidade","Unidade","DMT",null,null,null,"Custo Unitário"]
[{"$nulls":5},"LN","RP","P"]
[null,"M0028","Areia média",4.052E-2,"tkm"]
[null,"M0005","Brita 0",0.13505,"tkm"]
[null,"M0191","Brita 1",4.8230000000000002E-2,"tkm"]
[null,"M0344","Cal hidratada - a granel",1.4460000000000001E-2,"tkm"]
[null,"M1103","Pedrisco",0.22184999999999999,"tkm"]
[null,"M1135","Pó de pedra",0.50446999999999997,"tkm"]
[null,null,null,"Custo unitário total de transporte"]
[{"$nulls":5},"Custo unitário direto total",null,null,null,{"$f":"J479+J487","v":172.54536519476304}]
[null,"Obs."]
[]
[{"$f":"A406+1","v":15},"1ª/GRD",{"$nulls":8},{"$f":"J536","v":0.54}]
[null,"OBRA:","    PAVIMENTAÇÃO ASFÁLTICA EM CBUQ - VIAS URBANAS DIVERSAS - SEDE E COMUNIDADE RIO DAS PEDRAS (GLAUCILÂNDIA / MG)"]
[null,"Custo Unitário de Referência",null,null,"Minas Gerais"]
[{"$nulls":4}," Janeiro/2025",null,null,"Produção da equipe ",570.61,{"$f":"VLOOKUP(A500,ORÇAMENTO!$A$10:$L$42,7,1)","v":"TXKM"}]
[null,5915321,"TRANSPORTE COM CAMINHÃO BASCULANTE, EM RODOVIA PAVIMENTADA",{"$nulls":5},"Valores em reais (R$)"]
[null,"A - EQUIPAMENTOS",null,"Quantidade","Utilização",null,"Custo Horário",null,null,"Custo"]
[{"$nulls":4},"Operativa","Improdutiva","Produtivo","Improdutivo",null,"Horário Total"]
[null,"E9667","Caminhão basculante com capacidade de 14 m³ - 210 kW",1,1,0,309.83940000000001,90.412199999999999,null,{"$f":"D507*(E507*G507+F507*H507)","v":309.83940000000001}]
[null,"-",0,null,null,null,0,0,null,{"$f":"D508*(E508*G508+F508*H508)","v":0}]
[{"$nulls":7},"Custo horário total de equipamentos",null,{"$f":"SUM(J507:J508)","v":309.83940000000001}]
[null,"B - MÃO DE OBRA",null,"Quantidade","Unidade",null,"Custo Horário","Custo Horário Total"]
[null,"-",0,null,0,null,0,null,null,{"$f":"D511*G511","v":0}]
[null,"-",0,null,0,null,0,null,null,{"$f":"D512*G512","v":0}]
[null,null,null,"Custo horário total de mão de obra",{"$nulls":5},{"$f":"SUM(J511:J512)","v":0}]
[null,null,null,"Custo horário total de execução",{"$nulls":5},{"$f":"J509+J513","v":309.83940000000001}]
[null,null,null,"Custo unitário de execução",{"$nulls":5},{"$f":"J514/I503","v":0.54299679290583758}]
[{"$nulls":7},"Custo do FIC",null,0]
[{"$nulls":7},"Custo do FIT",null,0]
[null,"C - MATERIAL",null,"Quantidade","Unidade",null,"Preço Unitário","Custo Unitário"]
[null,"-",0,0,0,null,0,null,null,{"$f":"D519*G519","v":0}]
[null,"-",0,0,0,null,0,null,null,{"$f":"D520*G520","v":0}]
[null,null,null,"Custo unitário total de material",{"$nulls":5},{"$f":"SUM(J519:J520)","v":0}]
[null,"D - ATIVIDADES AUXILIARES",null,"Quantidade","Unidade",null,"Custo Unitário","Custo Unitário"]
[null,"-",0,0,0,null,0,null,null,{"$f":"D523*G523","v":0}]
[null,"-",0,0,0,null,0,null,null,{"$f":"D524*G524","v":0}]
[null,null,null,"Custo total de atividades auxiliares",{"$nulls":5},{"$f":"SUM(J523:J524)","v":0}]
[{"$nulls":7},"Subtotal",null,{"$f":"J515+J521+J525+J516+J517","v":0.54299679290583758}]
[null,"E - TEMPO FIXO",null,"Código","Quantidade","Unidade",null,"Custo Unitário","Custo Unitário"]
[null,"-",0,"-",0,"t",null,0,null,{"$f":"ROUNDDOWN(E528*H528,4)","v":0}]
[null,"-",0,"-",0,"t",null,0,null,{"$f":"ROUNDDOWN(E529*H529,4)","v":0}]
[null,null,null,"Custo unitário total de tempo fixo",{"$nulls":5},{"$f":"SUM(J528:J529)","v":0}]
[null,"F - MOMENTO DE TRANSPORTE",null,"Quantidade","Unidade","DMT",null,null,null,"Custo Unitário"]
[{"$nulls":5},"LN","RP","P"]
[null,"-",0,0,"tkm"]
[null,"-",0,0,"tkm"]
[null,null,null,"Custo unitário total de transporte"]
[{"$nulls":5},"Custo unitário direto total",null,null,null,{"$f":"TRUNC(J526+J530,2)","v":0.54}]
[null,"Obs."]
[]
[16,"1ª/GRD",{"$nulls":8},{"$f":"J575","v":0.72}]
[null,"OBRA:","    PAVIMENTAÇÃO ASFÁLTICA EM CBUQ - VIAS URBANAS DIVERSAS - SEDE E COMUNIDADE RIO DAS PEDRAS (GLAUCILÂNDIA / MG)"]
[null,"Custo Unitário de Referência",null,null,"Minas Gerais"]
[{"$nulls":4}," Janeiro/2025",null,null,"Produção da equipe ",435.75,{"$f":"VLOOKUP(A539,ORÇAMENTO!$A$10:$L$42,7,1)","v":"TXKM"}]
[null,5915320,"TRANSPORTE COM CAMINHÃO BASCULANTE, RODOVIA EM REVESTIMENTO PRIMÁRIO",{"$nulls":5},"Valores em reais (R$)"]
[null,"A - EQUIPAMENTOS",null,"Quantidade","Utilização",null,"Custo Horário",null,null,"Custo"]
[{"$nulls":4},"Operativa","Improdutiva","Produtivo","Improdutivo",null,"Horário Total"]
[null,"E9667","Caminhão basculante com capacidade de 14 m³ - 210 kW",1,1,0,309.83940000000001,90.412199999999999,null,{"$f":"D546*(E546*G546+F546*H546)","v":309.83940000000001}]
[null,"-",0,null,null,null,0,0,null,{"$f":"D547*(E547*G547+F547*H547)","v":0}]
[{"$nulls":7},"Custo horário total de equipamentos",null,{"$f":"SUM(J546:J547)","v":309.83940000000001}]
[null,"B - MÃO DE OBRA",null,"Quantidade","Unidade",null,"Custo Horário","Custo Horário Total"]
[null,"-",0,null,0,null,0,null,null,{"$f":"D550*G550","v":0}]
[null,"-",0,null,0,null,0,null,null,{"$f":"D551*G551","v":0}]
[null,null,null,"Custo horário total de mão de obra",{"$nulls":5},{"$f":"SUM(J550:J551)","v":0}]
[null,null,null,"Custo horário total de execução",{"$nulls":5},{"$f":"J548+J552","v":309.83940000000001}]
[null,null,null,"Custo unitário de execução",{"$nulls":5},{"$f":"J553/I542","v":0.71104853700516357}]
[{"$nulls":7},"Custo do FIC",null,1.4E-2]
[{"$nulls":7},"Custo do FIT",null,0]
[null,"C - MATERIAL",null,"Quantidade","Unidade",null,"Preço Unitário","Custo Unitário"]
[null,"-",0,0,0,null,0,null,null,{"$f":"D558*G558","v":0}]
[null,"-",0,0,0,null,0,null,null,{"$f":"D559*G559","v":0}]
[null,null,null,"Custo unitário total de material",{"$nulls":5},{"$f":"SUM(J558:J559)","v":0}]
[null,"D - ATIVIDADES AUXILIARES",null,"Quantidade","Unidade",null,"Custo Unitário","Custo Unitário"]
[null,"-",0,0,0,null,0,null,null,{"$f":"D562*G562","v":0}]
[null,"-",0,0,0,null,0,null,null,{"$f":"D563*G563","v":0}]
[null,null,null,"Custo total de atividades auxiliares",{"$nulls":5},{"$f":"SUM(J562:J563)","v":0}]
[{"$nulls":7},"Subtotal",null,{"$f":"J554+J560+J564+J555+J556","v":0.72504853700516358}]
[null,"E - TEMPO FIXO",null,"Código","Quantidade","Unidade",null,"Custo Unitário","Custo Unitário"]
[null,"-",0,"-",0,"t",null,0,null,{"$f":"ROUNDDOWN(E567*H567,4)","v":0}]
[null,"-",0,"-",0,"t",null,0,null,{"$f":"ROUNDDOWN(E568*H568,4)","v":0}]
[null,null,null,"Custo unitário total de tempo fixo",{"$nulls":5},{"$f":"SUM(J567:J568)","v":0}]
[null,"F - MOMENTO DE TRANSPORTE",null,"Quantidade","Unidade","DMT",null,null,null,"Custo Unitário"]
[{"$nulls":5},"LN","RP","P"]
[null,"-",0,0,"tkm"]
[null,"-",0,0,"tkm"]
[null,null,null,"Custo unitário total de transporte"]
[{"$nulls":5},"Custo unitário direto total",null,null,null,{"$f":"TRUNC(J565+J569,2)","v":0.72}]
[null,"Obs."]
[]
[{"$f":"A539+1","v":17},"1ª/GRD",{"$nulls":8},{"$f":"J614","v":0.74}]
[null,"OBRA:","    PAVIMENTAÇÃO ASFÁLTICA EM CBUQ - VIAS URBANAS DIVERSAS - SEDE E COMUNIDADE RIO DAS PEDRAS (GLAUCILÂNDIA / MG)"]
[null,"Custo Unitário de Referência",null,null,"Minas Gerais"]
[{"$nulls":4}," Janeiro/2025",null,null,"Produção da equipe ",241.03,{"$f":"VLOOKUP(A578,ORÇAMENTO!$A$10:$L$42,7,1)","v":"TXKM"}]
[null,5914434,"TRANSPORTE COM CAMINHÃO CARROCERIA 9T, EM VIA URBANA PREDOMINANTEMENTE PAVIMENTADA",{"$nulls":5},"Valores em reais (R$)"]
[null,"A - EQUIPAMENTOS",null,"Quantidade","Utilização",null,"Custo Horário",null,null,"Custo"]
[{"$nulls":4},"Operativa","Improdutiva","Produtivo","Improdutivo",null,"Horário Total"]
[null,"E9508","Caminhão carroceria com capacidade de 9 t - 136 kW",1,1,0,178.82759999999999,67.927099999999996,null,{"$f":"D585*(E585*G585+F585*H585)","v":178.82759999999999}]
[null,"-",0,null,null,null,0,0,null,{"$f":"D586*(E586*G586+F586*H586)","v":0}]
[{"$nulls":7},"Custo horário total de equipamentos",null,{"$f":"SUM(J585:J586)","v":178.82759999999999}]
[null,"B - MÃO DE OBRA",null,"Quantidade","Unidade",null,"Custo Horário","Custo Horário Total"]
[null,"-",0,0,0,null,0,null,null,{"$f":"D589*G589","v":0}]
[null,"-",0,0,0,null,0,null,null,{"$f":"D590*G590","v":0}]
[null,null,null,"Custo horário total de mão de obra",{"$nulls":5},{"$f":"SUM(J589:J590)","v":0}]
[null,null,null,"Custo horário total de execução",{"$nulls":5},{"$f":"J587+J591","v":178.82759999999999}]
[null,null,null,"Custo unitário de execução",{"$nulls":5},{"$f":"J592/I581","v":0.7419308799734472}]
[{"$nulls":7},"Custo do FIC",null,0]
[{"$nulls":7},"Custo do FIT",null,0]
[null,"C - MATERIAL",null,"Quantidade","Unidade",null,"Preço Unitário","Custo Unitário"]
[null,"-",0,0,0,null,0,null,null,{"$f":"D597*G597","v":0}]
[null,"-",0,0,0,null,0,null,null,{"$f":"D598*G598","v":0}]
[null,null,null,"Custo unitário total de material",{"$nulls":5},{"$f":"SUM(J597:J598)","v":0}]
[null,"D - ATIVIDADES AUXILIARES",null,"Quantidade","Unidade",null,"Custo Unitário","Custo Unitário"]
[null,"-",0,0,0,null,0,null,null,{"$f":"D601*G601","v":0}]
[null,"-",0,0,0,null,0,null,null,{"$f":"D602*G602","v":0}]
[null,null,null,"Custo total de atividades auxiliares",{"$nulls":5},{"$f":"SUM(J601:J602)","v":0}]
[{"$nulls":7},"Subtotal",null,{"$f":"J593+J599+J603+J594+J595","v":0.7419308799734472}]
[null,"E - TEMPO FIXO",null,"Código","Quantidade","Unidade",null,"Custo Unitário","Custo Unitário"]
[null,"-",0,"-",0,"t",null,0,null,{"$f":"ROUNDDOWN(E606*H606,4)","v":0}]
[null,"-",0,"-",0,"t",null,0,null,{"$f":"ROUNDDOWN(E607*H607,4)","v":0}]
[null,null,null,"Custo unitário total de tempo fixo",{"$nulls":5},{"$f":"SUM(J606:J607)","v":0}]
[null,"F - MOMENTO DE TRANSPORTE",null,"Quantidade","Unidade","DMT",null,null,null,"Custo Unitário"]
[{"$nulls":5},"LN","RP","P"]
[null,"-",0,0,"tkm"]
[null,"-",0,0,"tkm"]
[null,null,null,"Custo unitário total de transporte"]
[{"$nulls":5},"Custo unitário direto total",null,null,null,{"$f":"TRUNC(J604+J608,2)","v":0.74}]
[null,"Obs."]
[]
[{"$f":"A578+1","v":18},"1ª/GRD",{"$nulls":8},{"$f":"J653","v":0.93}]
[null,"OBRA:","    PAVIMENTAÇÃO ASFÁLTICA EM CBUQ - VIAS URBANAS DIVERSAS - SEDE E COMUNIDADE RIO DAS PEDRAS (GLAUCILÂNDIA / MG)"]
[null,"Custo Unitário de Referência",null,null,"Minas Gerais"]
[{"$nulls":4}," Janeiro/2025",null,null,"Produção da equipe ",284.10000000000002,{"$f":"VLOOKUP(A617,ORÇAMENTO!$A$10:$L$42,7,1)","v":"TXKM"}]
[null,5914612,"TRANSPORTE DE MASSA ASFÁLTICA COM CAMINHÃO BASCULANTE, EM VIA URBANA PREDOMINANTEMENTE PAVIMENTADA",{"$nulls":5},"Valores em reais (R$)"]
[null,"A - EQUIPAMENTOS",null,"Quantidade","Utilização",null,"Custo Horário",null,null,"Custo"]
[{"$nulls":4},"Operativa","Improdutiva","Produtivo","Improdutivo",null,"Horário Total"]
[null,"E9520","Caminhão com caçamba térmica com capacidade de 6 m³ - 188 kW",1,1,0,265.74349999999998,76.6511,null,{"$f":"D624*(E624*G624+F624*H624)","v":265.74349999999998}]
[null,"-",0,null,null,null,0,0,null,{"$f":"D625*(E625*G625+F625*H625)","v":0}]
[{"$nulls":7},"Custo horário total de equipamentos",null,{"$f":"SUM(J624:J625)","v":265.74349999999998}]
[null,"B - MÃO DE OBRA",null,"Quantidade","Unidade",null,"Custo Horário","Custo Horário Total"]
[null,"-",0,0,0,null,0,null,null,{"$f":"D628*G628","v":0}]
[null,"-",0,0,0,null,0,null,null,{"$f":"D629*G629","v":0}]
[null,null,null,"Custo horário total de mão de obra",{"$nulls":5},{"$f":"SUM(J628:J629)","v":0}]
[null,null,null,"Custo horário total de execução",{"$nulls":5},{"$f":"J626+J630","v":265.74349999999998}]
[null,null,null,"Custo unitário de execução",{"$nulls":5},{"$f":"J631/I620","v":0.9353871876099964}]
[{"$nulls":7},"Custo do FIC",null,0]
[{"$nulls":7},"Custo do FIT",null,0]
[null,"C - MATERIAL",null,"Quantidade","Unidade",null,"Preço Unitário","Custo Unitário"]
[null,"-",0,0,0,null,0,null,null,{"$f":"D636*G636","v":0}]
[null,"-",0,0,0,null,0,null,null,{"$f":"D637*G637","v":0}]
[null,null,null,"Custo unitário total de material",{"$nulls":5},{"$f":"SUM(J636:J637)","v":0}]
[null,"D - ATIVIDADES AUXILIARES",null,"Quantidade","Unidade",null,"Custo Unitário","Custo Unitário"]
[null,"-",0,0,0,null,0,null,null,{"$f":"D640*G640","v":0}]
[null,"-",0,0,0,null,0,null,null,{"$f":"D641*G641","v":0}]
[null,null,null,"Custo total de atividades auxiliares",{"$nulls":5},{"$f":"SUM(J640:J641)","v":0}]
[{"$nulls":7},"Subtotal",null,{"$f":"J632+J638+J642+J633+J634","v":0.9353871876099964}]
[null,"E - TEMPO FIXO",null,"Código","Quantidade","Unidade",null,"Custo Unitário","Custo Unitário"]
[null,"-",0,"-",0,"t",null,0,null,{"$f":"ROUNDDOWN(E645*H645,4)","v":0}]
[null,"-",0,"-",0,"t",null,0,null,{"$f":"ROUNDDOWN(E646*H646,4)","v":0}]
[null,null,null,"Custo unitário total de tempo fixo",{"$nulls":5},{"$f":"SUM(J645:J646)","v":0}]
[null,"F - MOMENTO DE TRANSPORTE",null,"Quantidade","Unidade","DMT",null,null,null,"Custo Unitário"]
[{"$nulls":5},"LN","RP","P"]
[null,"-",0,0,"tkm"]
[null,"-",0,0,"tkm"]
[null,null,null,"Custo unitário total de transporte"]
[{"$nulls":5},"Custo unitário direto total",null,null,null,{"$f":"TRUNC(J643+J647,2)","v":0.93}]
[null,"Obs."]
[]
[{"$f":"A617+1","v":19},"1ª/GRD",{"$nulls":8},{"$f":"J692","v":1.74}]
[null,"OBRA:","    PAVIMENTAÇÃO ASFÁLTICA EM CBUQ - VIAS URBANAS DIVERSAS - SEDE E COMUNIDADE RIO DAS PEDRAS (GLAUCILÂNDIA / MG)"]
[null,"Custo Unitário de Referência",null,null,"Minas Gerais"]
[{"$nulls":4}," Janeiro/2025",null,null,"Produção da equipe ",149.4,{"$f":"VLOOKUP(A656,ORÇAMENTO!$A$10:$L$42,7,1)","v":"TXKM"}]
[null,5914622,"TRANSPORTE COM CAMINHÃO TANQUE DE TRANSPORTE DE MATERIAL ASFÁLTICO DE 30000 L, EM VIA URBANA PREDOMINANTEMENTE PAVIMENTADA",{"$nulls":5},"Valores em reais (R$)"]
[null,"A - EQUIPAMENTOS",null,"Quantidade","Utilização",null,"Custo Horário",null,null,"Custo"]
[{"$nulls":4},"Operativa","Improdutiva","Produtivo","Improdutivo",null,"Horário Total"]
[null,"E9509","Caminhão tanque distribuidor de asfalto com capacidade de 6.000 l - 7 kW/136 kW",1,1,0,261.03050000000002,72.388300000000001,null,{"$f":"D663*(E663*G663+F663*H663)","v":261.03050000000002}]
[null,"-",0,null,null,null,0,0,null,{"$f":"D664*(E664*G664+F664*H664)","v":0}]
[{"$nulls":7},"Custo horário total de equipamentos",null,{"$f":"SUM(J663:J664)","v":261.03050000000002}]
[null,"B - MÃO DE OBRA",null,"Quantidade","Unidade",null,"Custo Horário","Custo Horário Total"]
[null,"-",0,0,0,null,0,null,null,{"$f":"D667*G667","v":0}]
[null,"-",0,0,0,null,0,null,null,{"$f":"D668*G668","v":0}]
[null,null,null,"Custo horário total de mão de obra",{"$nulls":5},{"$f":"SUM(J667:J668)","v":0}]
[null,null,null,"Custo horário total de execução",{"$nulls":5},{"$f":"J665+J669","v":261.03050000000002}]
[null,null,null,"Custo unitário de execução",{"$nulls":5},{"$f":"J670/I659","v":1.7471921017402945}]
[{"$nulls":7},"Custo do FIC",null,0]
[{"$nulls":7},"Custo do FIT",null,0]
[null,"C - MATERIAL",null,"Quantidade","Unidade",null,"Preço Unitário","Custo Unitário"]
[null,"-",0,0,0,null,0,null,null,{"$f":"D675*G675","v":0}]
[null,"-",0,0,0,null,0,null,null,{"$f":"D676*G676","v":0}]
[null,null,null,"Custo unitário total de material",{"$nulls":5},{"$f":"SUM(J675:J676)","v":0}]
[null,"D - ATIVIDADES AUXILIARES",null,"Quantidade","Unidade",null,"Custo Unitário","Custo Unitário"]
[null,"-",0,0,0,null,0,null,null,{"$f":"D679*G679","v":0}]
[null,"-",0,0,0,null,0,null,null,{"$f":"D680*G680","v":0}]
[null,null,null,"Custo total de atividades auxiliares",{"$nulls":5},{"$f":"SUM(J679:J680)","v":0}]
[{"$nulls":7},"Subtotal",null,{"$f":"J671+J677+J681+J672+J673","v":1.7471921017402945}]
[null,"E - TEMPO FIXO",null,"Código","Quantidade","Unidade",null,"Custo Unitário","Custo Unitário"]
[null,"-",0,"-",0,"t",null,0,null,{"$f":"ROUNDDOWN(E684*H684,4)","v":0}]
[null,"-",0,"-",0,"t",null,0,null,{"$f":"ROUNDDOWN(E685*H685,4)","v":0}]
[null,null,null,"Custo unitário total de tempo fixo",{"$nulls":5},{"$f":"SUM(J684:J685)","v":0}]
[null,"F - MOMENTO DE TRANSPORTE",null,"Quantidade","Unidade","DMT",null,null,null,"Custo Unitário"]
[{"$nulls":5},"LN","RP","P"]
[null,"-",0,0,"tkm"]
[null,"-",0,0,"tkm"]
[null,null,null,"Custo unitário total de transporte"]
[{"$nulls":5},"Custo unitário direto total",null,null,null,{"$f":"TRUNC(J682+J686,2)","v":1.74}]
[null,"Obs."]
[]
[{"$f":"A656+1","v":20},"1ª/GRD",{"$nulls":8},{"$f":"J731","v":53.22}]
[null,"OBRA:","    PAVIMENTAÇÃO ASFÁLTICA EM CBUQ - VIAS URBANAS DIVERSAS - SEDE E COMUNIDADE RIO DAS PEDRAS (GLAUCILÂNDIA / MG)"]
[null,"Custo Unitário de Referência",null,null,"Minas Gerais"]
[{"$nulls":4}," Janeiro/2025",null,null,"Produção da equipe ",1,{"$f":"VLOOKUP(A695,ORÇAMENTO!$A$10:$L$42,7,1)","v":"M"}]
[null,94273,"ASSENTAMENTO DE GUIA (MEIO-FIO) PRÉ-MOLDADO DE CONCRETO - 100X15X13X30 CM (COMPRIMENTO X BASE INFERIOR X BASE SUPERIOR X ALTURA) - USO VIÁRIO",{"$nulls":5},"Valores em reais (R$)"]
[null,"A - EQUIPAMENTOS",null,"Quantidade","Utilização",null,"Custo Horário",null,null,"Custo"]
[{"$nulls":4},"Operativa","Improdutiva","Produtivo","Improdutivo",null,"Horário Total"]
[null,"-",0,null,null,null,0,0,null,{"$f":"D702*(E702*G702+F702*H702)","v":0}]
[null,"-",0,null,null,null,0,0,null,{"$f":"D703*(E703*G703+F703*H703)","v":0}]
[{"$nulls":7},"Custo horário total de equipamentos",null,{"$f":"SUM(J702:J703)","v":0}]
[null,"B - MÃO DE OBRA",null,"Quantidade","Unidade",null,"Custo Horário","Custo Horário Total"]
[null,"P9824","Servente",0.2296,"h",null,21.3355,null,null,{"$f":"D706*G706","v":4.8986308000000003}]
[null,"P9821","Pedreiro",0.2296,"h",null,26.6785,null,null,{"$f":"D707*G707","v":6.1253836000000002}]
[null,null,null,"Custo horário total de mão de obra",{"$nulls":5},{"$f":"SUM(J706:J707)","v":11.0240144}]
[null,null,null,"Custo horário total de execução",{"$nulls":5},{"$f":"J704+J708","v":11.0240144}]
[null,null,null,"Custo unitário de execução",{"$nulls":5},{"$f":"J709/I698","v":11.0240144}]
[{"$nulls":7},"Custo do FIC",null,0]
[{"$nulls":7},"Custo do FIT",null,0]
[null,"C - MATERIAL",null,"Quantidade","Unidade",null,"Preço Unitário","Custo Unitário"]
[null,"M0082","Areia média lavada",6.6E-3,"m³",null,164.1893,null,null,{"$f":"D714*G714","v":1.08364938}]
[null,4059,"Meio-fio ou guia de concreto, pré-moldado, comp.1,0m x 30 x 12/15 cm (H X L1/L2)",1.0049999999999999,"m",null,40,null,null,40.199999999999996]
[null,null,null,"Custo unitário total de material",{"$nulls":5},{"$f":"SUM(J714:J715)","v":41.283649379999993}]
[null,"D - ATIVIDADES AUXILIARES",null,"Quantidade","Unidade",null,"Custo Unitário","Custo Unitário"]
[null,1109669,"Argamassa de cimento e areia 1:3 - confecção em betoneira e lançamento manual - areia comercial",1.8E-3,"m³",null,507.26,null,null,{"$f":"D718*G718","v":0.91306799999999999}]
[null,"-",0,0,0,null,0,null,null,{"$f":"D719*G719","v":0}]
[null,null,null,"Custo total de atividades auxiliares",{"$nulls":5},{"$f":"SUM(J718:J719)","v":0.91306799999999999}]
[{"$nulls":7},"Subtotal",null,{"$f":"J710+J716+J720+J711+J712","v":53.220731779999994}]
[null,"E - TEMPO FIXO",null,"Código","Quantidade","Unidade",null,"Custo Unitário","Custo Unitário"]
[null,"-",0,"-",0,"t",null,0,null,{"$f":"ROUNDDOWN(E723*H723,4)","v":0}]
[null,"-",0,"-",0,"t",null,0,null,{"$f":"ROUNDDOWN(E724*H724,4)","v":0}]
[null,null,null,"Custo unitário total de tempo fixo",{"$nulls":5},{"$f":"SUM(J723:J724)","v":0}]
[null,"F - MOMENTO DE TRANSPORTE",null,"Quantidade","Unidade","DMT",null,null,null,"Custo Unitário"]
[{"$nulls":5},"LN","RP","P"]
[null,"-",0,0,"tkm","5914449","5914464","5914479"]
[null,"-",0,0,"tkm","5914449","5914464","5914479"]
[null,null,null,"Custo unitário total de transporte"]
[{"$nulls":5},"Custo unitário direto total",null,null,null,{"$f":"TRUNC(J721+J725,2)","v":53.22}]
[null,"Obs."]
[]
[23,"1ª/GRD",{"$nulls":8},{"$f":"J772","v":25.19}]
[null,"OBRA:","    PAVIMENTAÇÃO ASFÁLTICA EM CBUQ - VIAS URBANAS DIVERSAS - SEDE E COMUNIDADE RIO DAS PEDRAS (GLAUCILÂNDIA / MG)"]
[null,"Custo Unitário de Referência",null,null,"Minas Gerais"]
[{"$nulls":4}," Janeiro/2025",null,null,"Produção da equipe ",1,{"$f":"VLOOKUP(A734,ORÇAMENTO!$A$10:$L$42,7,1)","v":"M"}]
[null,"94287a","EXECUÇÃO DE SARJETA EM CONCRETO USINADO, MOLDADO IN LOCO - 30CM DE BASE X 5CM DE ALTURA",{"$nulls":5},"Valores em reais (R$)"]
[null,"A - EQUIPAMENTOS",null,"Quantidade","Utilização",null,"Custo Horário",null,null,"Custo"]
[{"$nulls":4},"Operativa","Improdutiva","Produtivo","Improdutivo",null,"Horário Total"]
[null,"-",0,null,null,null,0,0,null,{"$f":"D741*(E741*G741+F741*H741)","v":0}]
[null,"-",0,null,null,null,0,0,null,{"$f":"D742*(E742*G742+F742*H742)","v":0}]
[{"$nulls":7},"Custo horário total de equipamentos",null,{"$f":"SUM(J741:J742)","v":0}]
[null,"B - MÃO DE OBRA",null,"Quantidade","Unidade",null,"Custo Horário","Custo Horário Total"]
[null,"P9821","Pedreiro",0.2326,"h",null,26.6785,null,null,{"$f":"D745*G745","v":6.2054191000000003}]
[null,"P9824","Servente",0.2326,"h",null,21.3355,null,null,{"$f":"D746*G746","v":4.9626372999999999}]
[null,null,null,"Custo horário total de mão de obra",{"$nulls":5},{"$f":"SUM(J745:J746)","v":11.168056400000001}]
[null,null,null,"Custo horário total de execução",{"$nulls":5},{"$f":"J743+J747","v":11.168056400000001}]
[null,null,null,"Custo unitário de execução",{"$nulls":5},{"$f":"J748/I737","v":11.168056400000001}]
[{"$nulls":7},"Custo do FIC",null,0]
[{"$nulls":7},"Custo do FIT",null,0]
[null,"C - MATERIAL",null,"Quantidade","Unidade",null,"Preço Unitário","Custo Unitário"]
[null,"M0082","Areia média lavada",9.9000000000000008E-3,"m³",null,164.1893,null,null,{"$f":"D753*G753","v":1.6254740700000001}]
[null,"M0286","Tábua - E = 2,5 cm e L = 30 cm",8.3299999999999999E-2,"m",null,15.537800000000001,null,null,{"$f":"D754*G754","v":1.2942987400000001}]
[null,"M0451","Concreto usinado - fck = 20 MPa (comercial)",1.8800000000000001E-2,"m³",null,570,null,null,10.716000000000001]
[null,"M1358","Sarrafo em madeira de terceira - E = 2,5 cm e L = 5 cm",0.2,"m",null,1.9665999999999999,null,null,0.39332]
[null,null,null,"Custo unitário total de material",{"$nulls":5},{"$f":"SUM(J753:J756)","v":14.029092810000002}]
[null,"D - ATIVIDADES AUXILIARES",null,"Quantidade","Unidade",null,"Custo Unitário","Custo Unitário"]
[null,"-",0,null,0,null,0,null,null,{"$f":"D759*G759","v":0}]
[null,"-",0,null,0,null,0,null,null,{"$f":"D760*G760","v":0}]
[null,null,null,"Custo total de atividades auxiliares",{"$nulls":5},{"$f":"SUM(J759:J760)","v":0}]
[{"$nulls":7},"Subtotal",null,{"$f":"J749+J757+J761+J750+J751","v":25.197149210000003}]
[null,"E - TEMPO FIXO",null,"Código","Quantidade","Unidade",null,"Custo Unitário","Custo Unitário"]
[null,"-",0,"-",0,"t",null,0,null,{"$f":"ROUNDDOWN(E764*H764,4)","v":0}]
[null,"-",0,"-",0,"t",null,0,null,{"$f":"ROUNDDOWN(E765*H765,4)","v":0}]
[null,null,null,"Custo unitário total de tempo fixo",{"$nulls":5},{"$f":"SUM(J764:J765)","v":0}]
[null,"F - MOMENTO DE TRANSPORTE",null,"Quantidade","Unidade","DMT",null,null,null,"Custo Unitário"]
[{"$nulls":5},"LN","RP","P"]
[null,"-",0,0,"tkm"]
[null,"-",0,0,"tkm"]
[null,null,null,"Custo unitário total de transporte"]
[{"$nulls":5},"Custo unitário direto total",null,null,null,{"$f":"TRUNC(J762+J766,2)","v":25.19}]
[null,"Obs."]
[]
[46,"1ª/GRD",{"$nulls":8},{"$f":"J811","v":259.45999999999998}]
[null,"OBRA:","    PAVIMENTAÇÃO ASFÁLTICA EM CBUQ - VIAS URBANAS DIVERSAS - SEDE E COMUNIDADE RIO DAS PEDRAS (GLAUCILÂNDIA / MG)"]
[null,"Custo Unitário de Referência",null,null,"Minas Gerais"]
[{"$nulls":4}," Janeiro/2025",null,null,"Produção da equipe ",3,{"$f":"VLOOKUP(A775,ORÇAMENTO!$A$10:$L$42,7,1)","v":"UN."}]
[null,5213440,"PLACA DE REGULAMENTAÇÃO EM AÇO, D=60CM - PELÍCULA RETRORREFLETIVA - FORNECIMENTO E INSTALAÇÃO, INCLUSIVE  SUPORTE",{"$nulls":5},"Valores em reais (R$)"]
[null,"A - EQUIPAMENTOS",null,"Quantidade","Utilização",null,"Custo Horário",null,null,"Custo"]
[{"$nulls":4},"Operativa","Improdutiva","Produtivo","Improdutivo",null,"Horário Total"]
[null,"E9687","Caminhão carroceria com capacidade de 5 t - 115 kW",1,0.3,0.7,146.88079999999999,57.423099999999998,null,{"$f":"D782*(E782*G782+F782*H782)","v":84.260409999999993}]
[null,"-",0,null,null,null,0,0,null,{"$f":"D783*(E783*G783+F783*H783)","v":0}]
[{"$nulls":7},"Custo horário total de equipamentos",null,{"$f":"SUM(J782:J783)","v":84.260409999999993}]
[null,"B - MÃO DE OBRA",null,"Quantidade","Unidade",null,"Custo Horário","Custo Horário Total"]
[null,"P9830","Montador",1,"h",null,36.409500000000001,null,null,{"$f":"D786*G786","v":36.409500000000001}]
[null,"P9824","Servente",2,"h",null,21.3355,null,null,{"$f":"D787*G787","v":42.670999999999999}]
[null,null,null,"Custo horário total de mão de obra",{"$nulls":5},{"$f":"SUM(J786:J787)","v":79.080500000000001}]
[null,null,null,"Custo horário total de execução",{"$nulls":5},{"$f":"J784+J788","v":163.34091000000001}]
[null,null,null,"Custo unitário de execução",{"$nulls":5},{"$f":"J789/I778","v":54.44697}]
[{"$nulls":7},"Custo do FIC",null,0]
[{"$nulls":7},"Custo do FIT",null,0]
[null,"C - MATERIAL",null,"Quantidade","Unidade",null,"Preço Unitário","Custo Unitário"]
[null,"-",0,null,0,null,0,null,null,{"$f":"D794*G794","v":0}]
[null,"-",0,null,0,null,0,null,null,{"$f":"D795*G795","v":0}]
[null,null,null,"Custo unitário total de material",{"$nulls":5},{"$f":"SUM(J794:J795)","v":0}]
[null,"D - ATIVIDADES AUXILIARES",null,"Quantidade","Unidade",null,"Custo Unitário","Custo Unitário"]
[null,5213414,"Placa em aço nº 16 galvanizado com película retrorrefletiva tipo I + SI - confecção",0.35993999999999998,"m²",null,569.58000000000004,null,null,{"$f":"D798*G798","v":205.01462520000001}]
[null,"-",0,null,0,null,0,null,null,{"$f":"D799*G799","v":0}]
[null,null,null,"Custo total de atividades auxiliares",{"$nulls":5},{"$f":"SUM(J798:J799)","v":205.01462520000001}]
[{"$nulls":7},"Subtotal",null,{"$f":"J790+J796+J800+J791+J792","v":259.46159520000003}]
[null,"E - TEMPO FIXO",null,"Código","Quantidade","Unidade",null,"Custo Unitário","Custo Unitário"]
[null,"-",0,"-",null,"t",null,0,null,{"$f":"ROUNDDOWN(E803*H803,4)","v":0}]
[null,"-",0,"-",null,"t",null,0,null,{"$f":"ROUNDDOWN(E804*H804,4)","v":0}]
[null,null,null,"Custo unitário total de tempo fixo",{"$nulls":5},{"$f":"SUM(J803:J804)","v":0}]
[null,"F - MOMENTO DE TRANSPORTE",null,"Quantidade","Unidade","DMT",null,null,null,"Custo Unitário"]
[{"$nulls":5},"LN","RP","P"]
[null,"-",0,null,"tkm"]
[null,"-",0,null,"tkm"]
[null,null,null,"Custo unitário total de transporte"]
[{"$nulls":5},"Custo unitário direto total",null,null,null,{"$f":"TRUNC(J801+J805,2)","v":259.45999999999998}]
[null,"Obs."]
[]
[49,"1ª/GRD",{"$nulls":8},{"$f":"J857","v":29.17}]
[null,"OBRA:","    PAVIMENTAÇÃO ASFÁLTICA EM CBUQ - VIAS URBANAS DIVERSAS - SEDE E COMUNIDADE RIO DAS PEDRAS (GLAUCILÂNDIA / MG)"]
[null,"Custo Unitário de Referência",null,null,"Minas Gerais"]
[{"$nulls":4}," Janeiro/2025",null,null,"Produção da equipe ",149.4,{"$f":"VLOOKUP(A814,ORÇAMENTO!$A$10:$L$42,7,1)","v":"M2"}]
[null,5213401,"PINTURA DE EIXO VIÁRIO SOBRE ASFALTO COM TINTA RETRORREFLETIVA A BASE DE RESINA ACRÍLICA COM MICROESFERAS DE VIDRO, APLICAÇÃO MECÂNICA COM DEMARCADORA AUTOPROPELIDA",{"$nulls":5},"Valores em reais (R$)"]
[null,"A - EQUIPAMENTOS",null,"Quantidade","Utilização",null,"Custo Horário",null,null,"Custo"]
[{"$nulls":4},"Operativa","Improdutiva","Produtivo","Improdutivo",null,"Horário Total"]
[null,"E9644","Caminhão demarcador de faixas com sistema de pintura a frio - 28 kW/115 kW",1,1,0,374.84390000000002,155.3843,null,{"$f":"D821*(E821*G821+F821*H821)","v":374.84390000000002}]
[null,"-",0,null,null,null,0,0,null,{"$f":"D822*(E822*G822+F822*H822)","v":0}]
[{"$nulls":7},"Custo horário total de equipamentos",null,{"$f":"SUM(J821:J822)","v":374.84390000000002}]
[null,"B - MÃO DE OBRA",null,"Quantidade","Unidade",null,"Custo Horário","Custo Horário Total"]
[null,"P9853","Pré-marcador",1,"h",null,22.8993,null,null,{"$f":"D825*G825","v":22.8993}]
[null,"P9824","Servente",4,"h",null,21.3355,null,null,{"$f":"D826*G826","v":85.341999999999999}]
[null,null,null,"Custo horário total de mão de obra",{"$nulls":5},{"$f":"SUM(J825:J826)","v":108.2413}]
[null,null,null,"Custo horário total de execução",{"$nulls":5},{"$f":"J823+J827","v":483.08519999999999}]
[null,null,null,"Custo unitário de execução",{"$nulls":5},{"$f":"J828/I817","v":3.2335020080321284}]
[{"$nulls":7},"Custo do FIC",null,0]
[{"$nulls":7},"Custo do FIT",null,0]
[null,"C - MATERIAL",null,"Quantidade","Unidade",null,"Preço Unitário","Custo Unitário"]
[null,"M2037","Microesferas refletivas de vidro tipo I-B",0.12,"kg",null,8.7245000000000008,null,null,{"$f":"D833*G833","v":1.04694}]
[null,"M2038","Microesferas refletivas de vidro tipo II-A",0.35,"kg",null,8.9086999999999996,null,null,{"$f":"D834*G834","v":3.1180449999999995}]
[null,"M2034","Solvente para tinta à base de resina acrílica",0.03,"l",null,16.8491,null,null,0.50547299999999995]
[null,"M2044","Tinta à base de resina acrílica emulsionada em água para pré-marcação viária",9.7000000000000005E-4,"l",null,21.025400000000001,null,null,2.0394638000000003E-2]
[null,"M2027","Tinta à base de resina acrílica estirenada para demarcação viária",0.6,"l",null,35.350499999999997,null,null,21.210299999999997]
[null,null,null,"Custo unitário total de material",{"$nulls":5},{"$f":"SUM(J833:J837)","v":25.901152637999996}]
[null,"D - ATIVIDADES AUXILIARES",null,"Quantidade","Unidade",null,"Custo Unitário","Custo Unitário"]
[null,"-",0,null,0,null,0,null,null,{"$f":"D840*G840","v":0}]
[null,"-",0,null,0,null,0,null,null,{"$f":"D841*G841","v":0}]
[null,null,null,"Custo total de atividades auxiliares",{"$nulls":5},{"$f":"SUM(J840:J841)","v":0}]
[{"$nulls":7},"Subtotal",null,{"$f":"J829+J838+J842+J830+J831","v":29.134654646032125}]
[null,"E - TEMPO FIXO",null,"Código","Quantidade","Unidade",null,"Custo Unitário","Custo Unitário"]
[null,"M2037","Microesferas refletivas de vidro tipo I-B",5914655,1.2E-4,"t",null,32.520000000000003,null,{"$f":"ROUNDDOWN(E845*H845,4)","v":3.8999999999999998E-3}]
[null,"M2038","Microesferas refletivas de vidro tipo II-A",5914655,3.5E-4,"t",null,32.520000000000003,null,{"$f":"ROUNDDOWN(E846*H846,4)","v":1.1299999999999999E-2}]
[null,"M2034","Solvente para tinta à base de resina acrílica",5914655,3.0000000000000001E-5,"t",null,32.520000000000003,null,8.9999999999999998E-4]
[null,"M2027","Tinta à base de resina acrílica estirenada para demarcação viária",5914655,8.3000000000000001E-4,"t",null,32.520000000000003,null,2.69E-2]
[null,null,null,"Custo unitário total de tempo fixo",{"$nulls":5},{"$f":"SUM(J845:J848)","v":4.2999999999999997E-2}]
[null,"F - MOMENTO DE TRANSPORTE",null,"Quantidade","Unidade","DMT",null,null,null,"Custo Unitário"]
[{"$nulls":5},"LN","RP","P"]
[null,"M2037","Microesferas refletivas de vidro tipo I-B",1.2E-4,"tkm"]
[null,"M2038","Microesferas refletivas de vidro tipo II-A",3.5E-4,"tkm"]
[null,"M2034","Solvente para tinta à base de resina acrílica",3.0000000000000001E-5,"tkm"]
[null,"M2027","Tinta à base de resina acrílica estirenada para demarcação viária",8.3000000000000001E-4,"tkm"]
[null,null,null,"Custo unitário total de transporte"]
[{"$nulls":5},"Custo unitário direto total",null,null,null,{"$f":"TRUNC(J843+J849,2)","v":29.17}]
[null,"Obs."]
[]
[51,"1ª/GRD",{"$nulls":8},{"$f":"J903","v":41.95}]
[null,"OBRA:","    PAVIMENTAÇÃO ASFÁLTICA EM CBUQ - VIAS URBANAS DIVERSAS - SEDE E COMUNIDADE RIO DAS PEDRAS (GLAUCILÂNDIA / MG)"]
[null,"Custo Unitário de Referência",null,null,"Minas Gerais"]
[{"$nulls":4}," Janeiro/2025",null,null,"Produção da equipe ",30.18,{"$f":"VLOOKUP(A860,ORÇAMENTO!$A$10:$L$42,7,1)","v":"M2"}]
[null,5213405,"PINTURA DE FAIXA DE PEDESTRE OU ZEBRADA TINTA RETRORREFLETIVA A BASE DE RESINA ACRÍLICA COM MICROESFERAS DE VIDRO, APLICAÇÃO MANUAL",{"$nulls":5},"Valores em reais (R$)"]
[null,"A - EQUIPAMENTOS",null,"Quantidade","Utilização",null,"Custo Horário",null,null,"Custo"]
[{"$nulls":4},"Operativa","Improdutiva","Produtivo","Improdutivo",null,"Horário Total"]
[null,"E9644","Caminhão demarcador de faixas com sistema de pintura a frio - 28 kW/115 kW",1,1,0,374.84390000000002,155.3843,null,{"$f":"D867*(E867*G867+F867*H867)","v":374.84390000000002}]
[null,"-",0,null,null,null,0,0,null,{"$f":"D868*(E868*G868+F868*H868)","v":0}]
[{"$nulls":7},"Custo horário total de equipamentos",null,{"$f":"SUM(J867:J868)","v":374.84390000000002}]
[null,"B - MÃO DE OBRA",null,"Quantidade","Unidade",null,"Custo Horário","Custo Horário Total"]
[null,"P9853","Pré-marcador",1,"h",null,22.8993,null,null,{"$f":"D871*G871","v":22.8993}]
[null,"P9824","Servente",4,"h",null,21.3355,null,null,{"$f":"D872*G872","v":85.341999999999999}]
[null,null,null,"Custo horário total de mão de obra",{"$nulls":5},{"$f":"SUM(J871:J872)","v":108.2413}]
[null,null,null,"Custo horário total de execução",{"$nulls":5},{"$f":"J869+J873","v":483.08519999999999}]
[null,null,null,"Custo unitário de execução",{"$nulls":5},{"$f":"J874/I863","v":16.006799204771372}]
[{"$nulls":7},"Custo do FIC",null,0]
[{"$nulls":7},"Custo do FIT",null,0]
[null,"C - MATERIAL",null,"Quantidade","Unidade",null,"Preço Unitário","Custo Unitário"]
[null,"M2037","Microesferas refletivas de vidro tipo I-B",0.12,"kg",null,8.7245000000000008,null,null,{"$f":"D879*G879","v":1.04694}]
[null,"M2038","Microesferas refletivas de vidro tipo II-A",0.35,"kg",null,8.9086999999999996,null,null,{"$f":"D880*G880","v":3.1180449999999995}]
[null,"M2034","Solvente para tinta à base de resina acrílica",0.03,"l",null,16.8491,null,null,0.50547299999999995]
[null,"M2044","Tinta à base de resina acrílica emulsionada em água para pré-marcação viária",9.7000000000000005E-4,"l",null,21.025400000000001,null,null,2.0394638000000003E-2]
[null,"M2027","Tinta à base de resina acrílica estirenada para demarcação viária",0.6,"l",null,35.350499999999997,null,null,21.210299999999997]
[null,null,null,"Custo unitário total de material",{"$nulls":5},{"$f":"SUM(J879:J883)","v":25.901152637999996}]
[null,"D - ATIVIDADES AUXILIARES",null,"Quantidade","Unidade",null,"Custo Unitário","Custo Unitário"]
[null,"-",0,null,0,null,0,null,null,{"$f":"D886*G886","v":0}]
[null,"-",0,null,0,null,0,null,null,{"$f":"D887*G887","v":0}]
[null,null,null,"Custo total de atividades auxiliares",{"$nulls":5},{"$f":"SUM(J886:J887)","v":0}]
[{"$nulls":7},"Subtotal",null,{"$f":"J875+J884+J888+J876+J877","v":41.907951842771368}]
[null,"E - TEMPO FIXO",null,"Código","Quantidade","Unidade",null,"Custo Unitário","Custo Unitário"]
[null,"M2037","Microesferas refletivas de vidro tipo I-B",5914655,1.2E-4,"t",null,32.520000000000003,null,{"$f":"ROUNDDOWN(E891*H891,4)","v":3.8999999999999998E-3}]
[null,"M2038","Microesferas refletivas de vidro tipo II-A",5914655,3.5E-4,"t",null,32.520000000000003,null,{"$f":"ROUNDDOWN(E892*H892,4)","v":1.1299999999999999E-2}]
[null,"M2034","Solvente para tinta à base de resina acrílica",5914655,3.0000000000000001E-5,"t",null,32.520000000000003,null,8.9999999999999998E-4]
[null,"M2027","Tinta à base de resina acrílica estirenada para demarcação viária",5914655,8.3000000000000001E-4,"t",null,32.520000000000003,null,2.69E-2]
[null,null,null,"Custo unitário total de tempo fixo",{"$nulls":5},{"$f":"SUM(J891:J894)","v":4.2999999999999997E-2}]
[null,"F - MOMENTO DE TRANSPORTE",null,"Quantidade","Unidade","DMT",null,null,null,"Custo Unitário"]
[{"$nulls":5},"LN","RP","P"]
[null,"M2037","Microesferas refletivas de vidro tipo I-B",1.2E-4,"tkm"]
[null,"M2038","Microesferas refletivas de vidro tipo II-A",3.5E-4,"tkm"]
[null,"M2034","Solvente para tinta à base de resina acrílica",3.0000000000000001E-5,"tkm"]
[null,"M2027","Tinta à base de resina acrílica estirenada para demarcação viária",8.3000000000000001E-4,"tkm"]
[null,null,null,"Custo unitário total de transporte"]
[{"$nulls":5},"Custo unitário direto total",null,null,null,{"$f":"TRUNC(J889+J895,2)","v":41.95}]
[null,"Obs."]

{"sheet":"CPU-FORNEC","index":2,"n_rows":92,"n_cols":14,"rows_kept":92,"cut":false,"hidden":false,"merged":[[81,1,81,7],[82,0,91,0],[82,1,82,3],[82,4,82,7],[83,2,83,5],[84,2,84,3],[85,1,85,7],[88,1,88,3],[88,5,88,6],[89,1,89,6],[90,1,90,6],[91,1,91,6],[60,0,69,0],[60,1,60,3],[60,4,60,7],[61,2,61,5],[62,2,62,3],[63,1,63,7],[66,1,66,3],[66,5,66,6],[67,1,67,6],[68,1,68,6],[69,1,69,6],[38,0,47,0],[38,1,38,3],[38,4,38,7],[39,2,39,5],[40,2,40,3],[41,1,41,7],[44,1,44,3],[44,5,44,6],[45,1,45,6],[46,1,46,6],[47,1,47,6],[22,5,22,6],[23,1,23,6],[24,1,24,6],[25,1,25,6],[5,1,5,7],[9,1,9,7],[13,1,13,7],[17,1,17,7],[0,10,0,11],[1,2,1,5],[1,10,1,11],[2,2,2,3],[3,1,3,7],[27,4,27,7],[28,2,28,5],[27,0,36,0],[29,2,29,3],[30,1,30,7],[33,1,33,3],[33,5,33,6],[34,1,34,6],[35,1,35,6],[36,1,36,6],[0,0,26,0],[0,1,0,3],[0,4,0,7],[22,1,22,3],[49,0,58,0],[49,1,49,3],[49,4,49,7],[50,2,50,5],[51,2,51,3],[52,1,52,7],[55,1,55,3],[55,5,55,6],[56,1,56,6],[57,1,57,6],[58,1,58,6],[27,1,27,3],[71,0,80,0],[71,1,71,3],[71,4,71,7],[72,2,72,5],[73,2,73,3],[74,1,74,7],[77,1,77,3],[77,5,77,6],[78,1,78,6],[79,1,79,6],[80,1,80,6]]}
[1,"CODEVASF",null,null," COMPOSIÇÃO DE PREÇO UNITÁRIO",null,null,null,{"$f":"H24","v":0},{"$f":"H26","v":0},"BDI CALCULADO:",null,{"$f":"ORÇAMENTO!L6","v":15}]
[null,"OBRA:  ","    PAVIMENTAÇÃO ASFÁLTICA EM CBUQ - VIAS URBANAS DIVERSAS - SEDE E COMUNIDADE RIO DAS PEDRAS (GLAUCILÂNDIA / MG)",null,null,null,"DATA: ",{"$f":"ORÇAMENTO!C6","v":"     ABRIL / 2025 "},null,null,"BDI DIFERENCIADO:",null,{"$f":"'BDI FORN'!D31/100","v":0.15}]
[null,"SERVIÇO:  ","CPU.1",null,"Referência:","CODEVASF","UNIDADE: ",{"$f":"VLOOKUP(A1,ORÇAMENTO!A11:L30,5)","v":"MOBILIZAÇÃO E DESMOBILIZAÇÃO"}]
[]
[null,"TIPO ITEM","CODIGO ITEM","DESCRIÇÃO ITEM","UNIDADE ITEM","COEFICIENTE","PRECO UNITARIO","CUSTO TOTAL",null,"distancia =",90,"B.DESPACHO"]
[null,"EQUIPAMENTOS",{"$nulls":7},"Pá carregadeira ",null,null,10.1," ton"]
[null,null,"E9001","E9001","E9001",null,"E9001"]
[]
[]
[null,"MÃO DE OBRA"]
[]
[]
[]
[null,"MATERIAIS"]
[]
[]
[{"$nulls":7},{"$f":"ROUNDDOWN(F17*G17,2)","v":0},null,"Motoniveladora ",null,null,12.47," ton"]
[null,"ATIVIDADES AUXILIARES",{"$nulls":7},"Trator de pneus",null,null,2.8," ton"]
[{"$nulls":7},{"$f":"ROUNDDOWN(F19*G19,2)","v":0}]
[{"$nulls":7},0]
[{"$nulls":7},0]
[{"$nulls":7},{"$f":"ROUNDDOWN(F22*G22,2)","v":0},null,"Rolo Compactador ",null,null,15.33," ton"]
[null,"PRODUÇÃO DA EQUIPE",null,null,1,"CUSTO ",null,{"$f":"SUM(H6:H22)","v":0},null,"Grade de disco",null,null,1," ton"]
[null,"TOTAL",{"$nulls":5},{"$f":"H23/E23","v":0},"OK","RETROESCAVADEIRA",null,null,6.67," ton"]
[null,"BDI                %",{"$nulls":5},{"$f":"1+$M$1","v":16}]
[null,"TOTAL DO SERVIÇO - R$",{"$nulls":5},{"$f":"ROUND(H24*H25,2)","v":0}]
[]
["F1","CODEVASF",null,null," COMPOSIÇÃO DE PREÇO UNITÁRIO",null,null,null,{"$f":"H35","v":3532.13},{"$f":"H37","v":4061.95}]
[null,"OBRA:  ","    PAVIMENTAÇÃO ASFÁLTICA EM CBUQ - VIAS URBANAS DIVERSAS - SEDE E COMUNIDADE RIO DAS PEDRAS (GLAUCILÂNDIA / MG)",null,null,null,"DATA: ",{"$f":"$H$2","v":"     ABRIL / 2025 "}]
[null,"SERVIÇO:  ","AQUISIÇÃO DE EMULSÃO ASFÁLTICA PARA IMPRIMAÇÃO (EAI) - EXCLUSIVE TRANSPORTE",null,"Referência:","CPU.7","UNIDADE: ",{"$f":"VLOOKUP(A28,ORÇAMENTO!$A$11:$L$49,7)","v":"T"}]
[]
[null,"TIPO ITEM","CODIGO ITEM","DESCRIÇÃO ITEM","UNIDADE ITEM","COEFICIENTE","PRECO UNITARIO","CUSTO TOTAL"]
[null,"INSUMO","ANP","EMULSÃO ASFÁLTICA PARA SERVIÇO DE IMPRIMAÇÃO (MEMÓRIA EM ANEXO)","T",1,3532.1370595881235,{"$f":"ROUNDDOWN(F33*G33,2)","v":3532.13}]
[null,"PRODUÇÃO DA EQUIPE",null,null,1,"CUSTO ",null,{"$f":"SUM(H33:H33)","v":3532.13}]
[null,"TOTAL",{"$nulls":5},{"$f":"H34/E34","v":3532.13}]
[null,"BDI                %",{"$nulls":5},{"$f":"1+$M$2","v":1.1499999999999999}]
[null,"TOTAL DO SERVIÇO - R$",{"$nulls":5},{"$f":"ROUND(H35*H36,2)","v":4061.95},"OK"]
[]
["F2","CODEVASF",null,null," COMPOSIÇÃO DE PREÇO UNITÁRIO",null,null,null,{"$f":"H46","v":398},{"$f":"H48","v":457.7}]
[null,"OBRA:  ","    PAVIMENTAÇÃO ASFÁLTICA EM CBUQ - VIAS URBANAS DIVERSAS - SEDE E COMUNIDADE RIO DAS PEDRAS (GLAUCILÂNDIA / MG)",null,null,null,"DATA: ",{"$f":"$H$2","v":"     ABRIL / 2025 "}]
[null,"SERVIÇO:  ","TRANSPORTE DE EMULSÃO ASFÁLTICA PARA IMPRIMAÇÃO (EAI)",null,"Referência:","CPU.8","UNIDADE: ",{"$f":"VLOOKUP(A39,ORÇAMENTO!$A$11:$L$49,7)","v":"T"}]
[]
[null,"TIPO ITEM","CODIGO ITEM","DESCRIÇÃO ITEM","UNIDADE ITEM","COEFICIENTE","PRECO UNITARIO","CUSTO TOTAL"]
[null,"INSUMO"," - ","TRANSPORTE DE EMULSÃO ASFÁLTICA PARA IMPRIMAÇÃO (EAI), INCLUINDO CUSTO TOTAL DO TRANSPORTE (COMBUSTÍVEL, PEDÁGIOS, ETC.) E ICMS - MEMÓRIA ANEXA","T",1,398.00428571428569,{"$f":"ROUNDDOWN(F44*G44,2)","v":398}]
[null,"PRODUÇÃO DA EQUIPE",null,null,1,"CUSTO ",null,{"$f":"SUM(H44:H44)","v":398}]
[null,"TOTAL",{"$nulls":5},{"$f":"H45/E45","v":398}]
[null,"BDI                %",{"$nulls":5},{"$f":"1+$M$2","v":1.1499999999999999}]
[null,"TOTAL DO SERVIÇO - R$",{"$nulls":5},{"$f":"ROUND(H46*H47,2)","v":457.7},"OK"]
[]
["F3","CODEVASF",null,null," COMPOSIÇÃO DE PREÇO UNITÁRIO",null,null,null,{"$f":"H57","v":3480.79},{"$f":"H59","v":4002.91}]
[null,"OBRA:  ","    PAVIMENTAÇÃO ASFÁLTICA EM CBUQ - VIAS URBANAS DIVERSAS - SEDE E COMUNIDADE RIO DAS PEDRAS (GLAUCILÂNDIA / MG)",null,null,null,"DATA: ",{"$f":"$H$2","v":"     ABRIL / 2025 "}]
[null,"SERVIÇO:  ","AQUISIÇÃO DE EMULSAO ASFALTICA CATIONICA RR-1C - EXCLUSIVE TRANSPORTE",null,"Referência:","CPU.9","UNIDADE: ",{"$f":"VLOOKUP(A50,ORÇAMENTO!$A$11:$L$49,7)","v":"T"}]
[]
[null,"TIPO ITEM","CODIGO ITEM","DESCRIÇÃO ITEM","UNIDADE ITEM","COEFICIENTE","PRECO UNITARIO","CUSTO TOTAL"]
[null,"INSUMO","ANP","EMULSÃO ASFÁLTICA CATIÔNICA RR-1C(MEMÓRIA EM ANEXO)","T",1,3480.7926129148304,{"$f":"ROUNDDOWN(F55*G55,2)","v":3480.79}]
[null,"PRODUÇÃO DA EQUIPE",null,null,1,"CUSTO ",null,{"$f":"SUM(H55:H55)","v":3480.79}]
[null,"TOTAL",{"$nulls":5},{"$f":"H56/E56","v":3480.79},"OK"]
[null,"BDI                %",{"$nulls":5},{"$f":"1+$M$2","v":1.1499999999999999}]
[null,"TOTAL DO SERVIÇO - R$",{"$nulls":5},{"$f":"ROUND(H57*H58,2)","v":4002.91}]
[]
["F4","CODEVASF",null,null," COMPOSIÇÃO DE PREÇO UNITÁRIO",null,null,null,{"$f":"H68","v":489.22},{"$f":"H70","v":562.6}]
[null,"OBRA:  ","    PAVIMENTAÇÃO ASFÁLTICA EM CBUQ - VIAS URBANAS DIVERSAS - SEDE E COMUNIDADE RIO DAS PEDRAS (GLAUCILÂNDIA / MG)",null,null,null,"DATA: ",{"$f":"$H$2","v":"     ABRIL / 2025 "}]
[null,"SERVIÇO:  ","TRANSPORTE DE EMULSÃO ASFÁLTICA CATIONICA RR-1C",null,"Referência:","CPU.10","UNIDADE: ",{"$f":"VLOOKUP(A61,ORÇAMENTO!$A$11:$L$49,7)","v":"T"}]
[]
[null,"TIPO ITEM","CODIGO ITEM","DESCRIÇÃO ITEM","UNIDADE ITEM","COEFICIENTE","PRECO UNITARIO","CUSTO TOTAL"]
[null,"INSUMO"," - ","TRANSPORTE DE EMULSÃO ASFÁLTICA CATIONICA TIPO RR-1C, INCLUINDO CUSTO TOTAL DO TRANSPORTE (COMBUSTÍVEL, PEDÁGIOS, ETC.) E ICMS - MEMÓRIA ANEXA","T",1,489.22949008498574,{"$f":"ROUNDDOWN(F66*G66,2)","v":489.22}]
[null,"PRODUÇÃO DA EQUIPE",null,null,1,"CUSTO ",null,{"$f":"SUM(H66:H66)","v":489.22}]
[null,"TOTAL",{"$nulls":5},{"$f":"H67/E67","v":489.22},"OK"]
[null,"BDI                %",{"$nulls":5},{"$f":"1+$M$2","v":1.1499999999999999}]
[null,"TOTAL DO SERVIÇO - R$",{"$nulls":5},{"$f":"ROUND(H68*H69,2)","v":562.6}]
[]
["F5","CODEVASF",null,null," COMPOSIÇÃO DE PREÇO UNITÁRIO",null,null,null,{"$f":"H79","v":4815.2},{"$f":"H81","v":5537.48}]
[null,"OBRA:  ","    PAVIMENTAÇÃO ASFÁLTICA EM CBUQ - VIAS URBANAS DIVERSAS - SEDE E COMUNIDADE RIO DAS PEDRAS (GLAUCILÂNDIA / MG)",null,null,null,"DATA: ",{"$f":"$H$2","v":"     ABRIL / 2025 "}]
[null,"SERVIÇO:  ","AQUISIÇÃO DE CONCRETO ASFÁLTICO DE PETRÓLEO - CAP 50/70 - EXCLUSIVE TRANSPORTE",null,"Referência:","CPU.11","UNIDADE: ",{"$f":"VLOOKUP(A72,ORÇAMENTO!$A$11:$L$49,7)","v":"T"}]
[]
[null,"TIPO ITEM","CODIGO ITEM","DESCRIÇÃO ITEM","UNIDADE ITEM","COEFICIENTE","PRECO UNITARIO","CUSTO TOTAL"]
[null,"INSUMO",1518,"CIMENTOS ASFÁLTICO DE PETRÓLEO TIPO CAP 50/70 (MEMÓRIA EM ANEXO)","T",1,4815.2051307564443,{"$f":"ROUNDDOWN(F77*G77,2)","v":4815.2}]
[null,"PRODUÇÃO DA EQUIPE",null,null,1,"CUSTO ",null,{"$f":"SUM(H77:H77)","v":4815.2}]
[null,"TOTAL",{"$nulls":5},{"$f":"H78/E78","v":4815.2}]
[null,"BDI                %",{"$nulls":5},{"$f":"1+$M$2","v":1.1499999999999999}]
[null,"TOTAL DO SERVIÇO - R$",{"$nulls":5},{"$f":"ROUND(H79*H80,2)","v":5537.48}]
[]
["F6","CODEVASF",null,null," COMPOSIÇÃO DE PREÇO UNITÁRIO",null,null,null,{"$f":"H90","v":387.6},{"$f":"H92","v":445.74}]
[null,"OBRA:  ","    PAVIMENTAÇÃO ASFÁLTICA EM CBUQ - VIAS URBANAS DIVERSAS - SEDE E COMUNIDADE RIO DAS PEDRAS (GLAUCILÂNDIA / MG)",null,null,null,"DATA: ",{"$f":"$H$2","v":"     ABRIL / 2025 "}]
[null,"SERVIÇO:  ","TRANSPORTE DE CONCRETO ASFÁLTICO DE PETRÓLEO - CAP 50/70",null,"Referência:","CPU.12","UNIDADE: ",{"$f":"VLOOKUP(A83,ORÇAMENTO!$A$11:$L$49,7)","v":"T"}]
[]
[null,"TIPO ITEM","CODIGO ITEM","DESCRIÇÃO ITEM","UNIDADE ITEM","COEFICIENTE","PRECO UNITARIO","CUSTO TOTAL"]
[null,"INSUMO"," - ","TRANSPORTE DE CIMENTO ASFÁLTICO DE PETRÓLEO TIPO CAP 50-70, INCLUINDO CUSTO TOTAL DO TRANSPORTE (COMBUSTÍVEL, PEDÁGIOS, ETC.) E ICMS - MEMÓRIA ANEXA","T",1,387.60690280065899,{"$f":"ROUNDDOWN(F88*G88,2)","v":387.6}]
[null,"PRODUÇÃO DA EQUIPE",null,null,1,"CUSTO ",null,{"$f":"SUM(H88:H88)","v":387.6}]
[null,"TOTAL",{"$nulls":5},{"$f":"H89/E89","v":387.6}]
[null,"BDI                %",{"$nulls":5},{"$f":"1+$M$2","v":1.1499999999999999}]
[null,"TOTAL DO SERVIÇO - R$",{"$nulls":5},{"$f":"ROUND(H90*H91,2)","v":445.74}]

{"sheet":"BDI SERV","index":3,"n_rows":60,"n_cols":5,"rows_kept":60,"cut":false,"hidden":false,"merged":[[35,0,35,5],[36,0,36,5],[38,1,38,4],[39,2,39,3],[0,1,2,4],[25,1,25,3],[26,1,26,2],[26,3,26,4],[27,3,27,4]]}
[null,"DETALHAMENTO DO BDI - SERVIÇOS"]
[]
[]
[null,"Item","Descrição dos Serviços","% - PV","% - CD"]
[]
[null,1,"ADMINISTRAÇÃO CENTRAL"," ",{"$f":"SUM(E7:E9)","v":4.01}]
[null,"1.1","ESCRITÓRIO CENTRAL",null,4.01]
[null,"1.2","VIAGENS"]
[null,"1.3","OUTROS"]
[null," "," "," "," "]
[null,2,"IMPOSTOS E TAXAS",{"$f":"SUM(D12:D15)","v":7.65},{"$f":"SUM(E12:E15)","v":0}]
[null,"2.1","ISS - Proposta",{"$f":"D34*100","v":4}]
[null,"2.2","PIS",0.65]
[null,"2.3","Cofins",3]
[null,"2.4","Contribuição Previdenciaria (CPRB)"]
[]
[null,3,"TAXA DE RISCO",null,{"$f":"SUM(E18:E20)","v":0.96}]
[null,"3.1","SEGURO",null,0.2]
[null,"3.2","RISCO",null,0.56000000000000005]
[null,"3.3","GARANTIA",null,0.2]
[]
[null,4,"DESPESAS FINANCEIRAS",null,1.1100000000000001]
[]
[null,5,"LUCRO",null,7.3]
[]
[null,"BDI APRESENTADO:",null,null,{"$f":"IF($D$41=$C$43,$D$43,IF($D$41=$C$44,$D$44,IF($D$41=$C$44,$D$44,IF($D$41=$C$45,$D$45,0))))","v":23.32}]
[]
[null,null,"Legislação Municipal:","Lei Municipal nº 01/2001"]
[null,null,"Município:","Glaucilândia"]
[null,null,"Alíquota ISSQN:",0.05,"Município"]
[null,null,"Base de Cálculo:","Dedução - Material","Art.41 §3º-a"]
[null,null,"Valor Serviço:",1238620.93]
[null,null,"Dedução - Material (estimado):",{"$f":"0.2*D32","v":247724.18599999999},{"$f":"D33/D32","v":0.2}]
[null,null,"ISSQN BDI:",{"$f":"IF(D32=\"\",0,ROUND(IF(D31=D49,((1-(D33/D32))*D30),D30*D31),4))","v":0.04},"(*)"]
[]
["Acórdão nº 2.622/2013 - TCU Plenário"]
["BDI = ARRED((((((1+(AC+TR)/100)*(1+DF/100)*(1+L/100))/(1-IMP/100))-1)*100);2)"]
[]
[null,"(*) É obrigação da licitante a verificação da Legislação Tributária vigente no município, bem como o cálculo dos valores totais de serviços e materiais estimados, para apresentação de sua proposta."]
[]
[null,null,"Forma de Cálculo do BDI:","BDI - Acórdão nº 2.622/2013 - TCU"]
[]
[null,null,"BDI - Digitado",{"$f":"ROUND(E6+E11+E17+E22+E24,2)","v":13.38}]
[null,null,"BDI - Calculado",{"$f":"ROUND((((1+(E6/100+E22/100+E17/100))/(1-(D11/100+E24/100)))-1)*100,2)","v":24.73}]
[null,null,"BDI - Acórdão nº 2.622/2013 - TCU",{"$f":"ROUND((((((1+(E6+E17)/100)*(1+E22/100)*(1+E24/100))/(1-D11/100))-1)*100),2)","v":23.32}]
[]
[]
[]
[null,null,null,"Dedução - Material","Município"]
[null,null,null,0.1,"Simples Nacional"]
[null,null,null,0.2,"Municípios Indefinidos"]
[null,null,null,0.3]
[null,null,null,0.4]
[null,null,null,0.5]
[null,null,null,0.6]
[null,null,null,0.7]
[null,null,null,0.8]
[null,null,null,0.9]
[null,null,null,1]
[null,null,null,{"$f":"E31","v":"Art.41 §3º-a"}]

{"sheet":"BDI FORN","index":4,"n_rows":37,"n_cols":5,"rows_kept":37,"cut":false,"hidden":false,"merged":[[31,1,31,2],[32,0,34,5],[36,0,36,5],[0,1,2,4],[3,1,4,1],[3,2,4,2],[28,0,28,5],[30,1,30,2]]}
[null,"DETALHAMENTO DO BDI - FORNECIMENTO \n(MATERIAL ASFÁLTICO)"]
[]
[]
[null,"Item","Descrição dos Serviços","%","%"]
[null,null,null,"PV","CD"]
[]
[null,1,"ADMINISTRAÇÃO CENTRAL"," ",3.45]
[null,"1.1","ESCRITÓRIO CENTRAL"," "," "]
[null,"1.2","VIAGENS"," "," "]
[null,"1.3","OUTROS"," "," "]
[null," "," "," "," "]
[null,2,"IMPOSTOS E TAXAS",{"$f":"SUM(D13:D16)","v":3.65},{"$f":"SUM(E13:E16)","v":4.5600000000000005}]
[null,"2.1","ISS (*)",null,{"$f":"ROUND(D13*1.2515,2)","v":0}]
[null,"2.2","PIS",0.65,{"$f":"ROUND(D14*1.2515,2)","v":0.81}]
[null,"2.3","Cofins",3,{"$f":"ROUND(D15*1.2515,2)","v":3.75}]
[null,"2.4","CONTRIBUIÇÃO PREVIDENCIÁRIA SOBRE A RENDA BRUTA",0,{"$f":"ROUND(D16*1.2515,2)","v":0}]
[]
[null,3,"TAXA DE RISCO"," ",{"$f":"SUM(E19:E22)","v":1.08}]
[null,"3.1","SEGURO",null,0.24]
[null,"3.2","RISCO",null,0.6]
[null,"3.3","GARANTIA",null,0.24]
[]
[null,4,"DESPESAS FINANCEIRAS"," ",0.85]
[]
[null,5,"LUCRO",null,5.1100000000000003]
[]
[null," ","BDI - CALCULADO"," ",{"$f":"ROUND((((1+(E7+E18)/100)*(1+E23/100)*(1+E25/100)/(1-D12/100)-1)*100),2)","v":15}]
[]
["BDI = ((1+((AC+S+R+G)/100))x(1+DF/100)x(1+L/100)/(1-I/100)-1)*100"]
[]
[null,"BDI (CALCULADO):",null,{"$f":"ROUND((((1+((E7+E18)/100))*(1+E23/100)*(1+E25/100))/(1-D12/100)-1)*100,2)","v":15},"%"]
[null," "]
[]
[]
[]
[]
["BDI EM CONFORMIDADE COM OS ACÓRDÃOS Nº 2369/2011 e ACÓRDÃO Nº 2.622/2013 - TCU - PLENÁRIO"]

{"sheet":"CRONOGRAMA","index":5,"n_rows":19,"n_cols":12,"rows_kept":19,"cut":false,"hidden":false,"merged":[[0,1,0,11],[1,1,2,1],[1,2,2,4],[1,6,1,11],[2,6,2,11],[9,0,10,0],[9,1,10,1],[9,2,10,2],[3,1,3,10],[5,0,6,0],[5,1,6,1],[5,2,6,2],[7,0,8,0],[7,1,8,1],[7,2,8,2],[15,1,16,2],[18,1,22,11],[11,0,12,0],[11,1,12,1],[11,2,12,2],[13,0,14,0],[13,1,14,1],[13,2,14,2]]}
[null,"CRONOGRAMA FÍSICO-FINANCEIRO"]
[null,"OBRA: ",{"$f":"ORÇAMENTO!C5","v":"    PAVIMENTAÇÃO ASFÁLTICA EM CBUQ - VIAS URBANAS DIVERSAS - SEDE E COMUNIDADE RIO DAS PEDRAS (GLAUCILÂNDIA / MG)"},null,null,"VALOR:",{"$f":"ORÇAMENTO!L42","v":1999753.71}]
[{"$nulls":5},"PRAZO: ","180 DIAS "]
[]
[null,"ITEM","ETAPAS/DESCRIÇAO","FISICO/  FINANCEIRO","TOTAL    ETAPAS","MÊS 1","MÊS 2","MÊS 3","MÊS 4","MÊS 5","MÊS 6","TOTAL"]
["A",{"$f":"VLOOKUP(A6,ORÇAMENTO!$A$10:$L$42,2)","v":1},{"$f":"VLOOKUP(A6,ORÇAMENTO!$A$10:$L$42,5)","v":"SERVIÇOS PRELIMINARES "},"FISICO ",{"$f":"ROUND(E7/$G$2,4)","v":0.10199999999999999},0.25,0.15,0.15,0.15,0.15,0.15,{"$f":"SUM(F6:K6)","v":1}]
[null,null,null,"FINANCEIRO",{"$f":"ORÇAMENTO!L10","v":203988.03},{"$f":"ROUND($E$7*F6,2)","v":50997.01},{"$f":"ROUND($E$7*G6,2)","v":30598.2},{"$f":"ROUND($E$7*H6,2)","v":30598.2},{"$f":"ROUND($E$7*I6,2)","v":30598.2},30598.2,30598.2,{"$f":"SUM(F7:K7)","v":203988.01000000004}]
["B",{"$f":"VLOOKUP(A8,ORÇAMENTO!$A$10:$L$42,2)","v":2},{"$f":"VLOOKUP(A8,ORÇAMENTO!$A$10:$L$42,5)","v":"TERRAPLANAGEM E PAVIMENTAÇÃO"},"FISICO ",{"$f":"ROUND(E9/$G$2,4)","v":0.34260000000000002},0.1,0.2,0.2,0.2,0.2,0.1,{"$f":"SUM(F8:K8)","v":0.99999999999999989}]
[null,null,null,"FINANCEIRO",{"$f":"ORÇAMENTO!L16","v":685124.17999999993},{"$f":"ROUND($E$9*F8,2)","v":68512.42},{"$f":"ROUND($E$9*G8,2)","v":137024.84},{"$f":"ROUND($E$9*H8,2)","v":137024.84},{"$f":"ROUND($E$9*I8,2)","v":137024.84},137024.84,68512.42,{"$f":"SUM(F9:K9)","v":685124.2}]
["C",{"$f":"VLOOKUP(A10,ORÇAMENTO!$A$10:$L$42,2)","v":3},{"$f":"VLOOKUP(A10,ORÇAMENTO!$A$10:$L$42,5)","v":"TRANSPORTE DE MATERIAIS"},"FISICO ",{"$f":"ROUND(E11/$G$2,4)","v":0.1067},0.25,0.5,0.25,null,null,null,{"$f":"SUM(F10:K10)","v":1}]
[null,null,null,"FINANCEIRO",{"$f":"ORÇAMENTO!L23","v":213308},{"$f":"ROUND($E$11*F10,2)","v":53327},{"$f":"ROUND($E$11*G10,2)","v":106654},{"$f":"ROUND($E$11*H10,2)","v":53327},{"$f":"ROUND($E$11*I10,2)","v":0},0,0,{"$f":"SUM(F11:K11)-0.04","v":213307.96}]
["E",{"$f":"VLOOKUP(A12,ORÇAMENTO!$A$10:$L$42,2)","v":4},{"$f":"VLOOKUP(A12,ORÇAMENTO!$A$10:$L$42,5)","v":"DRENAGEM E OBRAS COMPLEMENTARES"},"FISICO ",{"$f":"ROUND(E13/$G$2,4)","v":0.21160000000000001},0.1,0.2,0.2,0.2,0.2,0.1,{"$f":"SUM(F12:K12)","v":0.99999999999999989}]
[null,null,null,"FINANCEIRO",{"$f":"ORÇAMENTO!L29","v":423105.85},{"$f":"ROUND($E$13*F12,2)","v":42310.59},{"$f":"ROUND($E$13*G12,2)","v":84621.17},{"$f":"ROUND($E$13*H12,2)","v":84621.17},{"$f":"ROUND($E$13*I12,2)","v":84621.17},84621.17,42310.59,{"$f":"SUM(F13:K13)-0.02","v":423105.83999999997}]
["F",{"$f":"VLOOKUP(A14,ORÇAMENTO!$A$10:$L$42,2)","v":5},{"$f":"VLOOKUP(A14,ORÇAMENTO!$A$10:$L$42,5)","v":"FORNECIMENTOS - MATERIAL ASFÁLTICO (BDI DIFERENCIADO)"},"FISICO ",{"$f":"ROUND(E15/$G$2,4)","v":0.23710000000000001},null,0.2,0.2,0.2,0.2,0.2,{"$f":"SUM(F14:K14)","v":1}]
[null,null,null,"FINANCEIRO",{"$f":"ORÇAMENTO!L35","v":474227.65},{"$f":"ROUND($E$15*F14,2)","v":0},94845.53,94845.53,94845.53,94845.53,94845.53,{"$f":"SUM(F15:K15)-0.02","v":474227.63}]
[null,"TOTAL",null,"FISICO ",{"$f":"SUM(F16:K16)","v":1.0000000050006157},{"$f":"F17/$E$17","v":0.1075867587714089},{"$f":"G17/$E$17","v":0.22689981157729666},{"$f":"H17/$E$17","v":0.20023302769619564},{"$f":"I17/$E$17","v":0.17356624381509461},0.17356624381509461,0.11814791932552533,{"$f":"SUM(F16:K16)","v":1.0000000050006157}]
[null,null,null,"FINANCEIRO",{"$f":"E11+E9+E7+E15+E13","v":1999753.71},{"$f":"F11+F9+F7+F15+F13","v":215147.02},{"$f":"G11+G9+G7+G15+G13","v":453743.73999999993},400416.74,347089.74,347089.74,236266.74,{"$f":"SUM(F17:K17)-0.01","v":1999753.71}]
[]
[null,"OBSERVAÇÕES:"]

{"sheet":"EAI","index":6,"n_rows":90,"n_cols":34,"rows_kept":90,"cut":false,"hidden":false,"merged":[[12,3,24,3],[1,2,3,26],[5,2,7,2],[5,12,7,12],[6,6,7,6],[6,19,6,20],[10,4,10,8],[10,9,10,10],[10,22,10,23],[5,6,5,7],[5,8,5,9],[6,21,6,24],[7,21,7,24]]}
[]
[null,null,"MEMÓRIA DE CÁLCULO"]
[]
[]
[]
[{"$nulls":6},"TIPOLOGIA DO MATERIAL",null,"Emulsão Asfáltica para Serviço de Imprimação",null,null,null,"IMPOSTOS","COFINS",6.4999999999999997E-3,6.4999999999999997E-3]
[{"$nulls":6},"ÍNDICE DE PAVIMENTAÇÃO DNIT","2014-07-01","ÍNDICE INICIAL",270.23700000000002,null,null,null,"PIS",0.03,0.03,null,null,null,"LEGENDA",{"$nulls":8},"As empresas tributadas pelo Lucro Presumido pagam 0,65% de PIS e 3% de COFINS"]
[{"$nulls":7},{"$f":"H9","v":"2025-02-01"},"ÍNDICE FINAL",587.95899999999995,null,null,null," ICMS",0.18,0.18,{"$f":"1-(O8/1)","v":0.82000000000000006},{"$f":"1-(P8/1)","v":0.82000000000000006},{"$f":"1-(Q8/1)","v":0.17999999999999994},"ENTRADA DE DADOS",null,"QUANT.ESTIMADA DE EMULSÃO ASFÁLTICA PARA IMPRIMAÇÃO (TON.):",null,null,null,{"$f":"ORÇAMENTO!H36","v":17.5},"TONELADAS",null,"As empresas tributadas pelo Lucro Real pagam 1,65% de PIS e 7,60% de COFINS"]
[{"$nulls":6},"Data ANP","2025-02-01"]
[]
[null,null,"DATA-BASE","PRODUTOS","LOCALIDADES",{"$nulls":4},"CUSTO ANP (R$/Kg)",null,"CUSTO ANP","IMPOSTOS DO PRODUTO","CUSTO DO PRODUTO COM IMPOSTOS","DMT's","DMT's FLUVIAL","CUSTO DO TRANSPORTE RODOVIA PAVIMENTADA","CUSTO DO TRANSPORTE FLUVIAL","CUSTO DO TRANSPORTE TOTAL","ICMS","ATUALIZAÇÃO DO CUSTO DE TRANSPORTE","CUSTO DO TRANSPORTE RODOVIA PAVIMENTADA COM IMPOSTOS E ATUALIZAÇÃO MONETÁRIA","PEDÁGIO ",null,"TOTAL TRANSPORTE","AQUISIÇÃO DO PRODUTO","TOTAL GERAL ( TRANSP + AQUISIÇÃO)",null,1,2,3]
[null,null,{"$f":"H8","v":"2025-02-01"},null,"REFINARIAS","ENDEREÇO","ESTADO","CIDADE","DESTINO","ESTADO","REGIÃO","R$/t","R$/t","R$/t","KM","KM","R$/t","R$/t","R$/t","R$/t","R$/t","R$/t","CUSTO ","R$/t","R$/t","R$/t","R$/t",null,"TOTAL GERAL ( TRANSP + AQUISIÇÃO)","TOTAL TRANSPORTE","AQUISIÇÃO DO PRODUTO"]
[null,{"$f":"AA13","v":4654.7560807435548},1,{"$f":"I6","v":"Emulsão Asfáltica para Serviço de Imprimação"},"Refinaria Abreu e Lima","Rodovia PE 60, Km 10 - Ipojuca - PE CEP:55590-000","Pernambuco","IPOJUCA - PE","Montes Claros - MG","-",2.7104017950292691,{"$f":"IF(AND(J13=\"-\",K13=\"-\"),\"\",IF(AND(J13<>0,K13=\"-\"),J13*1000,IF(AND(J13=\"-\",K13<>0),K13*1000,IF(AND(J13<>0,K13<>0),J13*1000,\"\"))))","v":2710.4017950292691},{"$f":"ROUND(((L13/(1-$O$6-$O$7-$O$8))-L13),2)","v":748.95},{"$f":"L13+M13","v":3459.3517950292689},1631,null,{"$f":"ROUND((26.939+0.253*O13),2)","v":439.58},null,{"$f":"Q13+R13","v":439.58},{"$f":"TRUNC(S13*($O$8/(1-$O$8)),2)","v":96.49},{"$f":"TRUNC(IF($J$7=\"\",\"\",(($J$8-$J$7)/$J$7)*(S13+T13)),2)","v":630.26},{"$f":"S13+T13+U13","v":1166.33},254.4,{"$f":"EVEN($Z$8*2/28)*W13/$Z$8","v":29.074285714285715},{"$f":"IF(AND(S13=\"\",T13=\"\"),\"\",V13+X13)","v":1195.4042857142856},{"$f":"IF(OR(L13=\"\",M13=\"\"),\"\",L13+M13)","v":3459.3517950292689},{"$f":"IF(OR(Y13=\"\",Z13=\"\"),\"\",Y13+Z13)","v":4654.7560807435548},null,{"$f":"AA13","v":4654.7560807435548},{"$f":"Y13","v":1195.4042857142856},{"$f":"Z13","v":3459.3517950292689},null,null,{"$f":"IF(OR(G13=$D$50,G13=$D$51,G13=$D$53,G13=$D$59,G13=$D$43,G13=$D$39,G13=$D$35,G13=$D$48,G13=$D$38),\"NORDESTE\",IF(OR(G13=$D$34,G13=$D$36,G13=$D$37,G13=$D$47,G13=$D$55,G13=$D$56,G13=$D$60),\"NORTE\",IF(OR(G13=$D$40,G13=$D$42,G13=$D$44,G13=$D$45),\"CENTRO-OESTE\",IF(OR(G13=$D$58,G13=$D$52,G13=$D$46,G13=$D$41),\"SUDESTE\",IF(OR(G13=$D$57,G13=$D$49,G13=$D$54),\"SUL\",\"\")))))","v":"NORDESTE"}]
[null,{"$f":"AA14","v":4842.6260807435547},2,null,"Refinaria Potiguar Clara Camarão","Rodovia RN 221, KM 25 - Guamaré - RN CEP:59598-000","Rio Grande do Norte","GUAMARÉ - RN",{"$f":"I13","v":"Montes Claros - MG"},"-",2.7104017950292691,{"$f":"IF(AND(J14=\"-\",K14=\"\"),\"\",IF(AND(J14<>0,K14=\"\"),J14*1000,IF(AND(J14=\"-\",K14<>0),K14*1000,IF(AND(J14<>0,K14<>0),J14*1000,\"\"))))","v":2710.4017950292691},{"$f":"ROUND(((L14/(1-$O$6-$O$7-$O$8))-L14),2)","v":748.95},{"$f":"L14+M14","v":3459.3517950292689},1923,null,{"$f":"ROUND((26.939+0.253*O14),2)","v":513.46},null,{"$f":"Q14+R14","v":513.46},{"$f":"TRUNC(S14*($O$8/(1-$O$8)),2)","v":112.71},{"$f":"TRUNC(IF($J$7=\"\",\"\",(($J$8-$J$7)/$J$7)*(S14+T14)),2)","v":736.19},{"$f":"S14+T14+U14","v":1362.3600000000001},183,{"$f":"EVEN($Z$8*2/28)*W14/$Z$8","v":20.914285714285715},{"$f":"IF(AND(S14=\"\",T14=\"\"),\"\",V14+X14)","v":1383.274285714286},3459.3517950292689,{"$f":"IF(OR(Y14=\"\",Z14=\"\"),\"\",Y14+Z14)","v":4842.6260807435547},null,{"$f":"AA14","v":4842.6260807435547},{"$f":"Y14","v":1383.274285714286},3459.3517950292689,null,null,"NORDESTE"]
[null,4192.5060807435548,3,null,"Refinaria Landulpho Alves (RLAM)","Rodovia BA 523, KM 4 – Mataripe São Francisco do Conde - BA CEP:43900-000","Bahia","SÃO FRANCISCO DO CONDE - BA",{"$f":"I14","v":"Montes Claros - MG"},"-",2.7104017950292691,2710.4017950292691,{"$f":"ROUND(((L15/(1-$O$6-$O$7-$O$8))-L15),2)","v":748.95},3459.3517950292689,951,null,{"$f":"ROUND((26.939+0.253*O15),2)","v":267.54000000000002},null,267.54000000000002,58.72,383.58,709.83999999999992,204,23.314285714285713,733.15428571428561,3459.3517950292689,4192.5060807435548,null,4192.5060807435548,733.15428571428561,3459.3517950292689,null,null,"NORDESTE"]
[2403,4604.1619383702018,4,null,"Refinaria Lubrificantes e Derivados do Nordeste (Lubnor)","Av. Leite Barbosa, s/nº - Mucuripe Fortaleza - Ceará CEP:60180-420","Ceará","FORTALEZA - CE","Montes Claros - MG",2.501487652655916,2.7104017950292691,{"$f":"IF(AND(J16=\"-\",K16=\"\"),\"\",IF(AND(J16<>0,K16=\"\"),J16*1000,IF(AND(J16=\"-\",K16<>0),K16*1000,IF(AND(J16<>0,K16<>0),J16*1000,\"\"))))","v":2501.487652655916},{"$f":"ROUND(((L16/(1-$O$6-$O$7-$O$8))-L16),2)","v":691.22},3192.7076526559158,1965,null,524.08000000000004,null,524.08000000000004,115.04,751.42,1390.54,183,20.914285714285715,1411.4542857142858,3192.7076526559158,4604.1619383702018,null,4604.1619383702018,1411.4542857142858,3192.7076526559158,null,null,"NORDESTE"]
[null,4280.7716317333225,5,null,"Refinaria Capuava (Recap)","Av. Alberto Soares Sampaio, 2122-A Capuava – Mauá - SP","São Paulo","MAUÁ - SP","Montes Claros - MG",2.7293387745904658,2.7609338335366278,2729.3387745904656,{"$f":"ROUND(((L17/(1-$O$6-$O$7-$O$8))-L17),2)","v":754.18},3483.5187745904655,1002,null,280.45,null,280.45,61.56,402.1,744.11,465,53.142857142857146,797.25285714285712,3483.5187745904655,4280.7716317333225,null,4280.7716317333225,797.25285714285712,3483.5187745904655,null,null,"SUDESTE"]
[null,4230.486690679485,6,null,"Refinaria Duque de Caxias (Reduc)","Rodovia Washington Luiz, km 113,7 Campos Elíseos – Duque de Caxias - RJ CEP:25213-005","Rio de Janeiro","DUQUE DE CAXIAS - RJ","Montes Claros - MG","-",2.7609338335366278,2760.9338335366278,762.91,3523.8438335366277,827,null,236.17,null,236.17,51.84,338.61,626.62,700.2,80.022857142857148,706.64285714285711,3523.8438335366277,4230.486690679485,null,4230.486690679485,706.64285714285711,3523.8438335366277,null,null,"SUDESTE"]
[null,5285.328507608323,7,null,"Refinaria Alberto Pasqualini (Refap)","Avenida Getúlio Vargas, 11001 - Bairro Brigadeira Canoas - RS - Brasil CEP:92420-221","Rio Grande do Sul","CANOAS - RS","Montes Claros - MG",2.868824221894037,2.8544355674732254,2868.8242218940368,792.73,3661.5542218940368,2134,null,566.84,null,566.84,124.42,812.72,1503.98,1048.2,119.79428571428572,1623.7742857142857,3661.5542218940368,5285.328507608323,null,5285.328507608323,1623.7742857142857,3661.5542218940368,null,null,"SUL"]
[null,4806.2534594562367,8,null,"Unidade de Industrialização do Xisto (SIX)","Rodovia do Xisto, BR 476, km 153 São Mateus do Sul – PR CEP 83900-000","Paraná","SÃO MATEUS DO SUL - PR","Montes Claros - MG",2.8435920308848077,2.8544355674732254,2843.5920308848076,785.75,3629.3420308848076,1539,null,416.31,null,416.31,91.38,596.89,1104.58,632.9,72.331428571428575,1176.9114285714286,3629.3420308848076,4806.2534594562367,null,4806.2534594562367,1176.9114285714286,3629.3420308848076,null,null,"SUL"]
[null,3930.1413453024093,9,null,"Refinaria Gabriel Passos (Regap)","Av. Refinaria Gabriel Passos, 690 Distrito Industrial Paulo Camilo Sul Betim - MG CEP:32669-205","Minas Gerais","BETIM - MG","Montes Claros - MG",2.7674270595881234,2.7609338335366278,2767.4270595881235,764.71,3532.1370595881235,431,null,135.97999999999999,null,135.97999999999999,29.84,194.95,360.77,325.8,37.234285714285718,398.00428571428569,3532.1370595881235,{"$f":"IF(OR(Y21=\"\",Z21=\"\"),\"\",Y21+Z21)","v":3930.1413453024093},null,3930.1413453024093,398.00428571428569,3532.1370595881235,null,null,"SUDESTE"]
[null,4752.2848880276651,10,null,"Refinaria Presidente Getúlio Vargas (Repar)","Rodovia do Xisto, BR 476, km 16 Araucária - PR CEP:83707-440","Paraná","ARAUCÁRIA - PR","Montes Claros - MG",2.8435920308848077,2.8544355674732254,2843.5920308848076,785.75,3629.3420308848076,1440,null,391.26,null,391.26,85.88,560.98,1038.1199999999999,742.2,84.822857142857146,1122.9428571428571,3629.3420308848076,4752.2848880276651,null,4752.2848880276651,1122.9428571428571,3629.3420308848076,null,null,"SUL"]
[null,4306.921631733323,11,null,"Refinaria Presidente Bernardes (RPBC)","Av. 9 de abril, 777 - Jardim das Indústrias Cubatão - SP CEP:11505-000","São Paulo","CUBATÃO - SP","Montes Claros - MG",2.7293387745904658,2.7609338335366278,2729.3387745904656,754.18,3483.5187745904655,1041,null,290.31,null,290.31,63.72,416.23,770.26,465,53.142857142857146,823.4028571428571,3483.5187745904655,4306.921631733323,null,4306.921631733323,823.4028571428571,3483.5187745904655,null,null,"SUDESTE"]
[null,4294.9644888761795,12,null,"Refinaria de Paulínia (Replan)","Rodovia SP 332 - Km. 130 Bonfim - Paulínia – SP CEP:13140-000","São Paulo","PAULÍNIA - SP","Montes Claros - MG",2.7293387745904658,2.7609338335366278,2729.3387745904656,754.18,3483.5187745904655,1021,null,285.25,null,285.25,62.61,408.98,756.84,477.8,54.605714285714285,811.4457142857143,3483.5187745904655,4294.9644888761795,null,4294.9644888761795,811.4457142857143,3483.5187745904655,null,null,"SUDESTE"]
[null,4254.5230603047512,13,null,"Refinaria Henrique Lage (Revap)","Rodovia Presidente Dutra, KM 143, S/N Bairro Jardim Diamante - São José dos Campos – SP CEP:12223-900","São Paulo","SÃO JOSÉ DOS CAMPOS - SP","Montes Claros - MG",2.7293387745904658,2.7609338335366278,2729.3387745904656,754.18,3483.5187745904655,953,null,268.05,null,268.05,58.84,384.32,711.21,523.20000000000005,59.794285714285721,771.00428571428574,3483.5187745904655,4254.5230603047512,null,4254.5230603047512,771.00428571428574,3483.5187745904655,null,null,"SUDESTE"]
{"$rows_empty":8}
[null,null,null,"Acre"]
[null,null,null,"Alagoas"]
[null,null,null,"Amapá"]
[null,null,null,"Amazonas"]
[null,null,null,"Bahia"]
[null,null,null,"Ceará"]
[null,null,null,"Distrito Federal"]
[null,null,null,"Espírito Santo"]
[null,null,null,"Goiás"]
[null,null,null,"Maranhão"]
[null,null,null,"Mato Grosso"]
[null,null,null,"Mato Grosso do Sul"]
[null,null,null,"Minas Gerais"]
[null,null,null,"Pará"]
[null,null,null,"Paraíba"]
[null,null,null,"Paraná"]
[null,null,null,"Pernambuco"]
[null,null,null,"Piauí"]
[null,null,null,"Rio de Janeiro"]
[null,null,null,"Rio Grande do Norte"]
[null,null,null,"Rio Grande do Sul"]
[null,null,null,"Rondônia"]
[null,null,null,"Roraima"]
[null,null,null,"Santa Catarina"]
[null,null,null,"São Paulo"]
[null,null,null,"Sergipe"]
[null,null,null,"Tocantins"]
[]
[]
[]
[null,null,null,"ASFALTOS DILUÍDOS CM-30"]
[null,null,null,"ASFALTOS DILUÍDOS CM-70"]
[null,null,null,"ASFALTOS DILUÍDOS CR-250"]
[null,null,null,"ASFALTOS DILUÍDOS CR-70"]
[null,null,null,"CAP MODIFICADO POR BORRACHA DE PNEU AB22"]
[null,null,null,"CAP MODIFICADO POR BORRACHA DE PNEU AB8"]
[null,null,null,"CAP MODIFICADO POR POLÍMERO 55-75-E"]
[null,null,null,"CAP MODIFICADO POR POLÍMERO 60-85-E"]
[null,null,null,"CAP MODIFICADO POR POLÍMERO 65-90-E"]
[null,null,null,"CIMENTOS ASFÁLTICOS CAP-150-200"]
[null,null,null,"CIMENTOS ASFÁLTICOS CAP-30-45"]
[null,null,null,"CIMENTOS ASFÁLTICOS CAP-50-70"]
[null,null,null,"CIMENTOS ASFÁLTICOS CAP-85-100"]
[null,null,null,"EMULSÃO ASFÁLTICA CATIÔNICA DE RUPTURA CONTROLADA PARA SERVIÇO DE LAMA ASFÁLTICA"]
[null,null,null,"EMULSÃO ASFÁLTICA DE RUPTURA LENTA CATIÔNICA PARA SERVIÇO DE LAMA ASFÁLTICA"]
[null,null,null,"EMULSÃO ASFÁLTICA DE RUPTURA LENTA DE CARGA NEUTRA PARA SERVIÇO DE LAMA ASFÁLTICA"]
[null,null,null,"EMULSÃO ASFÁLTICA PARA SERVIÇO DE IMPRIMAÇÃO"]
[null,null,null,"EMULSÕES ASF. MOD. POR POLÍMEROS RC1C-E"]
[null,null,null,"EMULSÕES ASF. MOD. POR POLÍMEROS RL1C-E"]
[null,null,null,"EMULSÕES ASF. MOD. POR POLÍMEROS RM1C-E"]
[null,null,null,"EMULSÕES ASF. MOD. POR POLÍMEROS RR1C-E"]
[null,null,null,"EMULSÕES ASF. MOD. POR POLÍMEROS RR2C-E"]
[null,null,null,"EMULSÕES ASFÁLTICAS RL-1C"]
[null,null,null,"EMULSÕES ASFÁLTICAS RM-1C"]
[null,null,null,"EMULSÕES ASFÁLTICAS RM-2C"]
[null,null,null,"EMULSÕES ASFÁLTICAS RR-1C"]
[null,null,null,"EMULSÕES ASFÁLTICAS RR-2C"]

{"sheet":"RR-1C","index":7,"n_rows":92,"n_cols":34,"rows_kept":92,"cut":false,"hidden":false,"merged":[[12,3,26,3],[6,19,6,20],[6,6,7,6],[5,12,7,12],[5,6,5,7],[5,8,5,9],[1,2,3,26],[5,2,7,2],[10,4,10,8],[10,9,10,10],[10,22,10,23],[6,21,6,24],[7,21,7,24]]}
[]
[null,null,"MEMÓRIA DE CÁLCULO"]
[]
[]
[]
[{"$nulls":6},"TIPOLOGIA DO MATERIAL",null,"EMULSÕES ASFÁLTICAS RR-1C",null,null,null,"IMPOSTOS","COFINS",6.4999999999999997E-3,6.4999999999999997E-3]
[{"$nulls":6},"ÍNDICE DE PAVIMENTAÇÃO DNIT","2014-07-01","ÍNDICE INICIAL",270.23700000000002,null,null,null,"PIS",0.03,0.03,null,null,null,"LEGENDA",{"$nulls":8},"As empresas tributadas pelo Lucro Presumido pagam 0,65% de PIS e 3% de COFINS"]
[{"$nulls":7},"2023-10-01","ÍNDICE FINAL",{"$f":"EAI!J8","v":587.95899999999995},null,null,null," ICMS",0.18,0.18,{"$f":"1-(O8/1)","v":0.82000000000000006},{"$f":"1-(P8/1)","v":0.82000000000000006},{"$f":"1-(Q8/1)","v":0.17999999999999994},"ENTRADA DE DADOS",null,"QUANT.ESTIMADA DE RR-1C (TON.):",null,null,null,{"$f":"ORÇAMENTO!H38","v":5.2950000000000017},"TONELADAS",null,"As empresas tributadas pelo Lucro Real pagam 1,65% de PIS e 7,60% de COFINS"]
[{"$nulls":6},"Data ANP",{"$f":"EAI!H9","v":"2025-02-01"}]
[]
[null,null,"DATA-BASE","PRODUTOS","LOCALIDADES",{"$nulls":4},"CUSTO ANP (R$/Kg)",null,"CUSTO ANP","IMPOSTOS DO PRODUTO","CUSTO DO PRODUTO COM IMPOSTOS","DMT's","DMT'S FLUVIAL","CUSTO DO TRANSPORTE RODOVIA PAVIMENTADA","CUSTO DO TRANSPORTE FLUVIAL","CUSTO DO TRANSPORTE TOTAL","ICMS","ATUALIZAÇÃO DO CUSTO DE TRANSPORTE","CUSTO DO TRANSPORTE RODOVIA PAVIMENTADA COM IMPOSTOS E ATUALIZAÇÃO MONETÁRIA","PEDÁGIO ",null,"TOTAL TRANSPORTE","AQUISIÇÃO DO PRODUTO","TOTAL GERAL ( TRANSP + AQUISIÇÃO)",null,1,2,3]
[null,null,{"$f":"H8","v":"2023-10-01"},null,"REFINARIAS","ENDEREÇO","ESTADO","CIDADE","DESTINO","ESTADO","REGIÃO","R$/t","R$/t","R$/t","KM","KM","R$/t","R$/t","R$/t","R$/t","R$/t","R$/t","CUSTO ","R$/t","R$/t","R$/t","R$/t",null,"TOTAL GERAL ( TRANSP + AQUISIÇÃO)","TOTAL TRANSPORTE","AQUISIÇÃO DO PRODUTO"]
[null,{"$f":"AA13","v":4514.9062548672709},1,{"$f":"I6","v":"EMULSÕES ASFÁLTICAS RR-1C"},"'CENTRO OESTE ASFALTOS LTDA.","SETOR DE INFLAMÁVEIS, S/N TRECHO 02 - LOTE 1.100 - GUARÁ - CEP:71225-000","Distrito Federal","BRASÍLIA - DF",{"$f":"EAI!I13","v":"Montes Claros - MG"},"-",3.0695857732808691,{"$f":"IF(AND(J13=\"-\",K13=\"-\"),\"\",IF(AND(J13<>0,K13=\"-\"),J13*1000,IF(AND(J13=\"-\",K13<>0),K13*1000,IF(AND(J13<>0,K13<>0),J13*1000,\"\"))))","v":3069.585773280869},{"$f":"ROUND(((L13/(1-$O$6-$O$7-$O$8))-L13),2)","v":848.2},{"$f":"L13+M13","v":3917.7857732808689},698,null,{"$f":"ROUND((26.939+0.253*O13),2)","v":203.53},null,{"$f":"Q13+R13","v":203.53},{"$f":"TRUNC(S13*($O$8/(1-$O$8)),2)","v":44.67},{"$f":"TRUNC(IF($J$7=\"\",\"\",(($J$8-$J$7)/$J$7)*(S13+T13)),2)","v":291.81},{"$f":"S13+T13+U13","v":540.01},151.19999999999999,{"$f":"EVEN($Z$8*2/28)*W13/$Z$8","v":57.110481586402244},{"$f":"IF(AND(Q13=\"\",T13=\"\"),\"\",V13+X13)","v":597.12048158640221},{"$f":"IF(OR(L13=\"\",M13=\"\"),\"\",L13+M13)","v":3917.7857732808689},{"$f":"IF(OR(Y13=\"\",Z13=\"\"),\"\",Y13+Z13)","v":4514.9062548672709},null,{"$f":"AA13","v":4514.9062548672709},{"$f":"Y13","v":597.12048158640221},{"$f":"Z13","v":3917.7857732808689},null,null,{"$f":"IF(OR(G13=$D$52,G13=$D$53,G13=$D$55,G13=$D$61,G13=$D$45,G13=$D$41,G13=$D$37,G13=$D$50,G13=$D$40),\"NORDESTE\",IF(OR(G13=$D$36,G13=$D$38,G13=$D$39,G13=$D$49,G13=$D$57,G13=$D$58,G13=$D$62),\"NORTE\",IF(OR(G13=$D$42,G13=$D$44,G13=$D$46,G13=$D$47),\"CENTRO-OESTE\",IF(OR(G13=$D$60,G13=$D$54,G13=$D$48,G13=$D$43),\"SUDESTE\",IF(OR(G13=$D$59,G13=$D$51,G13=$D$56),\"SUL\",\"\")))))","v":"CENTRO-OESTE"}]
[null,{"$f":"AA14","v":4435.9229155452331},2,null,"STRATURA ASFALTOS S/A","AVENIDA PRESIDENTE WILSON, 08  - JUNDIAÍ - CEP:75115-100","Goiás","ANÁPOLIS - GO",{"$f":"I13","v":"Montes Claros - MG"},2.9430018957152044,3.0695857732808691,{"$f":"IF(AND(J14=\"-\",K14=\"-\"),\"\",IF(AND(J14<>0,K14=\"-\"),J14*1000,IF(AND(J14=\"-\",K14<>0),K14*1000,IF(AND(J14<>0,K14<>0),J14*1000,\"\"))))","v":2943.0018957152042},{"$f":"ROUND(((L14/(1-$O$6-$O$7-$O$8))-L14),2)","v":813.22},{"$f":"L14+M14","v":3756.2218957152045},796,null,{"$f":"ROUND((26.939+0.253*O14),2)","v":228.33},null,{"$f":"Q14+R14","v":228.33},{"$f":"TRUNC(S14*($O$8/(1-$O$8)),2)","v":50.12},{"$f":"TRUNC(IF($J$7=\"\",\"\",(($J$8-$J$7)/$J$7)*(S14+T14)),2)","v":327.37},{"$f":"S14+T14+U14","v":605.81999999999994},195.6,{"$f":"EVEN($Z$8*2/28)*W14/$Z$8","v":73.881019830028308},679.70101983002826,3756.2218957152045,{"$f":"IF(OR(Y14=\"\",Z14=\"\"),\"\",Y14+Z14)","v":4435.9229155452331},null,{"$f":"AA14","v":4435.9229155452331},{"$f":"Y14","v":679.70101983002826},3756.2218957152045,null,null,"CENTRO-OESTE"]
[null,4455.4615841004734,3,null,"DISTRIBUIDORA BRASILEIRA DE ASFALTO SA - DISBRAL","VIA PRIMARIA 8, S/N QD-18, MODS. 24/47 - DAIAG - CEP:74980-970","Goiás","APARECIDA DE GOIANIA - GO",{"$f":"I14","v":"Montes Claros - MG"},2.9430018957152044,3.0695857732808691,2943.0018957152042,813.22,3756.2218957152045,843,null,240.22,null,240.22,52.73,344.42,637.37,163.80000000000001,61.869688385269107,699.23968838526912,3756.2218957152045,4455.4615841004734,null,4455.4615841004734,699.23968838526912,3756.2218957152045,null,null,"CENTRO-OESTE"]
[2403,4484.9915841004731,4,null,"INDÚSTRIA NACIONAL DE ASFALTOS LTDA.","VIA PRIMEIRA E SEGUNDA 3, S/N.º LOTES 01 A 10 - DISTRITO AGROINDUSTRIAL - CEP:75370-000","Goiás","GOIANIRA - GO","Montes Claros - MG",2.9430018957152044,3.0695857732808691,2943.0018957152042,813.22,3756.2218957152045,887,null,251.35,null,251.35,55.17,360.38,666.9,163.80000000000001,61.869688385269107,728.76968838526909,3756.2218957152045,4484.9915841004731,null,4484.9915841004731,728.76968838526909,3756.2218957152045,null,null,"CENTRO-OESTE"]
[null,4034.7363522916012,5,null,"STRATURA ASFALTOS S/A","RUA VICTOR RODRIGUES RESENDE, 333  - DISTRITO IND. DE UBERLÂNDIA - CEP:38405-440","Minas Gerais","UBERLANDIA - MG","Montes Claros - MG",2.7272026129148301,2.7300013717296618,2727.2026129148303,753.59,3480.7926129148304,633,null,187.09,null,187.09,41.06,268.23,496.38,152.4,57.563739376770521,553.94373937677051,3480.7926129148304,4034.7363522916012,null,4034.7363522916012,553.94373937677051,3480.7926129148304,null,null,"SUDESTE"]
[null,5931.8500793570738,6,null,"ARAPETRO DISTRIBUIDORA DE PETRÓLEO LTDA.","RUA 04, S/N° LOTES 17 A 20. - DISTRITO INDUSTRIAL 1/8 - CEP:78600-000","Mato Grosso","BARRA DO GARCAS - MT",{"$f":"I17","v":"Montes Claros - MG"},3.9004890595270454,3.0695857732808691,{"$f":"IF(AND(J18=\"-\",K18=\"-\"),\"\",IF(AND(J18<>0,K18=\"-\"),J18*1000,IF(AND(J18=\"-\",K18<>0),K18*1000,IF(AND(J18<>0,K18<>0),J18*1000,\"\"))))","v":3900.4890595270454},{"$f":"ROUND(((L18/(1-$O$6-$O$7-$O$8))-L18),2)","v":1077.8},4978.2890595270455,1204,null,331.55,null,331.55,72.77,475.36,879.68000000000006,195.6,73.881019830028308,953.56101983002839,4978.2890595270455,5931.8500793570738,{"$nulls":6},"CENTRO-OESTE"]
[null,3970.0221029998161,7,null,"DISTRIBUIDORA BRASILEIRA DE ASFALTO SA - DISBRAL","SÃO JUDAS TADEU, 288  - DISTRITO INDUSTRIAL - CEP:32450-000","Minas Gerais","SARZEDO - MG","Montes Claros - MG",2.7272026129148301,2.7300013717296618,2727.2026129148303,753.59,3480.7926129148304,439,null,138.01,null,138.01,30.29,197.87,366.16999999999996,325.8,123.0594900849858,489.22949008498574,3480.7926129148304,3970.0221029998161,{"$nulls":6},"SUDESTE"]
[null,4676.3276632191337,8,null,"'INDÚSTRIA NACIONAL DE ASFALTOS LTDA.","INDÚSTRIA NACIONAL DE ASFALTOS LTDA - CEP:77053-080","Tocantins"," PALMAS - TO","Montes Claros - MG","-",2.9288976632191339,2928.8976632191338,809.33,3738.2276632191338,1291,null,353.56,null,353.56,77.61,506.93,938.1,0,0,938.1,3738.2276632191338,4676.3276632191337,{"$nulls":6},"NORTE"]
[null,4488.6016794741481,9,null,"'NTA - NOVAS TÉCNICAS DE ASFALTOS S/A","RUA SOFIA ATAURI FADIN, 150 SALA A - B. SANTA TEREZINHA - CEP:13140-000","São Paulo","PAULINIA - SP","Montes Claros - MG",2.7555854755081421,2.7300013717296618,2755.5854755081423,{"$f":"ROUND(((L21/(1-$O$6-$O$7-$O$8))-L21),2)","v":761.43},3517.0154755081421,1009,null,282.22000000000003,null,282.22000000000003,61.95,404.64,748.81,589.79999999999995,222.77620396600557,971.58620396600554,3517.0154755081421,4488.6016794741481,null,4488.6016794741481,971.58620396600554,3517.0154755081421,null,null,"SUDESTE"]
[null,4414.7406313155079,10,null,"COMPANHIA BRASILEIRA DE ASFALTOS DA AMAZÔNIA - IMPORTAÇÃO E EXPORTAÇÃO","Avenida Doutor Olindo Dártora 2451, Galpão 02, Morro Grande - CEP:07726-555","São Paulo","CAIEIRAS - SP","Montes Claros - MG",2.7555854755081421,2.7300013717296618,2755.5854755081423,{"$f":"ROUND(((L22/(1-$O$6-$O$7-$O$8))-L22),2)","v":761.43},3517.0154755081421,979,null,274.63,null,274.63,60.28,393.75,728.66,447.6,169.06515580736539,897.72515580736535,3517.0154755081421,4414.7406313155079,{"$nulls":6},"SUDESTE"]
[null,4983.2495126576396,11,null,"BETUNEL INDÚSTRIA E COMÉRCIO LTDA.","R 16 , 82, Vila Nova Campo Grande - CEP:79.103-834","Mato Grosso do Sul","CAMPO GRANDE - MS","Montes Claros - MG","-",3.0695857732808691,3069.585773280869,{"$f":"ROUND(((L23/(1-$O$6-$O$7-$O$8))-L23),2)","v":848.2},3917.7857732808689,1395,null,379.87,null,379.87,83.38,544.65,1007.9,152.4,57.563739376770521,1065.4637393767705,3917.7857732808689,4983.2495126576396,{"$nulls":6},"CENTRO-OESTE"]
[null,6366.3107025865356,12,null,"BETUNEL INDÚSTRIA E COMÉRCIO LTDA.","RUA N ESQUINA COM RUA X, S/N QD. IND. 7 L 01/08 - DIST. IND. - CEP:78015-285","Mato Grosso","CUIABA - MT",{"$f":"I23","v":"Montes Claros - MG"},3.9004890595270454,3.0695857732808691,3900.4890595270454,1077.8,4978.2890595270455,1678,null,451.47,null,451.47,99.1,647.30999999999995,1197.8800000000001,503.4,190.14164305949001,1388.0216430594901,4978.2890595270455,6366.3107025865356,{"$nulls":6},"CENTRO-OESTE"]
[null,4413.0758721087086,13,null,"VIAPOL LTDA.","VITO ARDITO, 6401 KM 118,5 - JARDIM CAMPO GRANDE - CEP:12282-535","São Paulo","CACAPAVA - SP",{"$f":"I24","v":"Montes Claros - MG"},2.7555854755081421,2.7300013717296618,2755.5854755081423,761.43,3517.0154755081421,934,null,263.24,null,263.24,57.78,377.42,698.44,523.20000000000005,197.62039660056652,896.06039660056661,3517.0154755081421,4413.0758721087086,null,4413.0758721087086,896.06039660056661,3517.0154755081421,null,null,"SUDESTE"]
[null,4376.8172924095488,14,null,"STRATURA ASFALTOS S/A","RUA LUIS DE CAMÕES, 26  - CAMPOS ELÍSEOS - CEP:25225-030","Rio de Janeiro","DUQUE DE CAXIAS - RJ","Montes Claros - MG","-",2.7300013717296618,2730.001371729662,754.37,3484.3713717296619,829,null,236.68,null,236.68,51.95,339.34,627.97,700.2,264.4759206798866,892.44592067988663,3484.3713717296619,4376.8172924095488,null,4376.8172924095488,892.44592067988663,3484.3713717296619,null,null,"SUDESTE"]
[null,4764.7718342221742,15,null,"CASA DO ASFALTO DISTRIBUIDORA, INDÚSTRIA E COMÉRCIO DE ASFALTO LTDA.","BR 376, PARQUE INDUSTRIAL, S/N LOTE 6/7/7-A-3-1 - GL.PATR.MARIALVA - CEP:86990-000","Paraná","MARIALVA - PR",{"$f":"I26","v":"Montes Claros - MG"},2.795399700133411,2.8027898463728333,2795.399700133411,772.44,3567.839700133411,1358,null,370.51,null,370.51,81.33,531.23,983.06999999999994,566.20000000000005,213.86213408876293,1196.932134088763,3567.839700133411,4764.7718342221742,null,4764.7718342221742,1196.932134088763,3567.839700133411,null,null,"SUL"]
{"$rows_empty":8}
[null,null,null,"Acre"]
[null,null,null,"Alagoas"]
[null,null,null,"Amapá"]
[null,null,null,"Amazonas"]
[null,null,null,"Bahia"]
[null,null,null,"Ceará"]
[null,null,null,"Distrito Federal"]
[null,null,null,"Espírito Santo"]
[null,null,null,"Goiás"]
[null,null,null,"Maranhão"]
[null,null,null,"Mato Grosso"]
[null,null,null,"Mato Grosso do Sul"]
[null,null,null,"Minas Gerais"]
[null,null,null,"Pará"]
[null,null,null,"Paraíba"]
[null,null,null,"Paraná"]
[null,null,null,"Pernambuco"]
[null,null,null,"Piauí"]
[null,null,null,"Rio de Janeiro"]
[null,null,null,"Rio Grande do Norte"]
[null,null,null,"Rio Grande do Sul"]
[null,null,null,"Rondônia"]
[null,null,null,"Roraima"]
[null,null,null,"Santa Catarina"]
[null,null,null,"São Paulo"]
[null,null,null,"Sergipe"]
[null,null,null,"Tocantins"]
[]
[]
[]
[null,null,null,"ASFALTOS DILUÍDOS CM-30"]
[null,null,null,"ASFALTOS DILUÍDOS CM-70"]
[null,null,null,"ASFALTOS DILUÍDOS CR-250"]
[null,null,null,"ASFALTOS DILUÍDOS CR-70"]
[null,null,null,"CAP MODIFICADO POR BORRACHA DE PNEU AB22"]
[null,null,null,"CAP MODIFICADO POR BORRACHA DE PNEU AB8"]
[null,null,null,"CAP MODIFICADO POR POLÍMERO 55-75-E"]
[null,null,null,"CAP MODIFICADO POR POLÍMERO 60-85-E"]
[null,null,null,"CAP MODIFICADO POR POLÍMERO 65-90-E"]
[null,null,null,"CIMENTOS ASFÁLTICOS CAP-150-200"]
[null,null,null,"CIMENTOS ASFÁLTICOS CAP-30-45"]
[null,null,null,"CIMENTOS ASFÁLTICOS CAP-50-70"]
[null,null,null,"CIMENTOS ASFÁLTICOS CAP-85-100"]
[null,null,null,"EMULSÃO ASFÁLTICA CATIÔNICA DE RUPTURA CONTROLADA PARA SERVIÇO DE LAMA ASFÁLTICA"]
[null,null,null,"EMULSÃO ASFÁLTICA DE RUPTURA LENTA CATIÔNICA PARA SERVIÇO DE LAMA ASFÁLTICA"]
[null,null,null,"EMULSÃO ASFÁLTICA DE RUPTURA LENTA DE CARGA NEUTRA PARA SERVIÇO DE LAMA ASFÁLTICA"]
[null,null,null,"EMULSÃO ASFÁLTICA PARA SERVIÇO DE IMPRIMAÇÃO"]
[null,null,null,"EMULSÕES ASF. MOD. POR POLÍMEROS RC1C-E"]
[null,null,null,"EMULSÕES ASF. MOD. POR POLÍMEROS RL1C-E"]
[null,null,null,"EMULSÕES ASF. MOD. POR POLÍMEROS RM1C-E"]
[null,null,null,"EMULSÕES ASF. MOD. POR POLÍMEROS RR1C-E"]
[null,null,null,"EMULSÕES ASF. MOD. POR POLÍMEROS RR2C-E"]
[null,null,null,"EMULSÕES ASFÁLTICAS RL-1C"]
[null,null,null,"EMULSÕES ASFÁLTICAS RM-1C"]
[null,null,null,"EMULSÕES ASFÁLTICAS RM-2C"]
[null,null,null,"EMULSÕES ASFÁLTICAS RR-1C"]
[null,null,null,"EMULSÕES ASFÁLTICAS RR-2C"]

{"sheet":"CAP","index":8,"n_rows":91,"n_cols":34,"rows_kept":91,"cut":false,"hidden":false,"merged":[[10,4,10,8],[10,9,10,10],[10,22,10,23],[12,3,24,3],[1,2,3,26],[5,2,7,2],[5,12,7,12],[6,6,7,6],[6,19,6,20],[6,21,6,24],[7,21,7,24],[5,6,5,7],[5,8,5,9]]}
[]
[null,null,"MEMÓRIA DE CÁLCULO"]
[]
[]
[]
[{"$nulls":6},"TIPOLOGIA DO MATERIAL",null,"CIMENTOS ASFÁLTICOS CAP-50-70",null,null,null,"IMPOSTOS","COFINS",6.4999999999999997E-3,6.4999999999999997E-3]
[{"$nulls":6},"ÍNDICE DE PAVIMENTAÇÃO DNIT","2014-07-01","ÍNDICE INICIAL",270.23700000000002,null,null,null,"PIS",0.03,0.03,null,null,null,"LEGENDA",{"$nulls":8},"As empresas tributadas pelo Lucro Presumido pagam 0,65% de PIS e 3% de COFINS"]
[{"$nulls":7},"2023-10-01","ÍNDICE FINAL",{"$f":"EAI!J8","v":587.95899999999995},null,null,null," ICMS",0.18,0.18,{"$f":"1-(O8/1)","v":0.82000000000000006},{"$f":"1-(P8/1)","v":0.82000000000000006},{"$f":"1-(Q8/1)","v":0.17999999999999994},"ENTRADA DE DADOS",{"$nulls":5},169.96,null,null,"As empresas tributadas pelo Lucro Real pagam 1,65% de PIS e 7,60% de COFINS"]
[{"$nulls":6},"Data ANP",{"$f":"EAI!H9","v":"2025-02-01"}]
[]
[null,null,"DATA-BASE","PRODUTOS","LOCALIDADES",{"$nulls":4},"CUSTO ANP (R$/Kg)",null,"CUSTO ANP","IMPOSTOS DO PRODUTO","CUSTO DO PRODUTO COM IMPOSTOS","DMT's","DMT's FLUVIAL","CUSTO DO TRANSPORTE RODOVIA PAVIMENTADA","CUSTO DO TRANSPORTE FLUVIAL","CUSTO DO TRANSPORTE TOTAL","ICMS","ATUALIZAÇÃO DO CUSTO DE TRANSPORTE","CUSTO DO TRANSPORTE RODOVIA PAVIMENTADA COM IMPOSTOS E ATUALIZAÇÃO MONETÁRIA","PEDÁGIO ",null,"TOTAL TRANSPORTE","AQUISIÇÃO DO PRODUTO","TOTAL GERAL ( TRANSP + AQUISIÇÃO)",null,1,2,3]
[null,null,{"$f":"H8","v":"2023-10-01"},null,"REFINARIAS","ENDEREÇO","ESTADO","CIDADE","DESTINO","ESTADO","REGIÃO","R$/t","R$/t","R$/t","KM","KM","R$/t","R$/t","R$/t","R$/t","R$/t","R$/t","CUSTO ","R$/t","R$/t","R$/t","R$/t",null,"TOTAL GERAL ( TRANSP + AQUISIÇÃO)","TOTAL TRANSPORTE","AQUISIÇÃO DO PRODUTO"]
[null,{"$f":"AA13","v":6373.418119914767},1,{"$f":"I6","v":"CIMENTOS ASFÁLTICOS CAP-50-70"},"Refinaria Abreu e Lima","Rodovia PE 60, Km 10 - Ipojuca - PE CEP:55590-000","Pernambuco","IPOJUCA - PE",{"$f":"EAI!I13","v":"Montes Claros - MG"},"-",4.0633326009691331,{"$f":"IF(AND(J13=\"-\",K13=\"-\"),\"\",IF(AND(J13<>0,K13=\"-\"),J13*1000,IF(AND(J13=\"-\",K13<>0),K13*1000,IF(AND(J13<>0,K13<>0),J13*1000,\"\"))))","v":4063.3326009691332},{"$f":"ROUND(((L13/(1-$O$6-$O$7-$O$8))-L13),2)","v":1122.8},{"$f":"L13+M13","v":5186.1326009691329},1631,null,{"$f":"ROUND((26.939+0.253*O13),2)","v":439.58},null,{"$f":"Q13+R13","v":439.58},{"$f":"TRUNC(S13*($O$8/(1-$O$8)),2)","v":96.49},{"$f":"TRUNC(IF($J$7=\"\",\"\",(($J$8-$J$7)/$J$7)*(S13+T13)),2)","v":630.26},{"$f":"S13+T13+U13","v":1166.33},254.4,{"$f":"EVEN($Z$8*2/28)*W13/$Z$8","v":20.955518945634264},{"$f":"IF(AND(Q13=\"\",T13=\"\"),\"\",V13+X13)","v":1187.2855189456343},{"$f":"IF(OR(L13=\"\",M13=\"\"),\"\",L13+M13)","v":5186.1326009691329},{"$f":"IF(OR(Y13=\"\",Z13=\"\"),\"\",Y13+Z13)","v":6373.418119914767},null,{"$f":"AA13","v":6373.418119914767},{"$f":"Y13","v":1187.2855189456343},{"$f":"Z13","v":5186.1326009691329},null,null,{"$f":"IF(OR(G13=$D$51,G13=$D$52,G13=$D$54,G13=$D$60,G13=$D$44,G13=$D$40,G13=$D$36,G13=$D$49,G13=$D$39),\"NORDESTE\",IF(OR(G13=$D$35,G13=$D$37,G13=$D$38,G13=$D$48,G13=$D$56,G13=$D$57,G13=$D$61),\"NORTE\",IF(OR(G13=$D$41,G13=$D$43,G13=$D$45,G13=$D$46),\"CENTRO-OESTE\",IF(OR(G13=$D$59,G13=$D$53,G13=$D$47,G13=$D$42),\"SUDESTE\",IF(OR(G13=$D$58,G13=$D$50,G13=$D$55),\"SUL\",\"\")))))","v":"NORDESTE"}]
[null,{"$f":"AA14","v":6563.5667360597427},3,null,"Refinaria Potiguar Clara Camarão","Rodovia RN 221, KM 25 - Guamaré - RN CEP:59598-000","Rio Grande do Norte","GUAMARÉ - RN",{"$f":"I13","v":"Montes Claros - MG"},"-",4.0633326009691331,4063.3326009691332,{"$f":"ROUND(((L14/(1-$O$6-$O$7-$O$8))-L14),2)","v":1122.8},{"$f":"L14+M14","v":5186.1326009691329},1923,null,{"$f":"ROUND((26.939+0.253*O14),2)","v":513.46},null,{"$f":"Q14+R14","v":513.46},{"$f":"TRUNC(S14*($O$8/(1-$O$8)),2)","v":112.71},{"$f":"TRUNC(IF($J$7=\"\",\"\",(($J$8-$J$7)/$J$7)*(S14+T14)),2)","v":736.19},{"$f":"S14+T14+U14","v":1362.3600000000001},183,{"$f":"EVEN($Z$8*2/28)*W14/$Z$8","v":15.074135090609554},1377.4341350906097,5186.1326009691329,{"$f":"IF(OR(Y14=\"\",Z14=\"\"),\"\",Y14+Z14)","v":6563.5667360597427},null,{"$f":"AA14","v":6563.5667360597427},{"$f":"Y14","v":1377.4341350906097},5186.1326009691329,null,null,"NORDESTE"]
[null,5910.7043837670217,4,null,"Refinaria Landulpho Alves (RLAM)","Rodovia BA 523, KM 4 – Mataripe São Francisco do Conde - BA CEP:43900-000","Bahia","SÃO FRANCISCO DO CONDE - BA",{"$f":"I14","v":"Montes Claros - MG"},4.0617104298955224,4.0633326009691331,4061.7104298955223,{"$f":"ROUND(((L15/(1-$O$6-$O$7-$O$8))-L15),2)","v":1122.3499999999999},5184.0604298955222,951,null,{"$f":"ROUND((26.939+0.253*O15),2)","v":267.54000000000002},null,267.54000000000002,58.72,383.58,709.83999999999992,204,16.803953871499175,726.64395387149909,5184.0604298955222,5910.7043837670217,null,5910.7043837670217,726.64395387149909,5184.0604298955222,null,null,"NORDESTE"]
[2403,6570.77691516095,5,null,"Refinaria Lubrificantes e Derivados do Nordeste (Lubnor)","Av. Leite Barbosa, s/nº - Mucuripe Fortaleza - Ceará CEP:60180-420","Ceará","FORTALEZA - CE","Montes Claros - MG",4.046902780070341,4.0633326009691331,4046.9027800703411,{"$f":"ROUND(((L16/(1-$O$6-$O$7-$O$8))-L16),2)","v":1118.26},5165.1627800703409,1965,null,524.08000000000004,null,524.08000000000004,115.04,751.42,1390.54,183,15.074135090609554,1405.6141350906096,5165.1627800703409,6570.77691516095,null,6570.77691516095,1405.6141350906096,5165.1627800703409,null,null,"NORDESTE"]
[null,5675.1168148319884,6,null,"Refinaria Capuava (Recap)","Av. Alberto Soares Sampaio, 2122-A Capuava – Mauá - SP","São Paulo","MAUÁ - SP","Montes Claros - MG",3.833433684683718,3.814083778291931,3833.4336846837182,{"$f":"ROUND(((L17/(1-$O$6-$O$7-$O$8))-L17),2)","v":1059.27},4892.7036846837182,1002,null,280.45,null,280.45,61.56,402.1,744.11,465,38.303130148270178,782.41313014827017,4892.7036846837182,5675.1168148319884,null,5675.1168148319884,782.41313014827017,4892.7036846837182,null,null,"SUDESTE"]
[null,5569.5793612994803,7,null,"Refinaria Duque de Caxias (Reduc)","Rodovia Washington Luiz, km 113,7 Campos Elíseos – Duque de Caxias - RJ CEP:25213-005","Rio de Janeiro","DUQUE DE CAXIAS - RJ","Montes Claros - MG",3.8276222608052461,3.814083778291931,3827.6222608052462,1057.6600000000001,4885.2822608052466,827,null,236.17,null,236.17,51.84,338.61,626.62,700.2,57.67710049423394,684.29710049423397,4885.2822608052466,5569.5793612994803,null,5569.5793612994803,684.29710049423397,4885.2822608052466,null,null,"SUDESTE"]
[null,6576.0528421033523,8,null,"Refinaria Alberto Pasqualini (Refap)","Avenida Getúlio Vargas, 11001 - Bairro Brigadeira Canoas - RS - Brasil CEP:92420-221","Rio Grande do Sul","CANOAS - RS","Montes Claros - MG",3.9063201732400903,3.9040696863749358,3906.3201732400903,1079.4100000000001,4985.7301732400902,2134,null,566.84,null,566.84,124.42,812.72,1503.98,1048.2,86.342668863261949,1590.3226688632619,4985.7301732400902,6576.0528421033523,null,6576.0528421033523,1590.3226688632619,4985.7301732400902,null,null,"SUL"]
[null,6136.9463302052063,9,null,"Unidade de Industrialização do Xisto (SIX)","Rodovia do Xisto, BR 476, km 153 São Mateus do Sul – PR CEP 83900-000","Paraná","SÃO MATEUS DO SUL - PR","Montes Claros - MG",3.90201288704211,3.9040696863749358,3902.0128870421099,1078.22,4980.2328870421097,1539,null,416.31,null,416.31,91.38,596.89,1104.58,632.9,52.133443163097198,1156.7134431630971,4980.2328870421097,6136.9463302052063,null,6136.9463302052063,1156.7134431630971,4980.2328870421097,null,null,"SUL"]
[null,5202.8120335571029,10,null,"Refinaria Gabriel Passos (Regap)","Av. Refinaria Gabriel Passos, 690 Distrito Industrial Paulo Camilo Sul Betim - MG CEP:32669-205","Minas Gerais","BETIM - MG","Montes Claros - MG",3.7727151307564442,3.814083778291931,3772.7151307564441,1042.49,4815.2051307564443,431,null,135.97999999999999,null,135.97999999999999,29.84,194.95,360.77,325.8,26.836902800658976,387.60690280065899,4815.2051307564443,{"$f":"IF(OR(Y21=\"\",Z21=\"\"),\"\",Y21+Z21)","v":5202.8120335571029},null,5202.8120335571029,387.60690280065899,4815.2051307564443,null,null,"SUDESTE"]
[null,6079.4896250981228,11,null,"Refinaria Presidente Getúlio Vargas (Repar)","Rodovia do Xisto, BR 476, km 16 Araucária - PR CEP:83707-440","Paraná","ARAUCÁRIA - PR","Montes Claros - MG",3.90201288704211,3.9040696863749358,3902.0128870421099,1078.22,4980.2328870421097,1440,null,391.26,null,391.26,85.88,560.98,1038.1199999999999,742.2,61.136738056013186,1099.2567380560131,4980.2328870421097,6079.4896250981228,null,6079.4896250981228,1099.2567380560131,4980.2328870421097,null,null,"SUL"]
[null,5701.2668148319881,12,null,"Refinaria Presidente Bernardes (RPBC)","Av. 9 de abril, 777 - Jardim das Indústrias Cubatão - SP CEP:11505-000","São Paulo","CUBATÃO - SP","Montes Claros - MG",3.833433684683718,3.814083778291931,3833.4336846837182,1059.27,4892.7036846837182,1041,null,290.31,null,290.31,63.72,416.23,770.26,465,38.303130148270178,808.56313014827015,4892.7036846837182,5701.2668148319881,null,5701.2668148319881,808.56313014827015,4892.7036846837182,null,null,"SUDESTE"]
[null,5688.9011805651025,13,null,"Refinaria de Paulínia (Replan)","Rodovia SP 332 - Km. 130 Bonfim - Paulínia – SP CEP:13140-000","São Paulo","PAULÍNIA - SP","Montes Claros - MG",3.833433684683718,3.814083778291931,3833.4336846837182,1059.27,4892.7036846837182,1021,null,285.25,null,285.25,62.61,408.98,756.84,477.8,39.357495881383855,796.19749588138393,4892.7036846837182,5688.9011805651025,null,5688.9011805651025,796.19749588138393,4892.7036846837182,null,null,"SUDESTE"]
[null,5647.0108840247394,14,null,"Refinaria Henrique Lage (Revap)","Rodovia Presidente Dutra, KM 143, S/N Bairro Jardim Diamante - São José dos Campos – SP CEP:12223-900","São Paulo","SÃO JOSÉ DOS CAMPOS - SP","Montes Claros - MG",3.833433684683718,3.814083778291931,3833.4336846837182,1059.27,4892.7036846837182,953,null,268.05,null,268.05,58.84,384.32,711.21,523.20000000000005,43.097199341021422,754.30719934102149,4892.7036846837182,5647.0108840247394,null,5647.0108840247394,754.30719934102149,4892.7036846837182,null,null,"SUDESTE"]
{"$rows_empty":9}
[null,null,null,"Acre"]
[null,null,null,"Alagoas"]
[null,null,null,"Amapá"]
[null,null,null,"Amazonas"]
[null,null,null,"Bahia"]
[null,null,null,"Ceará"]
[null,null,null,"Distrito Federal"]
[null,null,null,"Espírito Santo"]
[null,null,null,"Goiás"]
[null,null,null,"Maranhão"]
[null,null,null,"Mato Grosso"]
[null,null,null,"Mato Grosso do Sul"]
[null,null,null,"Minas Gerais"]
[null,null,null,"Pará"]
[null,null,null,"Paraíba"]
[null,null,null,"Paraná"]
[null,null,null,"Pernambuco"]
[null,null,null,"Piauí"]
[null,null,null,"Rio de Janeiro"]
[null,null,null,"Rio Grande do Norte"]
[null,null,null,"Rio Grande do Sul"]
[null,null,null,"Rondônia"]
[null,null,null,"Roraima"]
[null,null,null,"Santa Catarina"]
[null,null,null,"São Paulo"]
[null,null,null,"Sergipe"]
[null,null,null,"Tocantins"]
[]
[]
[]
[null,null,null,"ASFALTOS DILUÍDOS CM-30"]
[null,null,null,"ASFALTOS DILUÍDOS CM-70"]
[null,null,null,"ASFALTOS DILUÍDOS CR-250"]
[null,null,null,"ASFALTOS DILUÍDOS CR-70"]
[null,null,null,"CAP MODIFICADO POR BORRACHA DE PNEU AB22"]
[null,null,null,"CAP MODIFICADO POR BORRACHA DE PNEU AB8"]
[null,null,null,"CAP MODIFICADO POR POLÍMERO 55-75-E"]
[null,null,null,"CAP MODIFICADO POR POLÍMERO 60-85-E"]
[null,null,null,"CAP MODIFICADO POR POLÍMERO 65-90-E"]
[null,null,null,"CIMENTOS ASFÁLTICOS CAP-150-200"]
[null,null,null,"CIMENTOS ASFÁLTICOS CAP-30-45"]
[null,null,null,"CIMENTOS ASFÁLTICOS CAP-50-70"]
[null,null,null,"CIMENTOS ASFÁLTICOS CAP-85-100"]
[null,null,null,"EMULSÃO ASFÁLTICA CATIÔNICA DE RUPTURA CONTROLADA PARA SERVIÇO DE LAMA ASFÁLTICA"]
[null,null,null,"EMULSÃO ASFÁLTICA DE RUPTURA LENTA CATIÔNICA PARA SERVIÇO DE LAMA ASFÁLTICA"]
[null,null,null,"EMULSÃO ASFÁLTICA DE RUPTURA LENTA DE CARGA NEUTRA PARA SERVIÇO DE LAMA ASFÁLTICA"]
[null,null,null,"EMULSÃO ASFÁLTICA PARA SERVIÇO DE IMPRIMAÇÃO"]
[null,null,null,"EMULSÕES ASF. MOD. POR POLÍMEROS RC1C-E"]
[null,null,null,"EMULSÕES ASF. MOD. POR POLÍMEROS RL1C-E"]
[null,null,null,"EMULSÕES ASF. MOD. POR POLÍMEROS RM1C-E"]
[null,null,null,"EMULSÕES ASF. MOD. POR POLÍMEROS RR1C-E"]
[null,null,null,"EMULSÕES ASF. MOD. POR POLÍMEROS RR2C-E"]
[null,null,null,"EMULSÕES ASFÁLTICAS RL-1C"]
[null,null,null,"EMULSÕES ASFÁLTICAS RM-1C"]
[null,null,null,"EMULSÕES ASFÁLTICAS RM-2C"]
[null,null,null,"EMULSÕES ASFÁLTICAS RR-1C"]
[null,null,null,"EMULSÕES ASFÁLTICAS RR-2C"]

{"sheet":"MAT.ASF","index":9,"n_rows":33,"n_cols":23,"rows_kept":33,"cut":false,"hidden":false,"merged":[[20,2,25,2],[27,2,32,2],[19,1,19,22],[26,1,26,22],[11,2,12,2],[11,3,11,6],[11,7,11,8],[11,18,11,19],[13,2,18,2],[7,1,7,19],[8,1,10,22],[2,1,2,8],[3,1,3,8],[4,1,4,8],[5,1,5,8],[6,1,6,22]]}
{"$rows_empty":8}
[null,"PLANILHA RESUMO - MATERIAIS ASFÁLTICOS"]
[]
[]
[null,"DATA-BASE","PRODUTOS","LOCALIDADES",null,null,null,"CUSTO ANP (R$/Kg)",null,"CUSTO ANP","IMPOSTOS DO PRODUTO","CUSTO DO PRODUTO COM IMPOSTOS","DMT's","DMT's","CUSTO DO TRANSPORTE TOTAL","ICMS","ATUALIZAÇÃO DO CUSTO DE TRANSPORTE","CUSTO DO TRANSPORTE RODOVIA PAVIMENTADA COM IMPOSTOS E ATUALIZAÇÃO MONETÁRIA","PEDÁGIO ",null,"TOTAL TRANSPORTE","TOTAL PRODUTO","TOTAL GERAL"]
[null,{"$f":"CAP!H9","v":"2025-02-01"},null,"REFINARIAS","ENDEREÇO","ORIGEM - REFINARIAS / DISTRIBUIDORAS","DESTINO","ESTADO","REGIÃO","R$/t","R$/t","R$/t","KM","KM","R$/t","R$/t","R$/t","R$/t","CUSTO POR EIXO","R$/t","R$/t","R$/t","R$/t"]
[null,1,"CAP 50/70","Refinaria Abreu e Lima","Rodovia PE 60, Km 10 - Ipojuca - PE CEP:55590-000",{"$f":"VLOOKUP($W14,CAP!$B:$AA,7,FALSE)","v":"BETIM - MG"},{"$f":"VLOOKUP($W14,CAP!$B:$AA,8,FALSE)","v":"Montes Claros - MG"},{"$f":"VLOOKUP($W14,CAP!$B:$AA,9,FALSE)","v":3.7727151307564442},{"$f":"VLOOKUP($W14,CAP!$B:$AA,10,FALSE)","v":3.814083778291931},{"$f":"VLOOKUP($W14,CAP!$B:$AA,11,FALSE)","v":3772.7151307564441},{"$f":"VLOOKUP($W14,CAP!$B:$AA,12,FALSE)","v":1042.49},{"$f":"VLOOKUP($W14,CAP!$B:$AA,13,FALSE)","v":4815.2051307564443},{"$f":"VLOOKUP($W14,CAP!$B$13:$AA$25,14,FALSE)","v":431},{"$f":"VLOOKUP($W14,'[2]Transporte Cap 50-70'!$B:$AA,15,FALSE)","v":{"$error":"#N/A"}},{"$f":"VLOOKUP($W14,CAP!$B:$AA,18,FALSE)","v":135.97999999999999},{"$f":"VLOOKUP($W14,CAP!$B:$AA,19,FALSE)","v":29.84},{"$f":"VLOOKUP($W14,CAP!$B:$AA,20,FALSE)","v":194.95},{"$f":"VLOOKUP($W14,CAP!$B:$AA,21,FALSE)","v":360.77},{"$f":"VLOOKUP($W14,CAP!$B:$AA,22,FALSE)","v":325.8},{"$f":"VLOOKUP($W14,CAP!$B:$AA,23,FALSE)","v":26.836902800658976},{"$f":"VLOOKUP($W14,CAP!$B:$AA,24,FALSE)","v":387.60690280065899},{"$f":"VLOOKUP($W14,CAP!$B:$AA,25,FALSE)","v":4815.2051307564443},{"$f":"SMALL(CAP!$AA$13:$AA$25,1)","v":5202.8120335571029}]
[null,2,null,"Refinaria Potiguar Clara Camarão","Rodovia RN 221, KM 25 - Guamaré - RN CEP:59598-000",{"$f":"VLOOKUP($W15,CAP!$B:$AA,7,FALSE)","v":"DUQUE DE CAXIAS - RJ"},{"$f":"VLOOKUP($W15,CAP!$B:$AA,8,FALSE)","v":"Montes Claros - MG"},{"$f":"VLOOKUP($W15,CAP!$B:$AA,9,FALSE)","v":3.8276222608052461},{"$f":"VLOOKUP($W15,CAP!$B:$AA,10,FALSE)","v":3.814083778291931},{"$f":"VLOOKUP($W15,CAP!$B:$AA,11,FALSE)","v":3827.6222608052462},{"$f":"VLOOKUP($W15,CAP!$B:$AA,12,FALSE)","v":1057.6600000000001},{"$f":"VLOOKUP($W15,CAP!$B:$AA,13,FALSE)","v":4885.2822608052466},{"$f":"VLOOKUP($W15,CAP!$B$13:$AA$25,14,FALSE)","v":827},{"$f":"VLOOKUP($W15,'[2]Transporte Cap 50-70'!$B:$AA,15,FALSE)","v":{"$error":"#N/A"}},{"$f":"VLOOKUP($W15,CAP!$B:$AA,18,FALSE)","v":236.17},{"$f":"VLOOKUP($W15,CAP!$B:$AA,19,FALSE)","v":51.84},{"$f":"VLOOKUP($W15,CAP!$B:$AA,20,FALSE)","v":338.61},{"$f":"VLOOKUP($W15,CAP!$B:$AA,21,FALSE)","v":626.62},{"$f":"VLOOKUP($W15,CAP!$B:$AA,22,FALSE)","v":700.2},{"$f":"VLOOKUP($W15,CAP!$B:$AA,23,FALSE)","v":57.67710049423394},{"$f":"VLOOKUP($W15,CAP!$B:$AA,24,FALSE)","v":684.29710049423397},{"$f":"VLOOKUP($W15,CAP!$B:$AA,25,FALSE)","v":4885.2822608052466},{"$f":"SMALL(CAP!$AA$13:$AA$25,2)","v":5569.5793612994803}]
[null,3,null,"Complexo Petroquímico do Rio de Janeiro (Comperj)","Rodovia Estadual RJ-116 - Km 5,2 - Acesso A-1, s/n, Complemento Sambaetiba - Zona Urbana do 4º Distrito de Itaboraí - RJ CEP:24841-203",{"$f":"VLOOKUP($W16,CAP!$B:$AA,7,FALSE)","v":"SÃO JOSÉ DOS CAMPOS - SP"},{"$f":"VLOOKUP($W16,CAP!$B:$AA,8,FALSE)","v":"Montes Claros - MG"},{"$f":"VLOOKUP($W16,CAP!$B:$AA,9,FALSE)","v":3.833433684683718},{"$f":"VLOOKUP($W16,CAP!$B:$AA,10,FALSE)","v":3.814083778291931},{"$f":"VLOOKUP($W16,CAP!$B:$AA,11,FALSE)","v":3833.4336846837182},{"$f":"VLOOKUP($W16,CAP!$B:$AA,12,FALSE)","v":1059.27},{"$f":"VLOOKUP($W16,CAP!$B:$AA,13,FALSE)","v":4892.7036846837182},{"$f":"VLOOKUP($W16,CAP!$B$13:$AA$25,14,FALSE)","v":953},{"$f":"VLOOKUP($W16,'[2]Transporte Cap 50-70'!$B:$AA,15,FALSE)","v":{"$error":"#N/A"}},{"$f":"VLOOKUP($W16,CAP!$B:$AA,18,FALSE)","v":268.05},{"$f":"VLOOKUP($W16,CAP!$B:$AA,19,FALSE)","v":58.84},{"$f":"VLOOKUP($W16,CAP!$B:$AA,20,FALSE)","v":384.32},{"$f":"VLOOKUP($W16,CAP!$B:$AA,21,FALSE)","v":711.21},{"$f":"VLOOKUP($W16,CAP!$B:$AA,22,FALSE)","v":523.20000000000005},{"$f":"VLOOKUP($W16,CAP!$B:$AA,23,FALSE)","v":43.097199341021422},{"$f":"VLOOKUP($W16,CAP!$B:$AA,24,FALSE)","v":754.30719934102149},{"$f":"VLOOKUP($W16,CAP!$B:$AA,25,FALSE)","v":4892.7036846837182},{"$f":"SMALL(CAP!$AA$13:$AA$25,3)","v":5647.0108840247394}]
[null,4,null,null,null,{"$f":"VLOOKUP($W17,CAP!$B:$AA,7,FALSE)","v":"MAUÁ - SP"},{"$f":"VLOOKUP($W17,CAP!$B:$AA,8,FALSE)","v":"Montes Claros - MG"},{"$f":"VLOOKUP($W17,CAP!$B:$AA,9,FALSE)","v":3.833433684683718},{"$f":"VLOOKUP($W17,CAP!$B:$AA,10,FALSE)","v":3.814083778291931},{"$f":"VLOOKUP($W17,CAP!$B:$AA,11,FALSE)","v":3833.4336846837182},{"$f":"VLOOKUP($W17,CAP!$B:$AA,12,FALSE)","v":1059.27},{"$f":"VLOOKUP($W17,CAP!$B:$AA,13,FALSE)","v":4892.7036846837182},{"$f":"VLOOKUP($W17,CAP!$B$13:$AA$25,14,FALSE)","v":1002},{"$f":"VLOOKUP($W17,'[2]Transporte Cap 50-70'!$B:$AA,15,FALSE)","v":{"$error":"#N/A"}},{"$f":"VLOOKUP($W17,CAP!$B:$AA,18,FALSE)","v":280.45},{"$f":"VLOOKUP($W17,CAP!$B:$AA,19,FALSE)","v":61.56},{"$f":"VLOOKUP($W17,CAP!$B:$AA,20,FALSE)","v":402.1},{"$f":"VLOOKUP($W17,CAP!$B:$AA,21,FALSE)","v":744.11},{"$f":"VLOOKUP($W17,CAP!$B:$AA,22,FALSE)","v":465},{"$f":"VLOOKUP($W17,CAP!$B:$AA,23,FALSE)","v":38.303130148270178},{"$f":"VLOOKUP($W17,CAP!$B:$AA,24,FALSE)","v":782.41313014827017},{"$f":"VLOOKUP($W17,CAP!$B:$AA,25,FALSE)","v":4892.7036846837182},{"$f":"SMALL(CAP!$AA$13:$AA$25,4)","v":5675.1168148319884}]
[null,5,null,null,null,{"$f":"VLOOKUP($W18,CAP!$B:$AA,7,FALSE)","v":"PAULÍNIA - SP"},{"$f":"VLOOKUP($W18,CAP!$B:$AA,8,FALSE)","v":"Montes Claros - MG"},{"$f":"VLOOKUP($W18,CAP!$B:$AA,9,FALSE)","v":3.833433684683718},{"$f":"VLOOKUP($W18,CAP!$B:$AA,10,FALSE)","v":3.814083778291931},{"$f":"VLOOKUP($W18,CAP!$B:$AA,11,FALSE)","v":3833.4336846837182},{"$f":"VLOOKUP($W18,CAP!$B:$AA,12,FALSE)","v":1059.27},{"$f":"VLOOKUP($W18,CAP!$B:$AA,13,FALSE)","v":4892.7036846837182},{"$f":"VLOOKUP($W18,CAP!$B$13:$AA$25,14,FALSE)","v":1021},{"$f":"VLOOKUP($W18,'[2]Transporte Cap 50-70'!$B:$AA,15,FALSE)","v":{"$error":"#N/A"}},{"$f":"VLOOKUP($W18,CAP!$B:$AA,18,FALSE)","v":285.25},{"$f":"VLOOKUP($W18,CAP!$B:$AA,19,FALSE)","v":62.61},{"$f":"VLOOKUP($W18,CAP!$B:$AA,20,FALSE)","v":408.98},{"$f":"VLOOKUP($W18,CAP!$B:$AA,21,FALSE)","v":756.84},{"$f":"VLOOKUP($W18,CAP!$B:$AA,22,FALSE)","v":477.8},{"$f":"VLOOKUP($W18,CAP!$B:$AA,23,FALSE)","v":39.357495881383855},{"$f":"VLOOKUP($W18,CAP!$B:$AA,24,FALSE)","v":796.19749588138393},{"$f":"VLOOKUP($W18,CAP!$B:$AA,25,FALSE)","v":4892.7036846837182},{"$f":"SMALL(CAP!$AA$13:$AA$25,5)","v":5688.9011805651025}]
[null,6,null,null,null,{"$f":"VLOOKUP($W19,CAP!$B:$AA,7,FALSE)","v":"CUBATÃO - SP"},{"$f":"VLOOKUP($W19,CAP!$B:$AA,8,FALSE)","v":"Montes Claros - MG"},{"$f":"VLOOKUP($W19,CAP!$B:$AA,9,FALSE)","v":3.833433684683718},{"$f":"VLOOKUP($W19,CAP!$B:$AA,10,FALSE)","v":3.814083778291931},{"$f":"VLOOKUP($W19,CAP!$B:$AA,11,FALSE)","v":3833.4336846837182},{"$f":"VLOOKUP($W19,CAP!$B:$AA,12,FALSE)","v":1059.27},{"$f":"VLOOKUP($W19,CAP!$B:$AA,13,FALSE)","v":4892.7036846837182},{"$f":"VLOOKUP($W19,CAP!$B$13:$AA$25,14,FALSE)","v":1041},{"$f":"VLOOKUP($W19,'[2]Transporte Cap 50-70'!$B:$AA,15,FALSE)","v":{"$error":"#N/A"}},{"$f":"VLOOKUP($W19,CAP!$B:$AA,18,FALSE)","v":290.31},{"$f":"VLOOKUP($W19,CAP!$B:$AA,19,FALSE)","v":63.72},{"$f":"VLOOKUP($W19,CAP!$B:$AA,20,FALSE)","v":416.23},{"$f":"VLOOKUP($W19,CAP!$B:$AA,21,FALSE)","v":770.26},{"$f":"VLOOKUP($W19,CAP!$B:$AA,22,FALSE)","v":465},{"$f":"VLOOKUP($W19,CAP!$B:$AA,23,FALSE)","v":38.303130148270178},{"$f":"VLOOKUP($W19,CAP!$B:$AA,24,FALSE)","v":808.56313014827015},{"$f":"VLOOKUP($W19,CAP!$B:$AA,25,FALSE)","v":4892.7036846837182},{"$f":"SMALL(CAP!$AA$13:$AA$25,6)","v":5701.2668148319881}]
[]
[null,1,"EMULSÃO ASFÁLTICA PARA IMPRIMAÇÃO (EAI)","Refinaria Abreu e Lima","Rodovia PE 60, Km 10 - Ipojuca - PE CEP:55590-000",{"$f":"VLOOKUP($W21,EAI!$B$13:$AA$24,7,FALSE)","v":"BETIM - MG"},{"$f":"VLOOKUP($W21,EAI!$B$13:$AA$24,8,FALSE)","v":"Montes Claros - MG"},{"$f":"VLOOKUP($W21,EAI!$B$13:$AA$24,9,FALSE)","v":2.7674270595881234},{"$f":"VLOOKUP($W21,EAI!$B$13:$AA$24,10,FALSE)","v":2.7609338335366278},{"$f":"VLOOKUP($W21,EAI!$B$13:$AA$24,11,FALSE)","v":2767.4270595881235},{"$f":"VLOOKUP($W21,EAI!$B$13:$AA$24,12,FALSE)","v":764.71},{"$f":"VLOOKUP($W21,EAI!$B$13:$AA$24,13,FALSE)","v":3532.1370595881235},{"$f":"VLOOKUP($W21,EAI!$B$13:$AA$24,14,FALSE)","v":431},{"$f":"VLOOKUP($W21,'[2]Transporte CM-30'!$B$13:$AA$25,15,FALSE)","v":{"$error":"#N/A"}},{"$f":"VLOOKUP($W21,EAI!$B$13:$AA$24,18,FALSE)","v":135.97999999999999},{"$f":"VLOOKUP($W21,EAI!$B$13:$AA$24,19,FALSE)","v":29.84},{"$f":"VLOOKUP($W21,EAI!$B$13:$AA$24,20,FALSE)","v":194.95},{"$f":"VLOOKUP($W21,EAI!$B$13:$AA$24,21,FALSE)","v":360.77},{"$f":"VLOOKUP($W21,EAI!$B$13:$AA$24,22,FALSE)","v":325.8},{"$f":"VLOOKUP($W21,EAI!$B$13:$AA$24,23,FALSE)","v":37.234285714285718},{"$f":"VLOOKUP($W21,EAI!$B$13:$AA$24,24,FALSE)","v":398.00428571428569},{"$f":"VLOOKUP($W21,EAI!$B:$AA,25,FALSE)","v":3532.1370595881235},{"$f":"SMALL(EAI!$AA$13:$AA$24,1)","v":3930.1413453024093}]
[null,2,null,"Refinaria Potiguar Clara Camarão","Rodovia RN 221, KM 25 - Guamaré - RN CEP:59598-000",{"$f":"VLOOKUP($W22,EAI!$B$13:$AA$24,7,FALSE)","v":"SÃO FRANCISCO DO CONDE - BA"},{"$f":"VLOOKUP($W22,EAI!$B$13:$AA$24,8,FALSE)","v":"Montes Claros - MG"},{"$f":"VLOOKUP($W22,EAI!$B$13:$AA$24,9,FALSE)","v":"-"},{"$f":"VLOOKUP($W22,EAI!$B$13:$AA$24,10,FALSE)","v":2.7104017950292691},{"$f":"VLOOKUP($W22,EAI!$B$13:$AA$24,11,FALSE)","v":2710.4017950292691},{"$f":"VLOOKUP($W22,EAI!$B$13:$AA$24,12,FALSE)","v":748.95},{"$f":"VLOOKUP($W22,EAI!$B$13:$AA$24,13,FALSE)","v":3459.3517950292689},{"$f":"VLOOKUP($W22,EAI!$B$13:$AA$24,14,FALSE)","v":951},{"$f":"VLOOKUP($W22,'[2]Transporte CM-30'!$B$13:$AA$25,15,FALSE)","v":{"$error":"#N/A"}},{"$f":"VLOOKUP($W22,EAI!$B$13:$AA$24,18,FALSE)","v":267.54000000000002},{"$f":"VLOOKUP($W22,EAI!$B$13:$AA$24,19,FALSE)","v":58.72},{"$f":"VLOOKUP($W22,EAI!$B$13:$AA$24,20,FALSE)","v":383.58},{"$f":"VLOOKUP($W22,EAI!$B$13:$AA$24,21,FALSE)","v":709.83999999999992},{"$f":"VLOOKUP($W22,EAI!$B$13:$AA$24,22,FALSE)","v":204},{"$f":"VLOOKUP($W22,EAI!$B$13:$AA$24,23,FALSE)","v":23.314285714285713},{"$f":"VLOOKUP($W22,EAI!$B$13:$AA$24,24,FALSE)","v":733.15428571428561},{"$f":"VLOOKUP($W22,EAI!$B:$AA,25,FALSE)","v":3459.3517950292689},{"$f":"SMALL(EAI!$AA$13:$AA$24,2)","v":4192.5060807435548}]
[null,3,null,"Complexo Petroquímico do Rio de Janeiro (Comperj)","Rodovia Estadual RJ-116 - Km 5,2 - Acesso A-1, s/n, Complemento Sambaetiba - Zona Urbana do 4º Distrito de Itaboraí - RJ CEP:24841-203",{"$f":"VLOOKUP($W23,EAI!$B$13:$AA$24,7,FALSE)","v":"DUQUE DE CAXIAS - RJ"},{"$f":"VLOOKUP($W23,EAI!$B$13:$AA$24,8,FALSE)","v":"Montes Claros - MG"},{"$f":"VLOOKUP($W23,EAI!$B$13:$AA$24,9,FALSE)","v":"-"},{"$f":"VLOOKUP($W23,EAI!$B$13:$AA$24,10,FALSE)","v":2.7609338335366278},{"$f":"VLOOKUP($W23,EAI!$B$13:$AA$24,11,FALSE)","v":2760.9338335366278},{"$f":"VLOOKUP($W23,EAI!$B$13:$AA$24,12,FALSE)","v":762.91},{"$f":"VLOOKUP($W23,EAI!$B$13:$AA$24,13,FALSE)","v":3523.8438335366277},{"$f":"VLOOKUP($W23,EAI!$B$13:$AA$24,14,FALSE)","v":827},{"$f":"VLOOKUP($W23,'[2]Transporte CM-30'!$B$13:$AA$25,15,FALSE)","v":{"$error":"#N/A"}},{"$f":"VLOOKUP($W23,EAI!$B$13:$AA$24,18,FALSE)","v":236.17},{"$f":"VLOOKUP($W23,EAI!$B$13:$AA$24,19,FALSE)","v":51.84},{"$f":"VLOOKUP($W23,EAI!$B$13:$AA$24,20,FALSE)","v":338.61},{"$f":"VLOOKUP($W23,EAI!$B$13:$AA$24,21,FALSE)","v":626.62},{"$f":"VLOOKUP($W23,EAI!$B$13:$AA$24,22,FALSE)","v":700.2},{"$f":"VLOOKUP($W23,EAI!$B$13:$AA$24,23,FALSE)","v":80.022857142857148},{"$f":"VLOOKUP($W23,EAI!$B$13:$AA$24,24,FALSE)","v":706.64285714285711},{"$f":"VLOOKUP($W23,EAI!$B:$AA,25,FALSE)","v":3523.8438335366277},{"$f":"SMALL(EAI!$AA$13:$AA$24,3)","v":4230.486690679485}]
[null,4,null,null,null,{"$f":"VLOOKUP($W24,EAI!$B$13:$AA$24,7,FALSE)","v":"MAUÁ - SP"},{"$f":"VLOOKUP($W24,EAI!$B$13:$AA$24,8,FALSE)","v":"Montes Claros - MG"},{"$f":"VLOOKUP($W24,EAI!$B$13:$AA$24,9,FALSE)","v":2.7293387745904658},{"$f":"VLOOKUP($W24,EAI!$B$13:$AA$24,10,FALSE)","v":2.7609338335366278},{"$f":"VLOOKUP($W24,EAI!$B$13:$AA$24,11,FALSE)","v":2729.3387745904656},{"$f":"VLOOKUP($W24,EAI!$B$13:$AA$24,12,FALSE)","v":754.18},{"$f":"VLOOKUP($W24,EAI!$B$13:$AA$24,13,FALSE)","v":3483.5187745904655},{"$f":"VLOOKUP($W24,EAI!$B$13:$AA$24,14,FALSE)","v":1002},{"$f":"VLOOKUP($W24,'[2]Transporte CM-30'!$B$13:$AA$25,15,FALSE)","v":{"$error":"#N/A"}},{"$f":"VLOOKUP($W24,EAI!$B$13:$AA$24,18,FALSE)","v":280.45},{"$f":"VLOOKUP($W24,EAI!$B$13:$AA$24,19,FALSE)","v":61.56},{"$f":"VLOOKUP($W24,EAI!$B$13:$AA$24,20,FALSE)","v":402.1},{"$f":"VLOOKUP($W24,EAI!$B$13:$AA$24,21,FALSE)","v":744.11},{"$f":"VLOOKUP($W24,EAI!$B$13:$AA$24,22,FALSE)","v":465},{"$f":"VLOOKUP($W24,EAI!$B$13:$AA$24,23,FALSE)","v":53.142857142857146},{"$f":"VLOOKUP($W24,EAI!$B$13:$AA$24,24,FALSE)","v":797.25285714285712},{"$f":"VLOOKUP($W24,EAI!$B:$AA,25,FALSE)","v":3483.5187745904655},{"$f":"SMALL(EAI!$AA$13:$AA$24,4)","v":4280.7716317333225}]
[null,5,null,null,null,{"$f":"VLOOKUP($W25,EAI!$B$13:$AA$24,7,FALSE)","v":"PAULÍNIA - SP"},{"$f":"VLOOKUP($W25,EAI!$B$13:$AA$24,8,FALSE)","v":"Montes Claros - MG"},{"$f":"VLOOKUP($W25,EAI!$B$13:$AA$24,9,FALSE)","v":2.7293387745904658},{"$f":"VLOOKUP($W25,EAI!$B$13:$AA$24,10,FALSE)","v":2.7609338335366278},{"$f":"VLOOKUP($W25,EAI!$B$13:$AA$24,11,FALSE)","v":2729.3387745904656},{"$f":"VLOOKUP($W25,EAI!$B$13:$AA$24,12,FALSE)","v":754.18},{"$f":"VLOOKUP($W25,EAI!$B$13:$AA$24,13,FALSE)","v":3483.5187745904655},{"$f":"VLOOKUP($W25,EAI!$B$13:$AA$24,14,FALSE)","v":1021},{"$f":"VLOOKUP($W25,'[2]Transporte CM-30'!$B$13:$AA$25,15,FALSE)","v":{"$error":"#N/A"}},{"$f":"VLOOKUP($W25,EAI!$B$13:$AA$24,18,FALSE)","v":285.25},{"$f":"VLOOKUP($W25,EAI!$B$13:$AA$24,19,FALSE)","v":62.61},{"$f":"VLOOKUP($W25,EAI!$B$13:$AA$24,20,FALSE)","v":408.98},{"$f":"VLOOKUP($W25,EAI!$B$13:$AA$24,21,FALSE)","v":756.84},{"$f":"VLOOKUP($W25,EAI!$B$13:$AA$24,22,FALSE)","v":477.8},{"$f":"VLOOKUP($W25,EAI!$B$13:$AA$24,23,FALSE)","v":54.605714285714285},{"$f":"VLOOKUP($W25,EAI!$B$13:$AA$24,24,FALSE)","v":811.4457142857143},{"$f":"VLOOKUP($W25,EAI!$B:$AA,25,FALSE)","v":3483.5187745904655},{"$f":"SMALL(EAI!$AA$13:$AA$24,5)","v":4294.9644888761795}]
[null,6,null,null,null,{"$f":"VLOOKUP($W26,EAI!$B$13:$AA$24,7,FALSE)","v":"CUBATÃO - SP"},{"$f":"VLOOKUP($W26,EAI!$B$13:$AA$24,8,FALSE)","v":"Montes Claros - MG"},{"$f":"VLOOKUP($W26,EAI!$B$13:$AA$24,9,FALSE)","v":2.7293387745904658},{"$f":"VLOOKUP($W26,EAI!$B$13:$AA$24,10,FALSE)","v":2.7609338335366278},{"$f":"VLOOKUP($W26,EAI!$B$13:$AA$24,11,FALSE)","v":2729.3387745904656},{"$f":"VLOOKUP($W26,EAI!$B$13:$AA$24,12,FALSE)","v":754.18},{"$f":"VLOOKUP($W26,EAI!$B$13:$AA$24,13,FALSE)","v":3483.5187745904655},{"$f":"VLOOKUP($W26,EAI!$B$13:$AA$24,14,FALSE)","v":1041},{"$f":"VLOOKUP($W26,'[2]Transporte CM-30'!$B$13:$AA$25,15,FALSE)","v":{"$error":"#N/A"}},{"$f":"VLOOKUP($W26,EAI!$B$13:$AA$24,18,FALSE)","v":290.31},{"$f":"VLOOKUP($W26,EAI!$B$13:$AA$24,19,FALSE)","v":63.72},{"$f":"VLOOKUP($W26,EAI!$B$13:$AA$24,20,FALSE)","v":416.23},{"$f":"VLOOKUP($W26,EAI!$B$13:$AA$24,21,FALSE)","v":770.26},{"$f":"VLOOKUP($W26,EAI!$B$13:$AA$24,22,FALSE)","v":465},{"$f":"VLOOKUP($W26,EAI!$B$13:$AA$24,23,FALSE)","v":53.142857142857146},{"$f":"VLOOKUP($W26,EAI!$B$13:$AA$24,24,FALSE)","v":823.4028571428571},{"$f":"VLOOKUP($W26,EAI!$B:$AA,25,FALSE)","v":3483.5187745904655},{"$f":"SMALL(EAI!$AA$13:$AA$24,6)","v":4306.921631733323}]
[]
[null,1,"RR1-C","Refinaria Abreu e Lima","Rodovia PE 60, Km 10 - Ipojuca - PE CEP:55590-000",{"$f":"VLOOKUP($W28,'RR-1C'!$B:$AA,7,FALSE)","v":"SARZEDO - MG"},{"$f":"VLOOKUP($W28,'RR-1C'!$B:$AA,8,FALSE)","v":"Montes Claros - MG"},{"$f":"VLOOKUP($W28,'RR-1C'!$B:$AA,9,FALSE)","v":2.7272026129148301},{"$f":"VLOOKUP($W28,'RR-1C'!$B:$AA,10,FALSE)","v":2.7300013717296618},{"$f":"VLOOKUP($W28,'RR-1C'!$B:$AA,11,FALSE)","v":2727.2026129148303},{"$f":"VLOOKUP($W28,'RR-1C'!$B:$AA,12,FALSE)","v":753.59},{"$f":"VLOOKUP($W28,'RR-1C'!$B:$AA,13,FALSE)","v":3480.7926129148304},{"$f":"VLOOKUP($W28,'RR-1C'!$B:$AA,14,FALSE)","v":439},{"$f":"VLOOKUP($W28,'[2]Transporte RR-1C'!$B:$AA,15,FALSE)","v":{"$error":"#N/A"}},{"$f":"VLOOKUP($W28,'RR-1C'!$B:$AA,18,FALSE)","v":138.01},{"$f":"VLOOKUP($W28,'RR-1C'!$B:$AA,19,FALSE)","v":30.29},{"$f":"VLOOKUP($W28,'RR-1C'!$B:$AA,20,FALSE)","v":197.87},{"$f":"VLOOKUP($W28,'RR-1C'!$B:$AA,21,FALSE)","v":366.16999999999996},{"$f":"VLOOKUP($W28,'RR-1C'!$B:$AA,22,FALSE)","v":325.8},{"$f":"VLOOKUP($W28,'RR-1C'!$B:$AA,23,FALSE)","v":123.0594900849858},{"$f":"VLOOKUP($W28,'RR-1C'!$B:$AA,24,FALSE)","v":489.22949008498574},{"$f":"VLOOKUP($W28,'RR-1C'!$B:$AA,25,FALSE)","v":3480.7926129148304},{"$f":"SMALL('RR-1C'!$AA$13:$AA$27,1)","v":3970.0221029998161}]
[null,2,null,"Refinaria Potiguar Clara Camarão","Rodovia RN 221, KM 25 - Guamaré - RN CEP:59598-000",{"$f":"VLOOKUP($W29,'RR-1C'!$B:$AA,7,FALSE)","v":"UBERLANDIA - MG"},{"$f":"VLOOKUP($W29,'RR-1C'!$B:$AA,8,FALSE)","v":"Montes Claros - MG"},{"$f":"VLOOKUP($W29,'RR-1C'!$B:$AA,9,FALSE)","v":2.7272026129148301},{"$f":"VLOOKUP($W29,'RR-1C'!$B:$AA,10,FALSE)","v":2.7300013717296618},{"$f":"VLOOKUP($W29,'RR-1C'!$B:$AA,11,FALSE)","v":2727.2026129148303},{"$f":"VLOOKUP($W29,'RR-1C'!$B:$AA,12,FALSE)","v":753.59},{"$f":"VLOOKUP($W29,'RR-1C'!$B:$AA,13,FALSE)","v":3480.7926129148304},{"$f":"VLOOKUP($W29,'RR-1C'!$B:$AA,14,FALSE)","v":633},{"$f":"VLOOKUP($W29,'[2]Transporte RR-1C'!$B:$AA,15,FALSE)","v":{"$error":"#N/A"}},{"$f":"VLOOKUP($W29,'RR-1C'!$B:$AA,18,FALSE)","v":187.09},{"$f":"VLOOKUP($W29,'RR-1C'!$B:$AA,19,FALSE)","v":41.06},{"$f":"VLOOKUP($W29,'RR-1C'!$B:$AA,20,FALSE)","v":268.23},{"$f":"VLOOKUP($W29,'RR-1C'!$B:$AA,21,FALSE)","v":496.38},{"$f":"VLOOKUP($W29,'RR-1C'!$B:$AA,22,FALSE)","v":152.4},{"$f":"VLOOKUP($W29,'RR-1C'!$B:$AA,23,FALSE)","v":57.563739376770521},{"$f":"VLOOKUP($W29,'RR-1C'!$B:$AA,24,FALSE)","v":553.94373937677051},{"$f":"VLOOKUP($W29,'RR-1C'!$B:$AA,25,FALSE)","v":3480.7926129148304},{"$f":"SMALL('RR-1C'!$AA$13:$AA$27,2)","v":4034.7363522916012}]
[null,3,null,"Complexo Petroquímico do Rio de Janeiro (Comperj)","Rodovia Estadual RJ-116 - Km 5,2 - Acesso A-1, s/n, Complemento Sambaetiba - Zona Urbana do 4º Distrito de Itaboraí - RJ CEP:24841-203",{"$f":"VLOOKUP($W30,'RR-1C'!$B:$AA,7,FALSE)","v":"DUQUE DE CAXIAS - RJ"},{"$f":"VLOOKUP($W30,'RR-1C'!$B:$AA,8,FALSE)","v":"Montes Claros - MG"},{"$f":"VLOOKUP($W30,'RR-1C'!$B:$AA,9,FALSE)","v":"-"},{"$f":"VLOOKUP($W30,'RR-1C'!$B:$AA,10,FALSE)","v":2.7300013717296618},{"$f":"VLOOKUP($W30,'RR-1C'!$B:$AA,11,FALSE)","v":2730.001371729662},{"$f":"VLOOKUP($W30,'RR-1C'!$B:$AA,12,FALSE)","v":754.37},{"$f":"VLOOKUP($W30,'RR-1C'!$B:$AA,13,FALSE)","v":3484.3713717296619},{"$f":"VLOOKUP($W30,'RR-1C'!$B:$AA,14,FALSE)","v":829},{"$f":"VLOOKUP($W30,'[2]Transporte RR-1C'!$B:$AA,15,FALSE)","v":{"$error":"#N/A"}},{"$f":"VLOOKUP($W30,'RR-1C'!$B:$AA,18,FALSE)","v":236.68},{"$f":"VLOOKUP($W30,'RR-1C'!$B:$AA,19,FALSE)","v":51.95},{"$f":"VLOOKUP($W30,'RR-1C'!$B:$AA,20,FALSE)","v":339.34},{"$f":"VLOOKUP($W30,'RR-1C'!$B:$AA,21,FALSE)","v":627.97},{"$f":"VLOOKUP($W30,'RR-1C'!$B:$AA,22,FALSE)","v":700.2},{"$f":"VLOOKUP($W30,'RR-1C'!$B:$AA,23,FALSE)","v":264.4759206798866},{"$f":"VLOOKUP($W30,'RR-1C'!$B:$AA,24,FALSE)","v":892.44592067988663},{"$f":"VLOOKUP($W30,'RR-1C'!$B:$AA,25,FALSE)","v":3484.3713717296619},{"$f":"SMALL('RR-1C'!$AA$13:$AA$27,3)","v":4376.8172924095488}]
[null,4,null,"Refinaria Abreu e Lima","Rodovia PE 60, Km 10 - Ipojuca - PE CEP:55590-000",{"$f":"VLOOKUP($W31,'RR-1C'!$B:$AA,7,FALSE)","v":"CACAPAVA - SP"},{"$f":"VLOOKUP($W31,'RR-1C'!$B:$AA,8,FALSE)","v":"Montes Claros - MG"},{"$f":"VLOOKUP($W31,'RR-1C'!$B:$AA,9,FALSE)","v":2.7555854755081421},{"$f":"VLOOKUP($W31,'RR-1C'!$B:$AA,10,FALSE)","v":2.7300013717296618},{"$f":"VLOOKUP($W31,'RR-1C'!$B:$AA,11,FALSE)","v":2755.5854755081423},{"$f":"VLOOKUP($W31,'RR-1C'!$B:$AA,12,FALSE)","v":761.43},{"$f":"VLOOKUP($W31,'RR-1C'!$B:$AA,13,FALSE)","v":3517.0154755081421},{"$f":"VLOOKUP($W31,'RR-1C'!$B:$AA,14,FALSE)","v":934},{"$f":"VLOOKUP($W31,'[2]Transporte RR-1C'!$B:$AA,15,FALSE)","v":{"$error":"#N/A"}},{"$f":"VLOOKUP($W31,'RR-1C'!$B:$AA,18,FALSE)","v":263.24},{"$f":"VLOOKUP($W31,'RR-1C'!$B:$AA,19,FALSE)","v":57.78},{"$f":"VLOOKUP($W31,'RR-1C'!$B:$AA,20,FALSE)","v":377.42},{"$f":"VLOOKUP($W31,'RR-1C'!$B:$AA,21,FALSE)","v":698.44},{"$f":"VLOOKUP($W31,'RR-1C'!$B:$AA,22,FALSE)","v":523.20000000000005},{"$f":"VLOOKUP($W31,'RR-1C'!$B:$AA,23,FALSE)","v":197.62039660056652},{"$f":"VLOOKUP($W31,'RR-1C'!$B:$AA,24,FALSE)","v":896.06039660056661},{"$f":"VLOOKUP($W31,'RR-1C'!$B:$AA,25,FALSE)","v":3517.0154755081421},{"$f":"SMALL('RR-1C'!$AA$13:$AA$27,4)","v":4413.0758721087086}]
[null,5,null,"Refinaria Potiguar Clara Camarão","Rodovia RN 221, KM 25 - Guamaré - RN CEP:59598-000",{"$f":"VLOOKUP($W32,'RR-1C'!$B:$AA,7,FALSE)","v":"CAIEIRAS - SP"},{"$f":"VLOOKUP($W32,'RR-1C'!$B:$AA,8,FALSE)","v":"Montes Claros - MG"},{"$f":"VLOOKUP($W32,'RR-1C'!$B:$AA,9,FALSE)","v":2.7555854755081421},{"$f":"VLOOKUP($W32,'RR-1C'!$B:$AA,10,FALSE)","v":2.7300013717296618},{"$f":"VLOOKUP($W32,'RR-1C'!$B:$AA,11,FALSE)","v":2755.5854755081423},{"$f":"VLOOKUP($W32,'RR-1C'!$B:$AA,12,FALSE)","v":761.43},{"$f":"VLOOKUP($W32,'RR-1C'!$B:$AA,13,FALSE)","v":3517.0154755081421},{"$f":"VLOOKUP($W32,'RR-1C'!$B:$AA,14,FALSE)","v":979},{"$f":"VLOOKUP($W32,'[2]Transporte RR-1C'!$B:$AA,15,FALSE)","v":{"$error":"#N/A"}},{"$f":"VLOOKUP($W32,'RR-1C'!$B:$AA,18,FALSE)","v":274.63},{"$f":"VLOOKUP($W32,'RR-1C'!$B:$AA,19,FALSE)","v":60.28},{"$f":"VLOOKUP($W32,'RR-1C'!$B:$AA,20,FALSE)","v":393.75},{"$f":"VLOOKUP($W32,'RR-1C'!$B:$AA,21,FALSE)","v":728.66},{"$f":"VLOOKUP($W32,'RR-1C'!$B:$AA,22,FALSE)","v":447.6},{"$f":"VLOOKUP($W32,'RR-1C'!$B:$AA,23,FALSE)","v":169.06515580736539},{"$f":"VLOOKUP($W32,'RR-1C'!$B:$AA,24,FALSE)","v":897.72515580736535},{"$f":"VLOOKUP($W32,'RR-1C'!$B:$AA,25,FALSE)","v":3517.0154755081421},{"$f":"SMALL('RR-1C'!$AA$13:$AA$27,5)","v":4414.7406313155079}]
[null,6,null,"Complexo Petroquímico do Rio de Janeiro (Comperj)","Rodovia Estadual RJ-116 - Km 5,2 - Acesso A-1, s/n, Complemento Sambaetiba - Zona Urbana do 4º Distrito de Itaboraí - RJ CEP:24841-203",{"$f":"VLOOKUP($W33,'RR-1C'!$B:$AA,7,FALSE)","v":"ANÁPOLIS - GO"},{"$f":"VLOOKUP($W33,'RR-1C'!$B:$AA,8,FALSE)","v":"Montes Claros - MG"},{"$f":"VLOOKUP($W33,'RR-1C'!$B:$AA,9,FALSE)","v":2.9430018957152044},{"$f":"VLOOKUP($W33,'RR-1C'!$B:$AA,10,FALSE)","v":3.0695857732808691},{"$f":"VLOOKUP($W33,'RR-1C'!$B:$AA,11,FALSE)","v":2943.0018957152042},{"$f":"VLOOKUP($W33,'RR-1C'!$B:$AA,12,FALSE)","v":813.22},{"$f":"VLOOKUP($W33,'RR-1C'!$B:$AA,13,FALSE)","v":3756.2218957152045},{"$f":"VLOOKUP($W33,'RR-1C'!$B:$AA,14,FALSE)","v":796},{"$f":"VLOOKUP($W33,'[2]Transporte RR-1C'!$B:$AA,15,FALSE)","v":{"$error":"#N/A"}},{"$f":"VLOOKUP($W33,'RR-1C'!$B:$AA,18,FALSE)","v":228.33},{"$f":"VLOOKUP($W33,'RR-1C'!$B:$AA,19,FALSE)","v":50.12},{"$f":"VLOOKUP($W33,'RR-1C'!$B:$AA,20,FALSE)","v":327.37},{"$f":"VLOOKUP($W33,'RR-1C'!$B:$AA,21,FALSE)","v":605.81999999999994},{"$f":"VLOOKUP($W33,'RR-1C'!$B:$AA,22,FALSE)","v":195.6},{"$f":"VLOOKUP($W33,'RR-1C'!$B:$AA,23,FALSE)","v":73.881019830028308},{"$f":"VLOOKUP($W33,'RR-1C'!$B:$AA,24,FALSE)","v":679.70101983002826},{"$f":"VLOOKUP($W33,'RR-1C'!$B:$AA,25,FALSE)","v":3756.2218957152045},{"$f":"SMALL('RR-1C'!$AA$13:$AA$27,6)","v":4435.9229155452331}]