{"text_format":"2","workbook":"xlsx","n_sheets":6,"sheets":["ORÇAMENTO","CPU-SERV","CPU-FORNEC","BDI SERV","BDI FORN","CRONOGRAMA"],"not_rendered":{"charts":0,"images":3,"macros":0,"external_links":1,"defined_names":8,"comments":2,"pivot_tables":0},"unopened":[],"bounds":{"document_bytes":16777216,"sheet_cells":100000,"run_cost":"one","rows_first":2000,"rows_last":500,"rows_between":2000,"halvings":0,"cell_chars":16384,"cell_head_chars":4096},"cells_cut":0,"cells_raw":0,"read":"whole","date_system":"1900"}

{"sheet":"ORÇAMENTO","index":0,"n_rows":58,"n_cols":12,"rows_kept":58,"cut":false,"hidden":false,"merged":[[9,14,9,16],[57,1,57,4],[0,0,8,0],[0,4,0,11],[1,4,1,11],[2,4,2,11],[6,1,6,4],[7,1,7,11],[4,2,4,7],[5,2,5,7],[4,8,4,10],[5,8,5,10],[6,8,6,10]]}
["<---- NUMERAR SERVIÇOS PARA CPU",null,null,null,"Ministério do Desenvolvimento Regional"]
[{"$nulls":4},"Companhia de Desenvolvimento dos Vales do São Francisco e do Parnaíba"]
[{"$nulls":4},"1ª Superintendência Regional"]
[]
[null,"OBRA: ","DRENAGEM E  PAVIMENTAÇÃO ASFÁLTICA EM CBUQ - AV. JOANA GOMES DOS SANTOS E ROTATÓRIA (SÃO JOÃO DO PACUÍ / MG)",{"$nulls":5},"BDI Serviços (%):",null,null,{"$f":"'BDI SERV'!E26","v":20.85}]
[null,"DATA:"," ABRIL / 2025",{"$nulls":5},"BDI Diferenciado Serviços (%):",null,null,{"$f":"'BDI FORN'!D31","v":15}]
[null,"PRAZO DE EXECUÇÃO:     180 DIAS",{"$nulls":6},"BDI Fornecimentos (%):",null,null,{"$f":"'BDI FORN'!D31","v":15}]
[null,"PLANILHA DE ORÇAMENTAÇÃO"]
[null,"ITEM","CÓDIGO","FONTE","DISCRIMINAÇÃO","TIPO","UNID.","QUANT.","VR.UNIT.S/BDI","PR. UNIT.C/BDI","C. TOT.S/BDI","P. TOT.C/BDI"]
["A",1,null,null,"SERVIÇOS PRELIMINARES ",{"$nulls":6},{"$f":"SUM(L11:L19)","v":202224.08000000005}]
[1,"1.1","CPU.1","CODEVASF","MOBILIZAÇÃO E DESMOBILIZAÇÃO","SERV","GL",1,{"$f":"VLOOKUP(A11,'CPU-SERV'!A:K,11,0)","v":15342.3},{"$f":"TRUNC(_xlfn.IFS(F11=\"SERV\",I11*(1+$L$5/100),F11=\"SERV DIF\",I11*(1+$L$6/100),F11=\"FORN\",I11*(1+$L$7/100)),2)","v":18541.16},{"$f":"TRUNC(H11*I11,2)","v":15342.3},{"$f":"TRUNC(H11*J11,2)","v":18541.16}]
[2,"1.2","CPU.2","CODEVASF","ADMINISTRAÇÃO LOCAL ","SERV","GL",1,{"$f":"VLOOKUP(A12,'CPU-SERV'!A:K,11,0)","v":115361.96},{"$f":"TRUNC(_xlfn.IFS(F12=\"SERV\",I12*(1+$L$5/100),F12=\"SERV DIF\",I12*(1+$L$6/100),F12=\"FORN\",I12*(1+$L$7/100)),2)","v":139414.92000000001},{"$f":"TRUNC(H12*I12,2)","v":115361.96},{"$f":"TRUNC(H12*J12,2)","v":139414.92000000001}]
[3,"1.3","CPU.3","CODEVASF","CANTEIRO DE OBRAS ","SERV","GL",1,{"$f":"VLOOKUP(A13,'CPU-SERV'!A:K,11,0)","v":13857.3},{"$f":"TRUNC(_xlfn.IFS(F13=\"SERV\",I13*(1+$L$5/100),F13=\"SERV DIF\",I13*(1+$L$6/100),F13=\"FORN\",I13*(1+$L$7/100)),2)","v":16746.54},13857.3,16746.54]
[4,"1.4",103689,"SINAPI","PLACA DE OBRA EM CHAPA DE AÇO GALVANIZADO","SERV","M2",4,{"$f":"VLOOKUP(A14,'CPU-SERV'!A:K,11,0)","v":351.42},{"$f":"TRUNC(_xlfn.IFS(F14=\"SERV\",I14*(1+$L$5/100),F14=\"SERV DIF\",I14*(1+$L$6/100),F14=\"FORN\",I14*(1+$L$7/100)),2)","v":424.69},1405.68,1698.76]
[6,"1.5",78472,"SINAPI","SERVIÇOS TOPOGRÁFICOS PARA PAVIMENTAÇÃO, INCLUSIVE LEVANTAMENTO PLANIALTIMÉTRICO CADASTRAL, GERAÇÃO DE NOTAS DE SERVIÇO, SEÇÕES TRANSVERSAIS E GREIDE, ESTAQUEAMENTO E ACOMPANHAMENTO EXECUTIVO","SERV","M2",14800,{"$f":"VLOOKUP(A15,'CPU-SERV'!A:K,11,0)","v":0.46},{"$f":"TRUNC(_xlfn.IFS(F15=\"SERV\",I15*(1+$L$5/100),F15=\"SERV DIF\",I15*(1+$L$6/100),F15=\"FORN\",I15*(1+$L$7/100)),2)","v":0.55000000000000004},6808,8140]
["6.1","1.6",5501700,"SICRO","DESMATAMENTO, DESTOCAMENTO E LIMPEZA COM ÁRVORES DE DIÂMETRO ATÉ 0,15M","SERV","M2",11000,{"$f":"VLOOKUP(A16,'CPU-SERV'!A:K,11,0)","v":0.53},{"$f":"TRUNC(_xlfn.IFS(F16=\"SERV\",I16*(1+$L$5/100),F16=\"SERV DIF\",I16*(1+$L$6/100),F16=\"FORN\",I16*(1+$L$7/100)),2)","v":0.64},5830,7040]
["6.2","1.7",4915667,"SICRO","REMOÇÃO MECANIZADA DE REVESTIMENTO ASFÁLTICO","SERV","M3",90,{"$f":"VLOOKUP(A17,'CPU-SERV'!A:K,11,0)","v":12.19},{"$f":"TRUNC(_xlfn.IFS(F17=\"SERV\",I17*(1+$L$5/100),F17=\"SERV DIF\",I17*(1+$L$6/100),F17=\"FORN\",I17*(1+$L$7/100)),2)","v":14.73},1097.0999999999999,1325.7]
["6.3","1.8",1619003,"SICRO","DEMOLIÇÃO DE CONCRETO SIMPLES (MEIO FIO, SARJETA, PASSEIOS, ETC.), DE FORMA MECANIZADA","SERV","M3",100,{"$f":"VLOOKUP(A18,'CPU-SERV'!A:K,11,0)","v":60.96},{"$f":"TRUNC(_xlfn.IFS(F18=\"SERV\",I18*(1+$L$5/100),F18=\"SERV DIF\",I18*(1+$L$6/100),F18=\"FORN\",I18*(1+$L$7/100)),2)","v":73.67},6096,7367]
["6.4","1.9",5914351,"SICRO","CARGA, MANOBRA E DESCARGA DE MATERIAL EM GERAL (ENTULHO) EM CAMINHÃO BASCULANTE","SERV","T",600,{"$f":"VLOOKUP(A19,'CPU-SERV'!A:K,11,0)","v":2.69},{"$f":"TRUNC(_xlfn.IFS(F19=\"SERV\",I19*(1+$L$5/100),F19=\"SERV DIF\",I19*(1+$L$6/100),F19=\"FORN\",I19*(1+$L$7/100)),2)","v":3.25},1614,1950]
["B",2,null,null,"TERRAPLANAGEM E PAVIMENTAÇÃO",{"$nulls":6},{"$f":"SUM(L21:L27)","v":682114.15}]
[7,"2.1",5502114,"SICRO","ESCAVAÇÃO, CARGA E TRANSPORTE DE MATERIAL DE 1ª CATEGORIA - DMT 1.000 A 1.200M, CAMINHO DE SERVIÇO EM REVESTIMENTO PRIMÁRIO","SERV","M3",30700,{"$f":"VLOOKUP(A21,'CPU-SERV'!A:K,11,0)","v":6.73},{"$f":"TRUNC(_xlfn.IFS(F21=\"SERV\",I21*(1+$L$5/100),F21=\"SERV DIF\",I21*(1+$L$6/100),F21=\"FORN\",I21*(1+$L$7/100)),2)","v":8.1300000000000008},{"$f":"TRUNC(H21*I21,2)","v":206611},{"$f":"TRUNC(H21*J21,2)","v":249591}]
[8,"2.2",5502978,"SICRO","COMPACTAÇÃO DE ATERROS A 100% DO PROCTOR NORMAL","SERV","M3",29000,{"$f":"VLOOKUP(A22,'CPU-SERV'!A:K,11,0)","v":5.03},{"$f":"TRUNC(_xlfn.IFS(F22=\"SERV\",I22*(1+$L$5/100),F22=\"SERV DIF\",I22*(1+$L$6/100),F22=\"FORN\",I22*(1+$L$7/100)),2)","v":6.07},145870,176030]
[9,"2.3",4011209,"SICRO","REGULARIZAÇÃO E COMPACTAÇÃO DO SUBLEITO ","SERV","M2",11200,{"$f":"VLOOKUP(A23,'CPU-SERV'!A:K,11,0)","v":1.54},{"$f":"TRUNC(_xlfn.IFS(F23=\"SERV\",I23*(1+$L$5/100),F23=\"SERV DIF\",I23*(1+$L$6/100),F23=\"FORN\",I23*(1+$L$7/100)),2)","v":1.86},17248,20832]
[10,"2.4",4011219,"SICRO","EXECUÇÃO E COMPACTAÇÃO DE BASE PARA PAVIMENTAÇÃO COM SOLO ESTABILIZADO GRANULOMETRICAMENTE SEM MISTURA, COM MATERIAL DE JAZIDA - EXCLUSIVE TRANSPORTE","SERV","M3",1700,{"$f":"VLOOKUP(A24,'CPU-SERV'!A:K,11,0)","v":14.78},{"$f":"TRUNC(_xlfn.IFS(F24=\"SERV\",I24*(1+$L$5/100),F24=\"SERV DIF\",I24*(1+$L$6/100),F24=\"FORN\",I24*(1+$L$7/100)),2)","v":17.86},25126,30362]
[12,"2.5",4011352,"SICRO","IMPRIMAÇÃO COM EMULSÃO ASFÁLTICA (EAI)","SERV","M2",11200,{"$f":"VLOOKUP(A25,'CPU-SERV'!A:K,11,0)","v":0.4},{"$f":"TRUNC(_xlfn.IFS(F25=\"SERV\",I25*(1+$L$5/100),F25=\"SERV DIF\",I25*(1+$L$6/100),F25=\"FORN\",I25*(1+$L$7/100)),2)","v":0.48},4480,5376]
[13,"2.6",4011353,"SICRO","PINTURA DE LIGAÇÃO COM EMULSÃO ASFÁLTICA RR-1C","SERV","M2",10200,{"$f":"VLOOKUP(A26,'CPU-SERV'!A:K,11,0)","v":0.27},{"$f":"TRUNC(_xlfn.IFS(F26=\"SERV\",I26*(1+$L$5/100),F26=\"SERV DIF\",I26*(1+$L$6/100),F26=\"FORN\",I26*(1+$L$7/100)),2)","v":0.32},2754,3264]
[14,"2.7",4011463,"SICRO","EXECUÇÃO DE PAVIMENTO COM APLICAÇÃO DE CONCRETO ASFÁLTICO USINADO A QUENTE (CBUQ), CAMADA DE ROLAMENTO - EXCLUSIVE TRANSPORTE","SERV","T",853,{"$f":"VLOOKUP(A27,'CPU-SERV'!A:K,11,0)","v":190.78},{"$f":"TRUNC(_xlfn.IFS(F27=\"SERV\",I27*(1+$L$5/100),F27=\"SERV DIF\",I27*(1+$L$6/100),F27=\"FORN\",I27*(1+$L$7/100)),2)","v":230.55},162735.34,196659.15]
["C",3,null,null,"TRANSPORTE DE MATERIAIS",{"$nulls":6},{"$f":"SUM(L29:L33)","v":234060}]
[15,"3.1",5915321,"SICRO","TRANSPORTE COM CAMINHÃO BASCULANTE, EM RODOVIA PAVIMENTADA","SERV","TXKM",140000,{"$f":"VLOOKUP(A29,'CPU-SERV'!A:K,11,0)","v":0.54},{"$f":"TRUNC(_xlfn.IFS(F29=\"SERV\",I29*(1+$L$5/100),F29=\"SERV DIF\",I29*(1+$L$6/100),F29=\"FORN\",I29*(1+$L$7/100)),2)","v":0.65},{"$f":"TRUNC(H29*I29,2)","v":75600},{"$f":"TRUNC(H29*J29,2)","v":91000}]
[16,"3.2",5915320,"SICRO","TRANSPORTE COM CAMINHÃO BASCULANTE, RODOVIA EM REVESTIMENTO PRIMÁRIO","SERV","TXKM",24000,{"$f":"VLOOKUP(A30,'CPU-SERV'!A:K,11,0)","v":0.72},{"$f":"TRUNC(_xlfn.IFS(F30=\"SERV\",I30*(1+$L$5/100),F30=\"SERV DIF\",I30*(1+$L$6/100),F30=\"FORN\",I30*(1+$L$7/100)),2)","v":0.87},17280,20880]
[17,"3.3",5914434,"SICRO","TRANSPORTE COM CAMINHÃO CARROCERIA 9T, EM VIA URBANA PAVIMENTADA","SERV","TXKM",2000,{"$f":"VLOOKUP(A31,'CPU-SERV'!A:K,11,0)","v":0.74},{"$f":"TRUNC(_xlfn.IFS(F31=\"SERV\",I31*(1+$L$5/100),F31=\"SERV DIF\",I31*(1+$L$6/100),F31=\"FORN\",I31*(1+$L$7/100)),2)","v":0.89},1480,1780]
[18,"3.4",5914612,"SICRO","TRANSPORTE DE MASSA ASFÁLTICA COM CAMINHÃO BASCULANTE, EM VIA URBANA PAVIMENTADA","SERV","TXKM",103000,{"$f":"VLOOKUP(A32,'CPU-SERV'!A:K,11,0)","v":0.93},{"$f":"TRUNC(_xlfn.IFS(F32=\"SERV\",I32*(1+$L$5/100),F32=\"SERV DIF\",I32*(1+$L$6/100),F32=\"FORN\",I32*(1+$L$7/100)),2)","v":1.1200000000000001},95790,115360]
[19,"3.5",5914622,"SICRO","TRANSPORTE COM CAMINHÃO TANQUE DE TRANSPORTE DE MATERIAL ASFÁLTICO DE 30000 L, EM VIA URBANA PAVIMENTADA","SERV","TXKM",2400,{"$f":"VLOOKUP(A33,'CPU-SERV'!A:K,11,0)","v":1.74},{"$f":"TRUNC(_xlfn.IFS(F33=\"SERV\",I33*(1+$L$5/100),F33=\"SERV DIF\",I33*(1+$L$6/100),F33=\"FORN\",I33*(1+$L$7/100)),2)","v":2.1},4176,5040]
["E",4,null,null,"DRENAGEM E OBRAS COMPLEMENTARES",{"$nulls":6},{"$f":"SUM(L35:L50)","v":508023.12}]
[20,"4.1",94267,"SINAPI","GUIA (MEIO-FIO) E SARJETA CONJUGADOS DE CONCRETO, MOLDADA IN LOCO COM EXTRUSORA, 45 CM BASE (15 CM BASE DA GUIA + 30 CM BASE DA SARJETA) X 22 CM ALTURA","SERV","M",1680,{"$f":"VLOOKUP(A35,'CPU-SERV'!A:K,11,0)","v":58.82},{"$f":"TRUNC(_xlfn.IFS(F35=\"SERV\",I35*(1+$L$5/100),F35=\"SERV DIF\",I35*(1+$L$6/100),F35=\"FORN\",I35*(1+$L$7/100)),2)","v":71.08},{"$f":"TRUNC(H35*I35,2)","v":98817.600000000006},{"$f":"TRUNC(H35*J35,2)","v":119414.39999999999}]
[22,"4.2",94263,"SINAPI","GUIA (MEIO-FIO) CONCRETO, MOLDADA IN LOCO EM TRECHO RETO COM EXTRUSORA, 13 CM BASE X 22 CM ALTURA","SERV","M",1320,{"$f":"VLOOKUP(A36,'CPU-SERV'!A:K,11,0)","v":36.39},{"$f":"TRUNC(_xlfn.IFS(F36=\"SERV\",I36*(1+$L$5/100),F36=\"SERV DIF\",I36*(1+$L$6/100),F36=\"FORN\",I36*(1+$L$7/100)),2)","v":43.97},48034.8,58040.4]
[23,"4.3",2003103,"SICRO","ENTRADA PARA DESCIDA D'ÁGUA - AREIA E BRITA COMERCIAIS","SERV","UNID.",12,{"$f":"VLOOKUP(A37,'CPU-SERV'!A:K,11,0)","v":192.82},{"$f":"TRUNC(_xlfn.IFS(F37=\"SERV\",I37*(1+$L$5/100),F37=\"SERV DIF\",I37*(1+$L$6/100),F37=\"FORN\",I37*(1+$L$7/100)),2)","v":233.02},2313.84,2796.24]
[24,"4.4",2003389,"SICRO","DESCIDA D'ÁGUA DE ATERRO TIPO RÁPIDO - AREIA E BRITA COMERCIAIS","SERV","M",110,{"$f":"VLOOKUP(A38,'CPU-SERV'!A:K,11,0)","v":228.56},{"$f":"TRUNC(_xlfn.IFS(F38=\"SERV\",I38*(1+$L$5/100),F38=\"SERV DIF\",I38*(1+$L$6/100),F38=\"FORN\",I38*(1+$L$7/100)),2)","v":276.20999999999998},25141.599999999999,30383.1]
[26,"4.5",2003463,"SICRO","DISSIPADOR DE ENERGIA - AREIA, BRITA E PEDRA DE MÃO COMERCIAIS","SERV","UNID.",12,{"$f":"VLOOKUP(A39,'CPU-SERV'!A:K,11,0)","v":2406.9899999999998},{"$f":"TRUNC(_xlfn.IFS(F39=\"SERV\",I39*(1+$L$5/100),F39=\"SERV DIF\",I39*(1+$L$6/100),F39=\"FORN\",I39*(1+$L$7/100)),2)","v":2908.84},28883.88,34906.080000000002]
[31,"4.6",705241,"SICRO","BOCA PARA BUEIRO SIMPLES CELULAR DE CONCRETO (BSCC), 2,50 X 2,50M - AREIA E BRITA COMERCIAIS","SERV","UNID.",2,{"$f":"VLOOKUP(A40,'CPU-SERV'!A:K,11,0)","v":24252.34},{"$f":"TRUNC(_xlfn.IFS(F40=\"SERV\",I40*(1+$L$5/100),F40=\"SERV DIF\",I40*(1+$L$6/100),F40=\"FORN\",I40*(1+$L$7/100)),2)","v":29308.95},48504.68,58617.9]
[32,"4.7",705197,"SICRO","CORPO DE BUEIRO SIMPLES CELULAR DE CONCRETO (BSCC), 2,50 X 2,50M - MOLDADO NO LOCAL, ALTURA DO ATERRO ATÉ 1,0M - AREIA E BRITA COMERCIAIS","SERV","M",14,{"$f":"VLOOKUP(A41,'CPU-SERV'!A:K,11,0)","v":4475.91},{"$f":"TRUNC(_xlfn.IFS(F41=\"SERV\",I41*(1+$L$5/100),F41=\"SERV DIF\",I41*(1+$L$6/100),F41=\"FORN\",I41*(1+$L$7/100)),2)","v":5409.13},62662.74,75727.820000000007]
[39,"4.8",4805757,"SICRO","ESCAVAÇÃO MECÂNICA DE VALAS EM MATERIAL DE 1ª CATEGORIA","SERV","M3",220,{"$f":"VLOOKUP(A42,'CPU-SERV'!A:K,11,0)","v":6.63},{"$f":"TRUNC(_xlfn.IFS(F42=\"SERV\",I42*(1+$L$5/100),F42=\"SERV DIF\",I42*(1+$L$6/100),F42=\"FORN\",I42*(1+$L$7/100)),2)","v":8.01},1458.6,1762.2]
[40,"4.9",4805756,"SICRO","APILOAMENTO MANUAL DE FUNDO DE VALA","SERV","M2",45,{"$f":"VLOOKUP(A43,'CPU-SERV'!A:K,11,0)","v":4.8},{"$f":"TRUNC(_xlfn.IFS(F43=\"SERV\",I43*(1+$L$5/100),F43=\"SERV DIF\",I43*(1+$L$6/100),F43=\"FORN\",I43*(1+$L$7/100)),2)","v":5.8},216,261]
[41,"4.10",2106292,"SICRO","ESCORAMENTO CONTÍNUO DE VALAS COM TÁBUAS E LONGARINAS, PROFUNDIDADE ATÉ 4,0M - CONFECÇÃO, INSTALAÇÃO E RETIRADA","SERV","M2",98,{"$f":"VLOOKUP(A44,'CPU-SERV'!A:K,11,0)","v":153.53},{"$f":"TRUNC(_xlfn.IFS(F44=\"SERV\",I44*(1+$L$5/100),F44=\"SERV DIF\",I44*(1+$L$6/100),F44=\"FORN\",I44*(1+$L$7/100)),2)","v":185.54},15045.94,18182.919999999998]
[42,"4.11",4815671,"SICRO","REATERRO E COMPACTAÇÃO MANUAL DE VALAS COM SOQUETE VIBRATÓRIO","SERV","M3",100,{"$f":"VLOOKUP(A45,'CPU-SERV'!A:K,11,0)","v":16.68},{"$f":"TRUNC(_xlfn.IFS(F45=\"SERV\",I45*(1+$L$5/100),F45=\"SERV DIF\",I45*(1+$L$6/100),F45=\"FORN\",I45*(1+$L$7/100)),2)","v":20.149999999999999},1668,2015]
[43,"4.12",94990,"SINAPI","EXECUÇÃO DE PASSEIO (CALÇADA) OU PISO DE CONCRETO MOLDADO IN LOCO, ACABAMENTO CONVENCIONAL, NÃO ARMADO","SERV","M3",54,{"$f":"VLOOKUP(A46,'CPU-SERV'!A:K,11,0)","v":720.64},{"$f":"TRUNC(_xlfn.IFS(F46=\"SERV\",I46*(1+$L$5/100),F46=\"SERV DIF\",I46*(1+$L$6/100),F46=\"FORN\",I46*(1+$L$7/100)),2)","v":870.89},38914.559999999998,47028.06]
[46,"4.13",5213440,"SICRO","PLACA DE REGULAMENTAÇÃO EM AÇO, D=60CM - PELÍCULA RETRORREFLETIVA - FORNECIMENTO E INSTALAÇÃO, INCLUSIVE  SUPORTE","SERV","UN.",18,{"$f":"VLOOKUP(A47,'CPU-SERV'!A:K,11,0)","v":259.45999999999998},{"$f":"TRUNC(_xlfn.IFS(F47=\"SERV\",I47*(1+$L$5/100),F47=\"SERV DIF\",I47*(1+$L$6/100),F47=\"FORN\",I47*(1+$L$7/100)),2)","v":313.55},4670.28,5643.9]
[49,"4.14",5213401,"SICRO","PINTURA DE EIXO VIÁRIO SOBRE ASFALTO COM TINTA RETRORREFLETIVA A BASE DE RESINA ACRÍLICA COM MICROESFERAS DE VIDRO, APLICAÇÃO MECÂNICA COM DEMARCADORA AUTOPROPELIDA","SERV","M2",510,{"$f":"VLOOKUP(A48,'CPU-SERV'!A:K,11,0)","v":29.17},{"$f":"TRUNC(_xlfn.IFS(F48=\"SERV\",I48*(1+$L$5/100),F48=\"SERV DIF\",I48*(1+$L$6/100),F48=\"FORN\",I48*(1+$L$7/100)),2)","v":35.25},14876.7,17977.5]
[50,"4.15",5213360,"SICRO","TACHA REFLETIVA EM PLÁSTICO INJETADO - BIDIRECIONAL COM UM PINO - FORNECIMENTO E COLOCAÇÃO","SERV","UNID.",750,{"$f":"VLOOKUP(A49,'CPU-SERV'!A:K,11,0)","v":31.08},{"$f":"TRUNC(_xlfn.IFS(F49=\"SERV\",I49*(1+$L$5/100),F49=\"SERV DIF\",I49*(1+$L$6/100),F49=\"FORN\",I49*(1+$L$7/100)),2)","v":37.56},23310,28170]
[51,"4.16",5213405,"SICRO","PINTURA DE FAIXA DE PEDESTRE OU ZEBRADA TINTA RETRORREFLETIVA A BASE DE RESINA ACRÍLICA COM MICROESFERAS DE VIDRO, APLICAÇÃO MANUAL","SERV","M2",140,{"$f":"VLOOKUP(A50,'CPU-SERV'!A:K,11,0)","v":41.95},{"$f":"TRUNC(_xlfn.IFS(F50=\"SERV\",I50*(1+$L$5/100),F50=\"SERV DIF\",I50*(1+$L$6/100),F50=\"FORN\",I50*(1+$L$7/100)),2)","v":50.69},5873,7096.6]
["F",5,null,null,"FORNECIMENTOS - MATERIAL ASFÁLTICO (BDI DIFERENCIADO)",{"$nulls":6},{"$f":"SUM(L52:L57)","v":373505.89999999997}]
["F1","5.1","CPU.7","CODEVASF","AQUISIÇÃO DE EMULSÃO ASFÁLTICA PARA IMPRIMAÇÃO (EAI) - EXCLUSIVE TRANSPORTE","FORN","T",14,{"$f":"VLOOKUP(A52,'CPU-FORNEC'!A:J,9,0)","v":3532.13},{"$f":"TRUNC(_xlfn.IFS(F52=\"SERV\",I52*(1+$L$5/100),F52=\"SERV DIF\",I52*(1+$L$6/100),F52=\"FORN\",I52*(1+$L$7/100)),2)","v":4061.94},{"$f":"TRUNC(H52*I52,2)","v":49449.82},{"$f":"TRUNC(H52*J52,2)","v":56867.16}]
["F2","5.2","CPU.8","CODEVASF","TRANSPORTE DE EMULSÃO ASFÁLTICA PARA IMPRIMAÇÃO (EAI)","SERV DIF","T",14,{"$f":"VLOOKUP(A53,'CPU-FORNEC'!A:J,9,0)","v":407.31},{"$f":"TRUNC(_xlfn.IFS(F53=\"SERV\",I53*(1+$L$5/100),F53=\"SERV DIF\",I53*(1+$L$6/100),F53=\"FORN\",I53*(1+$L$7/100)),2)","v":468.4},5702.34,6557.6]
["F3","5.3","CPU.9","CODEVASF","AQUISIÇÃO DE EMULSAO ASFALTICA CATIONICA RR-1C - EXCLUSIVE TRANSPORTE","FORN","T",5,{"$f":"VLOOKUP(A54,'CPU-FORNEC'!A:J,9,0)","v":3480.79},{"$f":"TRUNC(_xlfn.IFS(F54=\"SERV\",I54*(1+$L$5/100),F54=\"SERV DIF\",I54*(1+$L$6/100),F54=\"FORN\",I54*(1+$L$7/100)),2)","v":4002.9},17403.95,20014.5]
["F4","5.4","CPU.10","CODEVASF","TRANSPORTE DE EMULSÃO ASFÁLTICA CATIONICA RR-1C","SERV DIF","T",5,{"$f":"VLOOKUP(A55,'CPU-FORNEC'!A:J,9,0)","v":496.49},{"$f":"TRUNC(_xlfn.IFS(F55=\"SERV\",I55*(1+$L$5/100),F55=\"SERV DIF\",I55*(1+$L$6/100),F55=\"FORN\",I55*(1+$L$7/100)),2)","v":570.96},2482.4499999999998,2854.8]
["F5","5.5","CPU.11","CODEVASF","AQUISIÇÃO DE CONCRETO ASFÁLTICO DE PETRÓLEO - CAP 50/70 - EXCLUSIVE TRANSPORTE","FORN","T",48,{"$f":"VLOOKUP(A56,'CPU-FORNEC'!A:J,9,0)","v":4815.2},{"$f":"TRUNC(_xlfn.IFS(F56=\"SERV\",I56*(1+$L$5/100),F56=\"SERV DIF\",I56*(1+$L$6/100),F56=\"FORN\",I56*(1+$L$7/100)),2)","v":5537.48},231129.60000000001,265799.03999999998]
["F6","5.6","CPU.12","CODEVASF","TRANSPORTE DE CONCRETO ASFÁLTICO DE PETRÓLEO - CAP 50/70","SERV DIF","T",48,{"$f":"VLOOKUP(A57,'CPU-FORNEC'!A:J,9,0)","v":387.92},{"$f":"TRUNC(_xlfn.IFS(F57=\"SERV\",I57*(1+$L$5/100),F57=\"SERV DIF\",I57*(1+$L$6/100),F57=\"FORN\",I57*(1+$L$7/100)),2)","v":446.1},18620.16,21412.799999999999]
[null,"TOTAL GERAL DA OBRA COM BDI ",{"$nulls":9},{"$f":"SUM(L10,L20,L28,L34,L51)","v":1999927.25}]

{"sheet":"CPU-SERV","index":1,"n_rows":1558,"n_cols":11,"rows_kept":1558,"cut":false,"hidden":false,"merged":[[357,5,357,7],[321,0,358,0],[356,3,356,7],[317,3,317,7],[318,5,318,7],[331,7,331,9],[334,3,334,7],[335,3,335,7],[336,3,336,7],[339,7,339,9],[342,3,342,7],[343,7,343,9],[346,3,346,7],[348,8,348,9],[351,3,351,7],[352,1,353,2],[352,3,353,3],[352,4,353,4],[352,5,352,7],[352,9,353,9],[274,3,275,3],[274,4,275,4],[274,5,274,7],[274,9,275,9],[278,3,278,7],[279,5,279,7],[282,0,319,0],[283,2,283,9],[284,1,285,3],[284,4,284,5],[285,4,285,5],[286,2,286,7],[286,8,286,9],[287,1,288,2],[287,3,288,3],[287,4,287,5],[287,6,287,7],[292,7,292,9],[295,3,295,7],[296,3,296,7],[297,3,297,7],[300,7,300,9],[303,3,303,7],[304,7,304,9],[307,3,307,7],[309,8,309,9],[312,3,312,7],[313,1,314,2],[313,3,314,3],[313,4,314,4],[313,5,313,7],[313,9,314,9],[229,3,229,7],[231,8,231,9],[234,3,234,7],[235,1,236,2],[235,3,236,3],[235,4,236,4],[235,5,235,7],[235,9,236,9],[239,3,239,7],[240,5,240,7],[243,0,280,0],[244,2,244,9],[245,1,246,3],[245,4,245,5],[246,4,246,5],[247,2,247,7],[247,8,247,9],[248,1,249,2],[248,3,249,3],[248,4,248,5],[248,6,248,7],[253,7,253,9],[256,3,256,7],[257,3,257,7],[258,3,258,7],[261,7,261,9],[264,3,264,7],[265,7,265,9],[268,3,268,7],[270,8,270,9],[273,3,273,7],[274,1,275,2],[738,0,775,0],[739,2,739,9],[740,1,741,3],[740,4,740,5],[741,4,741,5],[742,2,742,7],[742,8,742,9],[743,1,744,2],[743,3,744,3],[743,4,743,5],[743,6,743,7],[748,7,748,9],[751,3,751,7],[752,3,752,7],[753,3,753,7],[756,7,756,9],[759,3,759,7],[760,7,760,9],[763,3,763,7],[765,8,765,9],[768,3,768,7],[769,1,770,2],[769,3,770,3],[769,4,770,4],[769,5,769,7],[769,9,770,9],[773,3,773,7],[774,5,774,7],[204,0,241,0],[205,2,205,9],[22,7,22,9],[25,3,25,7],[27,8,27,9],[21,3,21,7],[4,2,4,7],[4,8,4,9],[5,1,6,2],[5,3,6,3],[5,4,5,5],[5,6,5,7],[645,0,697,0],[646,2,646,9],[647,1,648,3],[647,4,647,5],[648,4,648,5],[649,2,649,7],[649,8,649,9],[650,1,651,2],[650,3,651,3],[650,4,650,5],[650,6,650,7],[658,7,658,9],[660,3,660,7],[661,3,661,7],[662,3,662,7],[665,7,665,9],[674,3,674,7],[39,0,81,0],[40,2,40,9],[206,1,207,3],[206,4,206,5],[44,3,45,3],[44,4,44,5],[44,6,44,7],[49,7,49,9],[55,3,55,7],[56,3,56,7],[41,1,42,3],[41,4,41,5],[42,4,42,5],[43,2,43,7],[43,8,43,9],[44,1,45,2],[0,0,37,0],[3,4,3,5],[2,4,2,5],[1,2,1,9],[2,1,3,3],[31,3,32,3],[31,4,32,4],[31,5,31,7],[31,9,32,9],[35,3,35,7],[36,5,36,7],[10,7,10,9],[13,3,13,7],[14,3,14,7],[15,3,15,7],[18,7,18,9],[30,3,30,7],[31,1,32,2],[97,3,97,7],[88,3,89,3],[88,4,88,5],[88,6,88,7],[79,3,79,7],[80,5,80,7],[85,4,85,5],[74,3,74,7],[75,1,76,2],[75,3,76,3],[75,4,76,4],[75,5,75,7],[75,9,76,9],[57,3,57,7],[60,7,60,9],[63,3,63,7],[64,7,64,9],[69,3,69,7],[71,8,71,9],[119,5,119,7],[122,0,161,0],[123,2,123,9],[124,1,125,3],[124,4,124,5],[125,4,125,5],[126,2,126,7],[126,8,126,9],[159,3,159,7],[160,5,160,7],[114,1,115,2],[114,3,115,3],[114,4,115,4],[114,5,114,7],[114,9,115,9],[118,3,118,7],[93,7,93,9],[98,3,98,7],[101,7,101,9],[104,3,104,7],[105,7,105,9],[108,3,108,7],[83,0,120,0],[84,2,84,9],[85,1,86,3],[86,4,86,5],[87,2,87,7],[87,8,87,9],[88,1,89,2],[110,8,110,9],[113,3,113,7],[96,3,96,7],[136,3,136,7],[137,3,137,7],[140,7,140,9],[145,3,145,7],[146,7,146,9],[149,3,149,7],[127,1,128,2],[127,3,128,3],[127,4,127,5],[127,6,127,7],[132,7,132,9],[135,3,135,7],[163,0,202,0],[164,2,164,9],[165,1,166,3],[165,4,165,5],[166,4,166,5],[167,2,167,7],[200,3,200,7],[201,5,201,7],[151,8,151,9],[154,3,154,7],[155,1,156,2],[155,3,156,3],[155,4,156,4],[155,5,155,7],[155,9,156,9],[178,3,178,7],[179,3,179,7],[180,3,180,7],[183,7,183,9],[186,3,186,7],[187,7,187,9],[167,8,167,9],[168,1,169,2],[168,3,169,3],[168,4,168,5],[168,6,168,7],[173,7,173,9],[322,2,322,9],[323,1,324,3],[323,4,323,5],[324,4,324,5],[325,2,325,7],[325,8,325,9],[207,4,207,5],[208,2,208,7],[208,8,208,9],[209,1,210,2],[209,3,210,3],[209,4,209,5],[209,6,209,7],[214,7,214,9],[217,3,217,7],[218,3,218,7],[219,3,219,7],[222,7,222,9],[225,3,225,7],[226,7,226,9],[360,0,397,0],[361,2,361,9],[362,1,363,3],[362,4,362,5],[363,4,363,5],[364,2,364,7],[190,3,190,7],[192,8,192,9],[195,3,195,7],[196,1,197,2],[196,3,197,3],[196,4,197,4],[196,5,196,7],[196,9,197,9],[385,3,385,7],[387,8,387,9],[390,3,390,7],[391,1,392,2],[391,3,392,3],[391,4,392,4],[391,5,391,7],[391,9,392,9],[373,3,373,7],[374,3,374,7],[364,8,364,9],[365,1,366,2],[365,3,366,3],[365,4,365,5],[326,1,327,2],[326,3,327,3],[326,4,326,5],[326,6,326,7],[365,6,365,7],[370,7,370,9],[415,3,415,7],[416,3,416,7],[417,3,417,7],[420,7,420,9],[423,3,423,7],[424,7,424,9],[403,8,403,9],[404,1,405,2],[404,3,405,3],[404,4,404,5],[404,6,404,7],[412,7,412,9],[395,3,395,7],[396,5,396,7],[375,3,375,7],[378,7,378,9],[381,3,381,7],[382,7,382,9],[400,2,400,9],[401,1,402,3],[401,4,401,5],[402,4,402,5],[403,2,403,7],[441,0,482,0],[442,2,442,9],[443,1,444,3],[443,4,443,5],[444,4,444,5],[445,2,445,7],[427,3,427,7],[429,8,429,9],[432,3,432,7],[433,1,434,2],[433,3,434,3],[433,4,434,4],[433,5,433,7],[433,9,434,9],[470,3,470,7],[472,8,472,9],[475,3,475,7],[476,1,477,2],[476,3,477,3],[476,4,477,4],[476,5,476,7],[476,9,477,9],[458,3,458,7],[459,3,459,7],[445,8,445,9],[446,1,447,2],[446,3,447,3],[446,4,446,5],[446,6,446,7],[399,0,439,0],[437,3,437,7],[438,5,438,7],[455,7,455,9],[501,3,501,7],[502,3,502,7],[503,3,503,7],[506,7,506,9],[509,3,509,7],[510,7,510,9],[488,8,488,9],[489,1,490,2],[489,3,490,3],[489,4,489,5],[489,6,489,7],[498,7,498,9],[480,3,480,7],[481,5,481,7],[460,3,460,7],[463,7,463,9],[466,3,466,7],[467,7,467,9],[485,2,485,9],[486,1,487,3],[486,4,486,5],[487,4,487,5],[488,2,488,7],[527,0,564,0],[528,2,528,9],[529,1,530,3],[529,4,529,5],[530,4,530,5],[531,2,531,7],[562,3,562,7],[563,5,563,7],[546,7,546,8],[513,3,513,7],[515,8,515,9],[518,3,518,7],[519,1,520,2],[519,3,520,3],[519,4,520,4],[519,5,519,7],[519,9,520,9],[484,0,525,0],[523,3,523,7],[524,5,524,7],[579,3,579,7],[570,8,570,9],[571,1,572,2],[571,3,572,3],[571,4,571,5],[540,3,540,7],[541,3,541,7],[542,3,542,7],[545,7,545,9],[548,3,548,7],[549,7,549,9],[531,8,531,9],[532,1,533,2],[532,3,533,3],[532,4,532,5],[532,6,532,7],[537,7,537,9],[631,3,631,7],[605,0,643,0],[606,2,606,9],[607,1,608,3],[607,4,607,5],[608,4,608,5],[609,2,609,7],[641,3,641,7],[642,5,642,7],[585,7,585,8],[566,0,603,0],[567,2,567,9],[568,1,569,3],[568,4,568,5],[569,4,569,5],[570,2,570,7],[552,3,552,7],[554,8,554,9],[557,3,557,7],[558,1,559,2],[558,3,559,3],[558,4,559,4],[558,5,558,7],[558,9,559,9],[591,3,591,7],[593,8,593,9],[596,3,596,7],[597,1,598,2],[597,3,598,3],[597,4,598,4],[597,5,597,7],[597,9,598,9],[670,7,670,8],[696,5,696,7],[724,3,724,7],[726,8,726,9],[729,3,729,7],[730,1,731,2],[730,3,731,3],[730,4,731,4],[730,5,730,7],[730,9,731,9],[571,6,571,7],[576,7,576,9],[619,3,619,7],[620,3,620,7],[621,3,621,7],[624,7,624,9],[627,3,627,7],[628,7,628,9],[609,8,609,9],[610,1,611,2],[610,3,611,3],[610,4,610,5],[610,6,610,7],[616,7,616,9],[601,3,601,7],[602,5,602,7],[580,3,580,7],[581,3,581,7],[584,7,584,9],[587,3,587,7],[588,7,588,9],[675,7,675,9],[717,7,717,9],[720,3,720,7],[721,7,721,9],[703,8,703,9],[704,1,705,2],[704,3,705,3],[704,4,704,5],[704,6,704,7],[709,7,709,9],[790,3,790,7],[791,3,791,7],[792,3,792,7],[795,7,795,9],[798,3,798,7],[703,2,703,7],[633,8,633,9],[636,3,636,7],[637,1,638,2],[637,3,638,3],[637,4,638,4],[637,5,637,7],[637,9,638,9],[687,1,688,2],[687,3,688,3],[687,4,688,4],[687,5,687,7],[687,9,688,9],[695,3,695,7],[677,3,677,7],[679,8,679,9],[686,3,686,7],[712,3,712,7],[799,7,799,9],[781,8,781,9],[782,1,783,2],[782,3,783,3],[782,4,782,5],[782,6,782,7],[787,7,787,9],[734,3,734,7],[735,5,735,7],[777,0,814,0],[778,2,778,9],[779,1,780,3],[779,4,779,5],[780,4,780,5],[781,2,781,7],[812,3,812,7],[813,5,813,7],[699,0,736,0],[700,2,700,9],[701,1,702,3],[701,4,701,5],[702,4,702,5],[802,3,802,7],[804,8,804,9],[807,3,807,7],[808,1,809,2],[808,3,809,3],[808,4,809,4],[808,5,808,7],[808,9,809,9],[713,3,713,7],[714,3,714,7],[841,3,841,7],[843,8,843,9],[846,3,846,7],[847,1,848,2],[847,3,848,3],[847,4,848,4],[847,5,847,7],[847,9,848,9],[829,3,829,7],[830,3,830,7],[831,3,831,7],[834,7,834,9],[837,3,837,7],[838,7,838,9],[820,8,820,9],[821,1,822,2],[821,3,822,3],[821,4,821,5],[821,6,821,7],[826,7,826,9],[868,3,868,7],[869,3,869,7],[870,3,870,7],[873,7,873,9],[876,3,876,7],[877,7,877,9],[859,8,859,9],[860,1,861,2],[860,3,861,3],[860,4,860,5],[860,6,860,7],[865,7,865,9],[851,3,851,7],[852,5,852,7],[855,0,892,0],[856,2,856,9],[857,1,858,3],[857,4,857,5],[858,4,858,5],[859,2,859,7],[890,3,890,7],[891,5,891,7],[816,0,853,0],[817,2,817,9],[818,1,819,3],[818,4,818,5],[819,4,819,5],[820,2,820,7],[880,3,880,7],[882,8,882,9],[885,3,885,7],[886,1,887,2],[886,3,887,3],[886,4,887,4],[886,5,886,7],[886,9,887,9],[920,3,920,7],[922,8,922,9],[925,3,925,7],[926,1,927,2],[926,3,927,3],[926,4,927,4],[926,5,926,7],[926,9,927,9],[908,3,908,7],[909,3,909,7],[910,3,910,7],[913,7,913,9],[916,3,916,7],[917,7,917,9],[898,8,898,9],[899,1,900,2],[899,3,900,3],[899,4,899,5],[899,6,899,7],[904,7,904,9],[930,3,930,7],[931,5,931,7],[894,0,932,0],[895,2,895,9],[896,1,897,3],[896,4,896,5],[897,4,897,5],[898,2,898,7],[960,3,960,7],[962,8,962,9],[965,3,965,7],[966,1,967,2],[966,3,967,3],[966,4,967,4],[966,5,966,7],[966,9,967,9],[948,3,948,7],[949,3,949,7],[950,3,950,7],[953,7,953,9],[956,3,956,7],[957,7,957,9],[938,8,938,9],[939,1,940,2],[939,3,940,3],[939,4,939,5],[939,6,939,7],[944,7,944,9],[987,3,987,7],[988,3,988,7],[989,3,989,7],[992,7,992,9],[995,3,995,7],[996,7,996,9],[978,8,978,9],[979,1,980,2],[979,3,980,3],[979,4,979,5],[979,6,979,7],[984,7,984,9],[970,3,970,7],[971,5,971,7],[974,0,1013,0],[975,2,975,9],[976,1,977,3],[976,4,976,5],[977,4,977,5],[978,2,978,7],[1011,3,1011,7],[1012,5,1012,7],[934,0,972,0],[935,2,935,9],[936,1,937,3],[936,4,936,5],[937,4,937,5],[938,2,938,7],[1001,3,1001,7],[1003,8,1003,9],[1006,3,1006,7],[1007,1,1008,2],[1007,3,1008,3],[1007,4,1008,4],[1007,5,1007,7],[1007,9,1008,9],[1043,3,1043,7],[1045,8,1045,9],[1048,3,1048,7],[1049,1,1050,2],[1049,3,1050,3],[1049,4,1050,4],[1049,5,1049,7],[1049,9,1050,9],[1028,3,1028,7],[1029,3,1029,7],[1030,3,1030,7],[1033,7,1033,9],[1036,3,1036,7],[1037,7,1037,9],[1019,8,1019,9],[1020,1,1021,2],[1020,3,1021,3],[1020,4,1020,5],[1020,6,1020,7],[1025,7,1025,9],[1053,3,1053,7],[1054,5,1054,7],[1015,0,1055,0],[1016,2,1016,9],[1017,1,1018,3],[1017,4,1017,5],[1018,4,1018,5],[1019,2,1019,7],[1084,3,1084,7],[1086,8,1086,9],[1089,3,1089,7],[1090,1,1091,2],[1090,3,1091,3],[1090,4,1091,4],[1090,5,1090,7],[1090,9,1091,9],[1070,3,1070,7],[1071,3,1071,7],[1072,3,1072,7],[1075,7,1075,9],[1078,3,1078,7],[1079,7,1079,9],[1061,8,1061,9],[1062,1,1063,2],[1062,3,1063,3],[1062,4,1062,5],[1062,6,1062,7],[1067,7,1067,9],[1094,3,1094,7],[1095,5,1095,7],[1057,0,1096,0],[1058,2,1058,9],[1059,1,1060,3],[1059,4,1059,5],[1060,4,1060,5],[1061,2,1061,7],[1198,3,1198,7],[1199,3,1199,7],[1200,3,1200,7],[1203,7,1203,9],[1206,3,1206,7],[1207,7,1207,9],[1189,8,1189,9],[1190,1,1191,2],[1190,3,1191,3],[1190,4,1190,5],[1190,6,1190,7],[1195,7,1195,9],[1185,0,1222,0],[1186,2,1186,9],[1187,1,1188,3],[1187,4,1187,5],[1188,4,1188,5],[1189,2,1189,7],[1220,3,1220,7],[1221,5,1221,7],[1210,3,1210,7],[1212,8,1212,9],[1215,3,1215,7],[1216,1,1217,2],[1216,3,1217,3],[1216,4,1217,4],[1216,5,1216,7],[1216,9,1217,9],[1249,3,1249,7],[1251,8,1251,9],[1254,3,1254,7],[1255,1,1256,2],[1255,3,1256,3],[1255,4,1256,4],[1255,5,1255,7],[1255,9,1256,9],[1237,3,1237,7],[1238,3,1238,7],[1239,3,1239,7],[1242,7,1242,9],[1245,3,1245,7],[1246,7,1246,9],[1228,8,1228,9],[1229,1,1230,2],[1229,3,1230,3],[1229,4,1229,5],[1229,6,1229,7],[1234,7,1234,9],[1276,3,1276,7],[1277,3,1277,7],[1278,3,1278,7],[1281,7,1281,9],[1285,3,1285,7],[1286,7,1286,9],[1267,8,1267,9],[1268,1,1269,2],[1268,3,1269,3],[1268,4,1268,5],[1268,6,1268,7],[1273,7,1273,9],[1259,3,1259,7],[1260,5,1260,7],[1263,0,1303,0],[1264,2,1264,9],[1265,1,1266,3],[1265,4,1265,5],[1266,4,1266,5],[1267,2,1267,7],[1301,3,1301,7],[1302,5,1302,7],[1224,0,1261,0],[1225,2,1225,9],[1226,1,1227,3],[1226,4,1226,5],[1227,4,1227,5],[1228,2,1228,7],[1289,3,1289,7],[1291,8,1291,9],[1295,3,1295,7],[1296,1,1297,2],[1296,3,1297,3],[1296,4,1297,4],[1296,5,1296,7],[1296,9,1297,9],[1330,3,1330,7],[1332,8,1332,9],[1335,3,1335,7],[1336,1,1337,2],[1336,3,1337,3],[1336,4,1337,4],[1336,5,1336,7],[1336,9,1337,9],[1318,3,1318,7],[1319,3,1319,7],[1320,3,1320,7],[1323,7,1323,9],[1326,3,1326,7],[1327,7,1327,9],[1309,8,1309,9],[1310,1,1311,2],[1310,3,1311,3],[1310,4,1310,5],[1310,6,1310,7],[1315,7,1315,9],[1358,3,1358,7],[1359,3,1359,7],[1360,3,1360,7],[1363,7,1363,9],[1369,3,1369,7],[1370,7,1370,9],[1348,8,1348,9],[1349,1,1350,2],[1349,3,1350,3],[1349,4,1349,5],[1349,6,1349,7],[1354,7,1354,9],[1340,3,1340,7],[1341,5,1341,7],[1344,0,1385,0],[1345,2,1345,9],[1346,1,1347,3],[1346,4,1346,5],[1347,4,1347,5],[1348,2,1348,7],[1383,3,1383,7],[1384,5,1384,7],[1305,0,1342,0],[1306,2,1306,9],[1307,1,1308,3],[1307,4,1307,5],[1308,4,1308,5],[1309,2,1309,7],[1373,3,1373,7],[1375,8,1375,9],[1378,3,1378,7],[1379,1,1380,2],[1429,4,1429,5],[1430,2,1430,7],[1468,3,1468,7],[1469,5,1469,7],[1454,3,1454,7],[1456,8,1456,9],[1461,3,1461,7],[1462,1,1463,2],[1379,3,1380,3],[1379,4,1380,4],[1379,5,1379,7],[1379,9,1380,9],[1412,3,1412,7],[1414,8,1414,9],[1417,3,1417,7],[1418,1,1419,2],[1418,3,1419,3],[1418,4,1419,4],[1418,5,1418,7],[1418,9,1419,9],[1400,3,1400,7],[1401,3,1401,7],[1402,3,1402,7],[1405,7,1405,9],[1408,3,1408,7],[1409,7,1409,9],[1391,8,1391,9],[1392,1,1393,2],[1392,3,1393,3],[1392,4,1392,5],[1392,6,1392,7],[1397,7,1397,9],[1495,3,1495,7],[1496,7,1496,9],[1476,8,1476,9],[1477,1,1478,2],[1477,3,1478,3],[1477,4,1477,5],[1477,6,1477,7],[1483,7,1483,9],[1422,3,1422,7],[1423,5,1423,7],[1387,0,1424,0],[1388,2,1388,9],[1389,1,1390,3],[1389,4,1389,5],[1390,4,1390,5],[1391,2,1391,7],[1439,3,1439,7],[1440,3,1440,7],[1441,3,1441,7],[1444,7,1444,9],[1450,3,1450,7],[1451,7,1451,9],[1430,8,1430,9],[1431,1,1432,2],[1431,3,1432,3],[1431,4,1431,5],[1431,6,1431,7],[1436,7,1436,9],[1426,0,1470,0],[1427,2,1427,9],[1428,1,1429,3],[1428,4,1428,5],[1509,3,1509,7],[1510,5,1510,7],[1513,0,1557,0],[1514,2,1514,9],[1515,1,1516,3],[1515,4,1515,5],[1516,4,1516,5],[1517,2,1517,7],[1555,3,1555,7],[1556,5,1556,7],[1472,0,1511,0],[1473,2,1473,9],[1474,1,1475,3],[1474,4,1474,5],[1475,4,1475,5],[1476,2,1476,7],[1462,3,1463,3],[1462,4,1463,4],[1462,5,1462,7],[1462,9,1463,9],[1499,3,1499,7],[1501,8,1501,9],[1504,3,1504,7],[1505,1,1506,2],[1505,3,1506,3],[1505,4,1506,4],[1505,5,1505,7],[1505,9,1506,9],[1486,3,1486,7],[1487,3,1487,7],[1488,3,1488,7],[1491,7,1491,9],[1541,3,1541,7],[1543,8,1543,9],[1548,3,1548,7],[1549,1,1550,2],[1549,3,1550,3],[1549,4,1550,4],[1549,5,1549,7],[1549,9,1550,9],[1526,3,1526,7]],"merged_total":1067,"flags":["merged_cut"]}
[1,"1ª/GRD",{"$nulls":8},{"$f":"J37","v":15342.3}]
[null,"OBRA:","DRENAGEM E  PAVIMENTAÇÃO ASFÁLTICA EM CBUQ - AV. JOANA GOMES DOS SANTOS E ROTATÓRIA (SÃO JOÃO DO PACUÍ / MG)"]
[null,"Custo Unitário de Referência",null,null,"Minas Gerais"]
[{"$nulls":4}," Janeiro/2025 ",null,null,"Produção da equipe ",0.5,{"$f":"VLOOKUP(A1,ORÇAMENTO!$A$10:$L$58,7,1)","v":"GL"}]
[null,"CPU.1","MOBILIZAÇÃO E DESMOBILIZAÇÃO",{"$nulls":5},"Valores em reais (R$)"]
[null,"A - EQUIPAMENTOS",null,"Quantidade","Utilização",null,"Custo Horário",null,null,"Custo"]
[{"$nulls":4},"Operativa","Improdutiva","Produtivo","Improdutivo",null,"Horário Total"]
[null,"E9687","Caminhão carroceria com capacidade de 5 t - 115 kW",8,0.6,0.4,146.88079999999999,57.423099999999998,null,{"$f":"D8*(E8*G8+F8*H8)","v":888.78175999999996}]
[null,"E9575","Caminhão basculante com caçamba estanque com capacidade de 14 m³ - 210 kW",16,1,0,309.83940000000001,90.412199999999999,null,{"$f":"D9*(E9*G9+F9*H9)","v":4957.4304000000002}]
[{"$nulls":7},"Custo horário total de equipamentos",null,{"$f":"SUM(J8:J9)","v":5846.21216}]
[null,"B - MÃO DE OBRA",null,"Quantidade","Unidade",null,"Custo Horário","Custo Horário Total"]
[null,"P9824","Servente",8,"h",null,21.3355,null,null,{"$f":"D12*G12","v":170.684}]
[{"$nulls":9},{"$f":"D13*G13","v":0}]
[null,null,null,"Custo horário total de mão de obra",{"$nulls":5},{"$f":"SUM(J12:J13)","v":170.684}]
[null,null,null,"Custo horário total de execução",{"$nulls":5},{"$f":"J10+J14","v":6016.8961600000002}]
[null,null,null,"Custo unitário de execução",{"$nulls":5},{"$f":"J15/I4","v":12033.79232}]
[{"$nulls":7},"Custo do FIC",null,0]
[{"$nulls":7},"Custo do FIT",null,0]
[null,"C - MATERIAL",null,"Quantidade","Unidade",null,"Preço Unitário","Custo Unitário"]
[null,"-",0,null,0,null,0,null,null,{"$f":"D20*G20","v":0}]
[null,"-",0,null,0,null,0,null,null,{"$f":"D21*G21","v":0}]
[null,null,null,"Custo unitário total de material",{"$nulls":5},{"$f":"SUM(J20:J21)","v":0}]
[null,"D - ATIVIDADES AUXILIARES",null,"Quantidade","Unidade",null,"Custo Unitário","Custo Unitário"]
[null,5914640,"Transporte com cavalo mecânico com semirreboque com capacidade de 30 t - rodovia pavimentada",5804.4000000000005,"tkm",null,0.56999999999999995,null,null,{"$f":"D24*G24","v":3308.5079999999998}]
[null,"-",0,0,0,null,0,null,null,{"$f":"D25*G25","v":0}]
[null,null,null,"Custo total de atividades auxiliares",{"$nulls":5},{"$f":"SUM(J24:J25)","v":3308.5079999999998}]
[{"$nulls":7},"Subtotal",null,{"$f":"J16+J22+J26+J17+J18","v":15342.30032}]
[null,"E - TEMPO FIXO",null,"Código","Quantidade","Unidade",null,"Custo Unitário","Custo Unitário"]
[null,"-",0,"-",null,0,null,0,null,{"$f":"ROUNDDOWN(E29*H29,4)","v":0}]
[null,"-",0,"-",null,0,null,0,null,{"$f":"ROUNDDOWN(E30*H30,4)","v":0}]
[null,null,null,"Custo unitário total de tempo fixo",{"$nulls":5},{"$f":"SUM(J29:J30)","v":0}]
[null,"F - MOMENTO DE TRANSPORTE",null,"Quantidade","Unidade","DMT",null,null,null,"Custo Unitário"]
[{"$nulls":5},"LN","RP","P"]
[null,"-",0,null,"tkm"]
[null,"-",0,null,"tkm"]
[null,null,null,"Custo unitário total de transporte"]
[{"$nulls":5},"Custo unitário direto total",null,null,null,{"$f":"TRUNC(J27+J31,2)","v":15342.3}]
[null,"Obs."]
[]
[{"$f":"A1+1","v":2},"1ª/GRD",{"$nulls":8},{"$f":"J81","v":115361.96}]
[null,"OBRA:","DRENAGEM E  PAVIMENTAÇÃO ASFÁLTICA EM CBUQ - AV. JOANA GOMES DOS SANTOS E ROTATÓRIA (SÃO JOÃO DO PACUÍ / MG)"]
[null,"Custo Unitário de Referência",null,null,"Minas Gerais"]
[{"$nulls":4}," Janeiro/2025 ",null,null,"Produção da equipe ",0.2,{"$f":"VLOOKUP(A40,ORÇAMENTO!$A$10:$L$58,7,1)","v":"GL"}]
[null,"CPU.2","ADMINISTRAÇÃO LOCAL ",{"$nulls":5},"Valores em reais (R$)"]
[null,"A - EQUIPAMENTOS",null,"Quantidade","Utilização",null,"Custo Horário",null,null,"Custo"]
[{"$nulls":4},"Operativa","Improdutiva","Produtivo","Improdutivo",null,"Horário Total"]
[null,"-",0,null,null,null,0,0,null,{"$f":"D47*(E47*G47+F47*H47)","v":0}]
[null,"-",0,null,null,null,0,0,null,{"$f":"D48*(E48*G48+F48*H48)","v":0}]
[{"$nulls":7},"Custo horário total de equipamentos",null,{"$f":"SUM(J47:J48)","v":0}]
[null,"B - MÃO DE OBRA",null,"Quantidade","Unidade",null,"Custo Horário","Custo Horário Total"]
[null,"P9812","Engenheiro",0.20195045889040733,"mês",null,26055.551500000001,null,null,{"$f":"D51*G51","v":5261.9305820676409}]
[null,"P9840","Encarregado geral",1,"mês",null,10654.6548,null,null,{"$f":"D52*G52","v":10654.6548}]
[null,"P9876","Técnico de segurança do trabalho",0.5,"mês",null,6276.4316800000006,null,null,3138.2158400000003]
[null,"P9858","Laboratorista",0.5,"mês",null,5101.8165600000002,null,null,2550.9082800000001]
[null,"P9806","Auxiliar administrativo",0.25,"mês",null,3577.6424800000004,null,null,894.41062000000011]
[null,null,null,"Custo horário total de mão de obra",{"$nulls":5},{"$f":"SUM(J51:J55)","v":22500.120122067641}]
[null,null,null,"Custo horário total de execução",{"$nulls":5},{"$f":"J49+J56","v":22500.120122067641}]
[null,null,null,"Custo unitário de execução",{"$nulls":5},{"$f":"J57/I43","v":112500.6006103382}]
[{"$nulls":7},"Custo do FIC",null,"-"]
[{"$nulls":7},"Custo do FIT",null,"-"]
[null,"C - MATERIAL",null,"Quantidade","Unidade",null,"Preço Unitário","Custo Unitário"]
[null,"-",0,0,0,null,0,null,null,{"$f":"D62*G62","v":0}]
[null,"-",0,0,0,null,0,null,null,0]
[null,null,null,"Custo unitário total de material",{"$nulls":5},{"$f":"SUM(J62:J63)","v":0}]
[null,"D - ATIVIDADES AUXILIARES",null,"Quantidade","Unidade",null,"Custo Unitário","Custo Unitário"]
[null,14250,"Energia Elétrica",360,"kwh",null,0.95,null,null,{"$f":"D66*G66","v":342}]
[null,44480,"Tarifa A - Água e Esgoto",24,"m³",null,17.97,null,null,{"$f":"D67*G67","v":431.28}]
[null,5212560,"Placa de advertência para sinalização de obras montada em suporte metálico móvel, lado 1,00 m - utilização de 600 ciclos - fornecimento, 01 implantação e 01 retirada diária",352,"un.dia",null,3.89,null,null,{"$f":"D68*G68","v":1369.28}]
[null,"Cotação","Telefone",12,"mês",null,59.9,null,null,{"$f":"D69*G69","v":718.8}]
[null,null,null,"Custo total de atividades auxiliares",{"$nulls":5},{"$f":"SUM(J66:J69)","v":2861.3599999999997}]
[{"$nulls":7},"Subtotal",null,{"$f":"J58+J64+J70","v":115361.9606103382}]
[null,"E - TEMPO FIXO",null,"Código","Quantidade","Unidade",null,"Custo Unitário","Custo Unitário"]
[null,"-",0,"-",0,"t",null,0,null,{"$f":"ROUNDDOWN(E73*H73,4)","v":0}]
[null,"-",0,"-",0,"t",null,0,null,{"$f":"ROUNDDOWN(E74*H74,4)","v":0}]
[null,null,null,"Custo unitário total de tempo fixo",{"$nulls":5},{"$f":"SUM(J73:J74)","v":0}]
[null,"F - MOMENTO DE TRANSPORTE",null,"Quantidade","Unidade","DMT",null,null,null,"Custo Unitário"]
[{"$nulls":5},"LN","RP","P"]
[null,"-",0,null,"tkm"]
[null,"-",0,null,"tkm"]
[null,null,null,"Custo unitário total de transporte"]
[{"$nulls":5},"Custo unitário direto total",null,null,null,{"$f":"TRUNC(J71+J75,2)","v":115361.96}]
[null,"Obs."]
[]
[{"$f":"A40+1","v":3},"1ª/GRD",{"$nulls":8},{"$f":"J120","v":13857.3}]
[null,"OBRA:","DRENAGEM E  PAVIMENTAÇÃO ASFÁLTICA EM CBUQ - AV. JOANA GOMES DOS SANTOS E ROTATÓRIA (SÃO JOÃO DO PACUÍ / MG)"]
[null,"Custo Unitário de Referência",null,null,"Minas Gerais"]
[{"$nulls":4}," Janeiro/2025 ",null,null,"Produção da equipe ",1,{"$f":"VLOOKUP(A84,ORÇAMENTO!$A$10:$L$58,7,1)","v":"GL"}]
[null,"CPU.3","CANTEIRO DE OBRAS ",{"$nulls":5},"Valores em reais (R$)"]
[null,"A - EQUIPAMENTOS",null,"Quantidade","Utilização",null,"Custo Horário",null,null,"Custo"]
[{"$nulls":4},"Operativa","Improdutiva","Produtivo","Improdutivo",null,"Horário Total"]
[null,"-",0,null,null,null,0,0,null,{"$f":"D91*(E91*G91+F91*H91)","v":0}]
[null,"-",0,null,null,null,0,0,null,{"$f":"D92*(E92*G92+F92*H92)","v":0}]
[{"$nulls":7},"Custo horário total de equipamentos",null,{"$f":"SUM(J91:J92)","v":0}]
[null,"B - MÃO DE OBRA",null,"Quantidade","Unidade",null,"Custo Horário","Custo Horário Total"]
[null,"P9824","Servente",8,"h",null,21.3355,null,null,{"$f":"D95*G95","v":170.684}]
[null,"P9808","Carpinteiro",8,"h",null,26.4529,null,null,{"$f":"D96*G96","v":211.6232}]
[null,null,null,"Custo horário total de mão de obra",{"$nulls":5},{"$f":"SUM(J95:J96)","v":382.30719999999997}]
[null,null,null,"Custo horário total de execução",{"$nulls":5},{"$f":"J93+J97","v":382.30719999999997}]
[null,null,null,"Custo unitário de execução",{"$nulls":5},{"$f":"J98/I87","v":382.30719999999997}]
[{"$nulls":7},"Custo do FIC",null,"-"]
[{"$nulls":7},"Custo do FIT",null,"-"]
[null,"C - MATERIAL",null,"Quantidade","Unidade",null,"Preço Unitário","Custo Unitário"]
[null,"M0053","Tela plástica em polipropileno na cor laranja para tapume - L = 1,2 m",100,"m",null,1.7749999999999999,null,null,{"$f":"D103*G103","v":177.5}]
[null,"-",0,0,0,null,0,null,null,{"$f":"D104*G104","v":0}]
[null,null,null,"Custo unitário total de material",{"$nulls":5},{"$f":"SUM(J103:J104)","v":177.5}]
[null,"D - ATIVIDADES AUXILIARES",null,"Quantidade","Unidade",null,"Custo Unitário","Custo Unitário"]
[null,10775,"Locação de container 2,30 X 6,00 m, alt. 2,50 m, com 1 sanitário, para escritório, completo, sem divisórias internas",6,"mês",null,985,null,null,{"$f":"D107*G107","v":5910}]
[null,10779,"Locação de container 2,30 X 4,30 m, alt. 2,50 M, p/ sanitário, c/ 5 bacias, 1 lavatório e 4 mictórios",6,"mês",null,1231.25,null,null,{"$f":"D108*G108","v":7387.5}]
[null,null,null,"Custo total de atividades auxiliares",{"$nulls":5},{"$f":"SUM(J107:J108)","v":13297.5}]
[{"$nulls":7},"Subtotal",null,{"$f":"J99+J105+J109","v":13857.307199999999}]
[null,"E - TEMPO FIXO",null,"Código","Quantidade","Unidade",null,"Custo Unitário","Custo Unitário"]
[null,"-",0,"-",0,"t",null,0,null,{"$f":"ROUNDDOWN(E112*H112,4)","v":0}]
[null,"-",0,"-",0,"t",null,0,null,{"$f":"ROUNDDOWN(E113*H113,4)","v":0}]
[null,null,null,"Custo unitário total de tempo fixo",{"$nulls":5},{"$f":"SUM(J112:J113)","v":0}]
[null,"F - MOMENTO DE TRANSPORTE",null,"Quantidade","Unidade","DMT",null,null,null,"Custo Unitário"]
[{"$nulls":5},"LN","RP","P"]
[null,"-",0,0,"tkm"]
[null,"-",0,0,"tkm"]
[null,null,null,"Custo unitário total de transporte"]
[{"$nulls":5},"Custo unitário direto total",null,null,null,{"$f":"TRUNC(J110+J114,2)","v":13857.3}]
[null,"Obs."]
[]
[{"$f":"A84+1","v":4},"1ª/GRD",{"$nulls":8},{"$f":"J161","v":351.42}]
[null,"OBRA:","DRENAGEM E  PAVIMENTAÇÃO ASFÁLTICA EM CBUQ - AV. JOANA GOMES DOS SANTOS E ROTATÓRIA (SÃO JOÃO DO PACUÍ / MG)"]
[null,"Custo Unitário de Referência",null,null,"Minas Gerais"]
[{"$nulls":4}," Janeiro/2025 ",null,null,"Produção da equipe ",1,{"$f":"VLOOKUP(A123,ORÇAMENTO!$A$10:$L$58,7,1)","v":"M2"}]
[null,103689,"PLACA DE OBRA EM CHAPA DE AÇO GALVANIZADO",{"$nulls":5},"Valores em reais (R$)"]
[null,"A - EQUIPAMENTOS",null,"Quantidade","Utilização",null,"Custo Horário",null,null,"Custo"]
[{"$nulls":4},"Operativa","Improdutiva","Produtivo","Improdutivo",null,"Horário Total"]
[null,"-",0,null,null,null,0,0,null,{"$f":"D130*(E130*G130+F130*H130)","v":0}]
[null,"-",0,null,null,null,0,0,null,{"$f":"D131*(E131*G131+F131*H131)","v":0}]
[{"$nulls":7},"Custo horário total de equipamentos",null,{"$f":"SUM(J130:J131)","v":0}]
[null,"B - MÃO DE OBRA",null,"Quantidade","Unidade",null,"Custo Horário","Custo Horário Total"]
[null,"P9824","Servente",1.1186,"h",null,21.3355,null,null,{"$f":"D134*G134","v":23.8658903}]
[null,"P9808","Carpinteiro",0.37290000000000001,"h",null,26.4529,null,null,{"$f":"D135*G135","v":9.8642864100000001}]
[null,null,null,"Custo horário total de mão de obra",{"$nulls":5},{"$f":"SUM(J134:J135)","v":33.730176710000002}]
[null,null,null,"Custo horário total de execução",{"$nulls":5},{"$f":"J132+J136","v":33.730176710000002}]
[null,null,null,"Custo unitário de execução",{"$nulls":5},{"$f":"J137/I126","v":33.730176710000002}]
[{"$nulls":7},"Custo do FIC",null,"-"]
[{"$nulls":7},"Custo do FIT",null,"-"]
[null,"C - MATERIAL",null,"Quantidade","Unidade",null,"Preço Unitário","Custo Unitário"]
[null,"M1358","Sarrafo em madeira de terceira - E = 2,5 cm e L = 5 cm",6.4165999999999999,"m",null,1.9665999999999999,null,null,{"$f":"D142*G142","v":12.618885559999999}]
[null,"M1205","Prego de ferro",2.4500000000000001E-2,"kg",null,16.544499999999999,null,null,{"$f":"D143*G143","v":0.40534025000000001}]
[null,"M0998","Madeira estrutural de eucalipto",2.2608E-2,"m³",null,2418.0391,null,null,{"$f":"D144*G144","v":54.6670279728}]
[null,4813,"Placa de obra (para construção civil) em chapa galvanizada *N. 22*, adesivada, de *2,4 X 1,2* m (sem postes para fixação)",1,"m²",null,250,null,null,250]
[null,null,null,"Custo unitário total de material",{"$nulls":5},{"$f":"SUM(J142:J145)","v":317.6912537828}]
[null,"D - ATIVIDADES AUXILIARES",null,"Quantidade","Unidade",null,"Custo Unitário","Custo Unitário"]
[null,"-",0,0,0,null,0,null,null,{"$f":"D148*G148","v":0}]
[null,"-",0,0,0,null,0,null,null,{"$f":"D149*G149","v":0}]
[null,null,null,"Custo total de atividades auxiliares",{"$nulls":5},{"$f":"SUM(J148:J149)","v":0}]
[{"$nulls":7},"Subtotal",null,{"$f":"J138+J146+J150","v":351.42143049280003}]
[null,"E - TEMPO FIXO",null,"Código","Quantidade","Unidade",null,"Custo Unitário","Custo Unitário"]
[null,"-",0,"-",0,"t",null,0,null,{"$f":"ROUNDDOWN(E153*H153,4)","v":0}]
[null,"-",0,"-",0,"t",null,0,null,{"$f":"ROUNDDOWN(E154*H154,4)","v":0}]
[null,null,null,"Custo unitário total de tempo fixo",{"$nulls":5},{"$f":"SUM(J153:J154)","v":0}]
[null,"F - MOMENTO DE TRANSPORTE",null,"Quantidade","Unidade","DMT",null,null,null,"Custo Unitário"]
[{"$nulls":5},"LN","RP","P"]
[null,"-",0,0,"tkm"]
[null,"-",0,0,"tkm"]
[null,null,null,"Custo unitário total de transporte"]
[{"$nulls":5},"Custo unitário direto total",null,null,null,{"$f":"TRUNC(J151+J155,2)","v":351.42}]
[null,"Obs."]
[]
[6,"1ª/GRD",{"$nulls":8},{"$f":"J202","v":0.46}]
[null,"OBRA:","DRENAGEM E  PAVIMENTAÇÃO ASFÁLTICA EM CBUQ - AV. JOANA GOMES DOS SANTOS E ROTATÓRIA (SÃO JOÃO DO PACUÍ / MG)"]
[null,"Custo Unitário de Referência",null,null,"Minas Gerais"]
[{"$nulls":4}," Janeiro/2025 ",null,null,"Produção da equipe ",1,{"$f":"VLOOKUP(A164,ORÇAMENTO!$A$10:$L$58,7,1)","v":"M2"}]
[null,78472,"SERVIÇOS TOPOGRÁFICOS PARA PAVIMENTAÇÃO, INCLUSIVE LEVANTAMENTO PLANIALTIMÉTRICO CADASTRAL, GERAÇÃO DE NOTAS DE SERVIÇO, SEÇÕES TRANSVERSAIS E GREIDE, ESTAQUEAMENTO E ACOMPANHAMENTO EXECUTIVO",{"$nulls":5},"Valores em reais (R$)"]
[null,"A - EQUIPAMENTOS",null,"Quantidade","Utilização",null,"Custo Horário",null,null,"Custo"]
[{"$nulls":4},"Operativa","Improdutiva","Produtivo","Improdutivo",null,"Horário Total"]
[null,92145,"Caminhonete cabine simples com motor 1.6 flex, câmbio manual, potência 101/104 cv, 2 portas",5.0000000000000001E-4,1,0,76.5,0,null,{"$f":"D171*(E171*G171+F171*H171)","v":3.8249999999999999E-2}]
[null,"-",0,0,1,0,0,0,null,{"$f":"D172*(E172*G172+F172*H172)","v":0}]
[{"$nulls":7},"Custo horário total de equipamentos",null,{"$f":"SUM(J171:J172)","v":3.8249999999999999E-2}]
[null,"B - MÃO DE OBRA",null,"Quantidade","Unidade",null,"Custo Horário","Custo Horário Total"]
[null,"P9949","Topógrafo",1.2500000000000001E-5,"mês",null,6816.9715999999999,28.404048333333332,null,{"$f":"D175*G175","v":8.5212145000000003E-2}]
[null,"P9950","Auxiliar de topografia",1.2500000000000001E-5,"mês",null,6157.8463000000002,22.806838148148149,null,{"$f":"D176*G176","v":7.6973078750000007E-2}]
[null,"P9824","Servente",7.4999999999999997E-3,"h",null,21.3355,8.889791666666666E-2,null,{"$f":"D177*G177","v":0.16001625}]
[null,"P9848","Desenhista",1.0000000000000001E-5,"mês",null,10307.748600000001,38.17684666666667,null,{"$f":"D178*G178","v":0.10307748600000001}]
[null,null,null,"Custo horário total de mão de obra",{"$nulls":5},{"$f":"SUM(J175:J178)","v":0.42527895974999996}]
[null,null,null,"Custo horário total de execução",{"$nulls":5},{"$f":"J173+J179","v":0.46352895974999997}]
[null,null,null,"Custo unitário de execução",{"$nulls":5},{"$f":"J180/I167","v":0.46352895974999997}]
[{"$nulls":7},"Custo do FIC",null,"-"]
[{"$nulls":7},"Custo do FIT",null,"-"]
[null,"C - MATERIAL",null,"Quantidade","Unidade",null,"Preço Unitário","Custo Unitário"]
[null,"-",0,0,0,null,0,null,null,{"$f":"D185*G185","v":0}]
[null,"-",0,0,0,null,0,null,null,0]
[null,null,null,"Custo unitário total de material",{"$nulls":5},{"$f":"SUM(J185:J186)","v":0}]
[null,"D - ATIVIDADES AUXILIARES",null,"Quantidade","Unidade",null,"Custo Unitário","Custo Unitário"]
[null,"-",0,0,0,null,0,null,null,{"$f":"D189*G189","v":0}]
[null,"-",0,0,0,null,0,null,null,{"$f":"D190*G190","v":0}]
[null,null,null,"Custo total de atividades auxiliares",{"$nulls":5},{"$f":"SUM(J189:J190)","v":0}]
[{"$nulls":7},"Subtotal",null,{"$f":"J181+J187+J191","v":0.46352895974999997}]
[null,"E - TEMPO FIXO",null,"Código","Quantidade","Unidade",null,"Custo Unitário","Custo Unitário"]
[null,"-",0,"-",0,"t",null,0,null,{"$f":"ROUNDDOWN(E194*H194,4)","v":0}]
[null,"-",0,"-",0,"t",null,0,null,{"$f":"ROUNDDOWN(E195*H195,4)","v":0}]
[null,null,null,"Custo unitário total de tempo fixo",{"$nulls":5},{"$f":"SUM(J194:J195)","v":0}]
[null,"F - MOMENTO DE TRANSPORTE",null,"Quantidade","Unidade","DMT",null,null,null,"Custo Unitário"]
[{"$nulls":5},"LN","RP","P"]
[null,"-",0,0,"tkm"]
[null,"-",0,0,"tkm"]
[null,null,null,"Custo unitário total de transporte"]
[{"$nulls":5},"Custo unitário direto total",null,null,null,{"$f":"TRUNC(J192+J196,2)","v":0.46}]
[null,"Obs."]
[]
["6.1","1ª/GRD",{"$nulls":8},{"$f":"J241","v":0.53}]
[null,"OBRA:","DRENAGEM E  PAVIMENTAÇÃO ASFÁLTICA EM CBUQ - AV. JOANA GOMES DOS SANTOS E ROTATÓRIA (SÃO JOÃO DO PACUÍ / MG)"]
[null,"Custo Unitário de Referência",null,null,"Minas Gerais"]
[{"$nulls":4}," Janeiro/2025 ",null,null,"Produção da equipe ",1532.91,{"$f":"VLOOKUP(A205,ORÇAMENTO!$A$10:$L$58,7,1)","v":"M2"}]
[null,5501700,"DESMATAMENTO, DESTOCAMENTO E LIMPEZA COM ÁRVORES DE DIÂMETRO ATÉ 0,15M",{"$nulls":5},"Valores em reais (R$)"]
[null,"A - EQUIPAMENTOS",null,"Quantidade","Utilização",null,"Custo Horário",null,null,"Custo"]
[{"$nulls":4},"Operativa","Improdutiva","Produtivo","Improdutivo",null,"Horário Total"]
[null,"E9541","Trator sobre esteiras com lâmina - 259 kW",1,1,0,768.12070000000006,303.00839999999999,null,{"$f":"D212*(E212*G212+F212*H212)","v":768.12070000000006}]
[null,"-",0,null,null,null,0,0,null,{"$f":"D213*(E213*G213+F213*H213)","v":0}]
[{"$nulls":7},"Custo horário total de equipamentos",null,{"$f":"SUM(J212:J213)","v":768.12070000000006}]
[null,"B - MÃO DE OBRA",null,"Quantidade","Unidade",null,"Custo Horário","Custo Horário Total"]
[null,"P9824","Servente",2,"h",null,21.3355,null,null,{"$f":"D216*G216","v":42.670999999999999}]
[null,"-",0,null,0,null,0,null,null,{"$f":"D217*G217","v":0}]
[null,null,null,"Custo horário total de mão de obra",{"$nulls":5},{"$f":"SUM(J216:J217)","v":42.670999999999999}]
[null,null,null,"Custo horário total de execução",{"$nulls":5},{"$f":"J214+J218","v":810.79170000000011}]
[null,null,null,"Custo unitário de execução",{"$nulls":5},{"$f":"J219/I208","v":0.52892322445544748}]
[{"$nulls":7},"Custo do FIC",null,1.8E-3]
[{"$nulls":7},"Custo do FIT",null,0]
[null,"C - MATERIAL",null,"Quantidade","Unidade",null,"Preço Unitário","Custo Unitário"]
[null,"-",0,null,0,null,0,null,null,{"$f":"D224*G224","v":0}]
[null,"-",0,null,0,null,0,null,null,{"$f":"D225*G225","v":0}]
[null,null,null,"Custo unitário total de material",{"$nulls":5},{"$f":"SUM(J224:J225)","v":0}]
[null,"D - ATIVIDADES AUXILIARES",null,"Quantidade","Unidade",null,"Custo Unitário","Custo Unitário"]
[null,"-",0,null,0,null,0,null,null,{"$f":"D228*G228","v":0}]
[null,"-",0,null,0,null,0,null,null,{"$f":"D229*G229","v":0}]
[null,null,null,"Custo total de atividades auxiliares",{"$nulls":5},{"$f":"SUM(J228:J229)","v":0}]
[{"$nulls":7},"Subtotal",null,{"$f":"J220+J226+J230+J221+J222","v":0.53072322445544751}]
[null,"E - TEMPO FIXO",null,"Código","Quantidade","Unidade",null,"Custo Unitário","Custo Unitário"]
[null,"-",0,"-",0,"t",null,0,null,{"$f":"ROUNDDOWN(E233*H233,4)","v":0}]
[null,"-",0,"-",0,"t",null,0,null,{"$f":"ROUNDDOWN(E234*H234,4)","v":0}]
[null,null,null,"Custo unitário total de tempo fixo",{"$nulls":5},{"$f":"SUM(J233:J234)","v":0}]
[null,"F - MOMENTO DE TRANSPORTE",null,"Quantidade","Unidade","DMT",null,null,null,"Custo Unitário"]
[{"$nulls":5},"LN","RP","P"]
[null,"-",0]
[null,"-",0]
[null,null,null,"Custo unitário total de transporte"]
[{"$nulls":5},"Custo unitário direto total",null,null,null,{"$f":"TRUNC(J231+J235,2)","v":0.53}]
[null,"Obs."]
[]
["6.2","1ª/GRD",{"$nulls":8},{"$f":"J280","v":12.19}]
[null,"OBRA:","DRENAGEM E  PAVIMENTAÇÃO ASFÁLTICA EM CBUQ - AV. JOANA GOMES DOS SANTOS E ROTATÓRIA (SÃO JOÃO DO PACUÍ / MG)"]
[null,"Custo Unitário de Referência",null,null,"Minas Gerais"]
[{"$nulls":4}," Janeiro/2025 ",null,null,"Produção da equipe ",76.5,{"$f":"VLOOKUP(A244,ORÇAMENTO!$A$10:$L$58,7,1)","v":"M3"}]
[null,4915667,"REMOÇÃO MECANIZADA DE REVESTIMENTO ASFÁLTICO",{"$nulls":5},"Valores em reais (R$)"]
[null,"A - EQUIPAMENTOS",null,"Quantidade","Utilização",null,"Custo Horário",null,null,"Custo"]
[{"$nulls":4},"Operativa","Improdutiva","Produtivo","Improdutivo",null,"Horário Total"]
[null,"E9524","Motoniveladora - 93 kW",1,1,0,288.51479999999998,125.7629,null,{"$f":"D251*(E251*G251+F251*H251)","v":288.51479999999998}]
[null,"-",0,null,null,null,0,0,null,{"$f":"D252*(E252*G252+F252*H252)","v":0}]
[{"$nulls":7},"Custo horário total de equipamentos",null,{"$f":"SUM(J251:J252)","v":288.51479999999998}]
[null,"B - MÃO DE OBRA",null,"Quantidade","Unidade",null,"Custo Horário","Custo Horário Total"]
[null,"P9824","Servente",4,"h",null,21.3355,8.889791666666666E-2,null,{"$f":"D255*G255","v":85.341999999999999}]
[null,"-",0,null,0,null,0,0,null,{"$f":"D256*G256","v":0}]
[null,null,null,"Custo horário total de mão de obra",{"$nulls":5},{"$f":"SUM(J255:J256)","v":85.341999999999999}]
[null,null,null,"Custo horário total de execução",{"$nulls":5},{"$f":"J253+J257","v":373.85679999999996}]
[null,null,null,"Custo unitário de execução",{"$nulls":5},{"$f":"J258/I247","v":4.8870169934640515}]
[{"$nulls":7},"Custo do FIC",null,1.66E-2]
[{"$nulls":7},"Custo do FIT",null,0]
[null,"C - MATERIAL",null,"Quantidade","Unidade",null,"Preço Unitário","Custo Unitário"]
[null,"-",0,0,0,null,0,null,null,{"$f":"D263*G263","v":0}]
[null,"-",0,0,0,null,0,null,null,0]
[null,null,null,"Custo unitário total de material",{"$nulls":5},{"$f":"SUM(J263:J264)","v":0}]
[null,"D - ATIVIDADES AUXILIARES",null,"Quantidade","Unidade",null,"Custo Unitário","Custo Unitário"]
[null,"-",0,0,0,null,0,null,null,{"$f":"D267*G267","v":0}]
[null,"-",0,0,0,null,0,null,null,{"$f":"D268*G268","v":0}]
[null,null,null,"Custo total de atividades auxiliares",{"$nulls":5},{"$f":"SUM(J267:J268)","v":0}]
[{"$nulls":7},"Subtotal",null,{"$f":"J259+J265+J269+J260+J261","v":4.9036169934640519}]
[null,"E - TEMPO FIXO",null,"Código","Quantidade","Unidade",null,"Custo Unitário","Custo Unitário"]
[null,"M3507","Revestimento asfáltico",5914675,2.4,"t",null,3.04,null,{"$f":"ROUNDDOWN(E272*H272,4)","v":7.2960000000000003}]
[null,"-",0,"-",0,"t",null,0,null,{"$f":"ROUNDDOWN(E273*H273,4)","v":0}]
[null,null,null,"Custo unitário total de tempo fixo",{"$nulls":5},{"$f":"SUM(J272:J273)","v":7.2960000000000003}]
[null,"F - MOMENTO DE TRANSPORTE",null,"Quantidade","Unidade","DMT",null,null,null,"Custo Unitário"]
[{"$nulls":5},"LN","RP","P"]
[null,"M3507","Revestimento asfáltico",0,"tkm"]
[null,"-",0,0,"tkm"]
[null,null,null,"Custo unitário total de transporte"]
[{"$nulls":5},"Custo unitário direto total",null,null,null,{"$f":"TRUNC(J270+J274,2)","v":12.19}]
[null,"Obs."]
[]
["6.3","1ª/GRD",{"$nulls":8},{"$f":"J319","v":60.96}]
[null,"OBRA:","DRENAGEM E  PAVIMENTAÇÃO ASFÁLTICA EM CBUQ - AV. JOANA GOMES DOS SANTOS E ROTATÓRIA (SÃO JOÃO DO PACUÍ / MG)"]
[null,"Custo Unitário de Referência",null,null,"Minas Gerais"]
[{"$nulls":4}," Janeiro/2025 ",null,null,"Produção da equipe ",8.3025199999999995,{"$f":"VLOOKUP(A283,ORÇAMENTO!$A$10:$L$58,7,1)","v":"M3"}]
[null,1619003,"DEMOLIÇÃO DE CONCRETO SIMPLES (MEIO FIO, SARJETA, PASSEIOS, ETC.), DE FORMA MECANIZADA",{"$nulls":5},"Valores em reais (R$)"]
[null,"A - EQUIPAMENTOS",null,"Quantidade","Utilização",null,"Custo Horário",null,null,"Custo"]
[{"$nulls":4},"Operativa","Improdutiva","Produtivo","Improdutivo",null,"Horário Total"]
[null,"E9127","Escavadeira hidráulica com martelo hidráulico de 520 kg - 75 kW",1,1,0,334.53960000000001,154.23849999999999,null,{"$f":"D290*(E290*G290+F290*H290)","v":334.53960000000001}]
[null,"-",0,null,null,null,0,0,null,{"$f":"D291*(E291*G291+F291*H291)","v":0}]
[{"$nulls":7},"Custo horário total de equipamentos",null,{"$f":"SUM(J290:J291)","v":334.53960000000001}]
[null,"B - MÃO DE OBRA",null,"Quantidade","Unidade",null,"Custo Horário","Custo Horário Total"]
[null,"-",0,null,0,null,0,null,null,{"$f":"D294*G294","v":0}]
[null,"-",0,null,0,null,0,null,null,{"$f":"D295*G295","v":0}]
[null,null,null,"Custo horário total de mão de obra",{"$nulls":5},{"$f":"SUM(J294:J295)","v":0}]
[null,null,null,"Custo horário total de execução",{"$nulls":5},{"$f":"J292+J296","v":334.53960000000001}]
[null,null,null,"Custo unitário de execução",{"$nulls":5},{"$f":"J297/I286","v":40.293742140940346}]
[{"$nulls":7},"Custo do FIC",null,"-"]
[{"$nulls":7},"Custo do FIT",null,"-"]
[null,"C - MATERIAL",null,"Quantidade","Unidade",null,"Preço Unitário","Custo Unitário"]
[null,"M0603","Ponteiro para rompedor hidráulico de 520 kg",7.1000000000000002E-4,"un",null,6012.7793000000001,null,null,{"$f":"D302*G302","v":4.2690733029999999}]
[null,"-",0,null,0,null,0,null,null,{"$f":"D303*G303","v":0}]
[null,null,null,"Custo unitário total de material",{"$nulls":5},{"$f":"SUM(J302:J303)","v":4.2690733029999999}]
[null,"D - ATIVIDADES AUXILIARES",null,"Quantidade","Unidade",null,"Custo Unitário","Custo Unitário"]
[null,1416201,"Corte de barras de aço CA-50 com maçarico oxiacetileno",40,"cm²",null,0.22,null,null,{"$f":"D306*G306","v":8.8000000000000007}]
[null,"-",0,null,0,null,0,null,null,{"$f":"D307*G307","v":0}]
[null,null,null,"Custo total de atividades auxiliares",{"$nulls":5},{"$f":"SUM(J306:J307)","v":8.8000000000000007}]
[{"$nulls":7},"Subtotal",null,{"$f":"J298+J304+J308","v":53.362815443940349}]
[null,"E - TEMPO FIXO",null,"Código","Quantidade","Unidade",null,"Custo Unitário","Custo Unitário"]
[null,"M3512","Material demolido - concreto armado",5914675,2.5,"t",null,3.04,null,{"$f":"ROUNDDOWN(E311*H311,4)","v":7.6}]
[null,"-",0,"-",0,"t",null,0,null,{"$f":"ROUNDDOWN(E312*H312,4)","v":0}]
[null,null,null,"Custo unitário total de tempo fixo",{"$nulls":5},{"$f":"SUM(J311:J312)","v":7.6}]
[null,"F - MOMENTO DE TRANSPORTE",null,"Quantidade","Unidade","DMT",null,null,null,"Custo Unitário"]
[{"$nulls":5},"LN","RP","P"]
[null,"-",0]
[null,"-",0]
[null,null,null,"Custo unitário total de transporte"]
[{"$nulls":5},"Custo unitário direto total",null,null,null,{"$f":"TRUNC(J309+J313,2)","v":60.96}]
[null,"Obs."]
[]
["6.4","1ª/GRD",{"$nulls":8},{"$f":"J358","v":2.69}]
[null,"OBRA:","DRENAGEM E  PAVIMENTAÇÃO ASFÁLTICA EM CBUQ - AV. JOANA GOMES DOS SANTOS E ROTATÓRIA (SÃO JOÃO DO PACUÍ / MG)"]
[null,"Custo Unitário de Referência",null,null,"Minas Gerais"]
[{"$nulls":4}," Janeiro/2025 ",null,null,"Produção da equipe ",457.16,{"$f":"VLOOKUP(A322,ORÇAMENTO!$A$10:$L$58,7,1)","v":"T"}]
[null,5914351,"CARGA, MANOBRA E DESCARGA DE MATERIAL EM GERAL (ENTULHO) EM CAMINHÃO BASCULANTE",{"$nulls":5},"Valores em reais (R$)"]
[null,"A - EQUIPAMENTOS",null,"Quantidade","Utilização",null,"Custo Horário",null,null,"Custo"]
[{"$nulls":4},"Operativa","Improdutiva","Produtivo","Improdutivo",null,"Horário Total"]
[null,"E9667","Caminhão basculante com capacidade de 14 m³ - 210 kW",3,0.77,0.23,309.83940000000001,90.412199999999999,null,{"$f":"D329*(E329*G329+F329*H329)","v":778.1134320000001}]
[null,"E9511","Carregadeira de pneus com capacidade de 3,40 m³ - 195 kW",1,1,0,453.4649,220.85210000000001,null,{"$f":"D330*(E330*G330+F330*H330)","v":453.4649}]
[{"$nulls":7},"Custo horário total de equipamentos",null,{"$f":"SUM(J329:J330)","v":1231.578332}]
[null,"B - MÃO DE OBRA",null,"Quantidade","Unidade",null,"Custo Horário","Custo Horário Total"]
[null,"-",0,null,0,null,0,0,null,{"$f":"D333*G333","v":0}]
[null,"-",0,null,0,null,0,0,null,{"$f":"D334*G334","v":0}]
[null,null,null,"Custo horário total de mão de obra",{"$nulls":5},{"$f":"SUM(J333:J334)","v":0}]
[null,null,null,"Custo horário total de execução",{"$nulls":5},{"$f":"J331+J335","v":1231.578332}]
[null,null,null,"Custo unitário de execução",{"$nulls":5},{"$f":"J336/I325","v":2.6939765771283577}]
[{"$nulls":7},"Custo do FIC",null,"-"]
[{"$nulls":7},"Custo do FIT",null,"-"]
[null,"C - MATERIAL",null,"Quantidade","Unidade",null,"Preço Unitário","Custo Unitário"]
[null,"-",0,0,0,null,0,null,null,{"$f":"D341*G341","v":0}]
[null,"-",0,0,0,null,0,null,null,0]
[null,null,null,"Custo unitário total de material",{"$nulls":5},{"$f":"SUM(J341:J342)","v":0}]
[null,"D - ATIVIDADES AUXILIARES",null,"Quantidade","Unidade",null,"Custo Unitário","Custo Unitário"]
[null,"-",0,0,0,null,0,null,null,{"$f":"D345*G345","v":0}]
[null,"-",0,0,0,null,0,null,null,{"$f":"D346*G346","v":0}]
[null,null,null,"Custo total de atividades auxiliares",{"$nulls":5},{"$f":"SUM(J345:J346)","v":0}]
[{"$nulls":7},"Subtotal",null,{"$f":"J337+J343+J347","v":2.6939765771283577}]
[null,"E - TEMPO FIXO",null,"Código","Quantidade","Unidade",null,"Custo Unitário","Custo Unitário"]
[null,"-",0,"-",0,"t",null,0,null,{"$f":"ROUNDDOWN(E350*H350,4)","v":0}]
[null,"-",0,"-",0,"t",null,0,null,{"$f":"ROUNDDOWN(E351*H351,4)","v":0}]
[null,null,null,"Custo unitário total de tempo fixo",{"$nulls":5},{"$f":"SUM(J350:J351)","v":0}]
[null,"F - MOMENTO DE TRANSPORTE",null,"Quantidade","Unidade","DMT",null,null,null,"Custo Unitário"]
[{"$nulls":5},"LN","RP","P"]
[null,"-",0,0,"tkm"]
[null,"-",0,0,"tkm"]
[null,null,null,"Custo unitário total de transporte"]
[{"$nulls":5},"Custo unitário direto total",null,null,null,{"$f":"TRUNC(J348+J352,2)","v":2.69}]
[null,"Obs."]
[]
[{"$f":"A164+1","v":7},"1ª/GRD",{"$nulls":8},{"$f":"J397","v":6.73}]
[null,"OBRA:","DRENAGEM E  PAVIMENTAÇÃO ASFÁLTICA EM CBUQ - AV. JOANA GOMES DOS SANTOS E ROTATÓRIA (SÃO JOÃO DO PACUÍ / MG)"]
[null,"Custo Unitário de Referência",null,null,"Minas Gerais"]
[{"$nulls":4}," Janeiro/2025 ",null,null,"Produção da equipe ",230.19,{"$f":"VLOOKUP(A361,ORÇAMENTO!$A$10:$L$58,7,1)","v":"M3"}]
[null,5502114,"ESCAVAÇÃO, CARGA E TRANSPORTE DE MATERIAL DE 1ª CATEGORIA - DMT 1.000 A 1.200M, CAMINHO DE SERVIÇO EM REVESTIMENTO PRIMÁRIO",{"$nulls":5},"Valores em reais (R$)"]
[null,"A - EQUIPAMENTOS",null,"Quantidade","Utilização",null,"Custo Horário",null,null,"Custo"]
[{"$nulls":4},"Operativa","Improdutiva","Produtivo","Improdutivo",null,"Horário Total"]
[null,"E9667","Caminhão basculante com capacidade de 14 m³ - 210 kW",4,0.96,0.04,309.83940000000001,90.412199999999999,null,{"$f":"D368*(E368*G368+F368*H368)","v":1204.2492480000001}]
[null,"E9515","Escavadeira hidráulica sobre esteiras com caçamba com capacidade de 1,56 m³ - 118 kW",1,1,0,287.62189999999998,129.0472,null,{"$f":"D369*(E369*G369+F369*H369)","v":287.62189999999998}]
[{"$nulls":7},"Custo horário total de equipamentos",null,{"$f":"SUM(J368:J369)","v":1491.8711480000002}]
[null,"B - MÃO DE OBRA",null,"Quantidade","Unidade",null,"Custo Horário","Custo Horário Total"]
[null,"P9824","Servente",1,"h",null,21.3355,null,null,{"$f":"D372*G372","v":21.3355}]
[{"$nulls":9},{"$f":"D373*G373","v":0}]
[null,null,null,"Custo horário total de mão de obra",{"$nulls":5},{"$f":"SUM(J372:J373)","v":21.3355}]
[null,null,null,"Custo horário total de execução",{"$nulls":5},{"$f":"J370+J374","v":1513.2066480000001}]
[null,null,null,"Custo unitário de execução",{"$nulls":5},{"$f":"J375/I364","v":6.5737288674573184}]
[{"$nulls":7},"Custo do FIC",null,0.15820000000000001]
[{"$nulls":7},"Custo do FIT",null,0]
[null,"C - MATERIAL",null,"Quantidade","Unidade",null,"Preço Unitário","Custo Unitário"]
[null,"-",0,null,0,null,0,null,null,{"$f":"D380*G380","v":0}]
[null,"-",0,null,0,null,0,null,null,{"$f":"D381*G381","v":0}]
[null,null,null,"Custo unitário total de material",{"$nulls":5},{"$f":"SUM(J380:J381)","v":0}]
[null,"D - ATIVIDADES AUXILIARES",null,"Quantidade","Unidade",null,"Custo Unitário","Custo Unitário"]
[null,"-",0,0,0,null,0,null,null,{"$f":"D384*G384","v":0}]
[null,"-",0,0,0,null,0,null,null,{"$f":"D385*G385","v":0}]
[null,null,null,"Custo total de atividades auxiliares",{"$nulls":5},{"$f":"SUM(J384:J385)","v":0}]
[{"$nulls":7},"Subtotal",null,{"$f":"J376+J382+J386+J377+J378","v":6.7319288674573183}]
[null,"E - TEMPO FIXO",null,"Código","Quantidade","Unidade",null,"Custo Unitário","Custo Unitário"]
[null,"-",0,"-",0,"t",null,0,null,{"$f":"ROUNDDOWN(E389*H389,4)","v":0}]
[null,"-",0,"-",0,"t",null,0,null,{"$f":"ROUNDDOWN(E390*H390,4)","v":0}]
[null,null,null,"Custo unitário total de tempo fixo",{"$nulls":5},{"$f":"SUM(J389:J390)","v":0}]
[null,"F - MOMENTO DE TRANSPORTE",null,"Quantidade","Unidade","DMT",null,null,null,"Custo Unitário"]
[{"$nulls":5},"LN","RP","P"]
[null,"-",0,null,"tkm","5914449","5914464","5914479"]
[null,"-",0,null,"tkm","5914449","5914464","5914479"]
[null,null,null,"Custo unitário total de transporte"]
[{"$nulls":5},"Custo unitário direto total",null,null,null,{"$f":"TRUNC(J387+J391,2)","v":6.73}]
[null,"Obs."]
[]
[{"$f":"A361+1","v":8},"1ª/GRD",{"$nulls":8},{"$f":"J439","v":5.03}]
[null,"OBRA:","DRENAGEM E  PAVIMENTAÇÃO ASFÁLTICA EM CBUQ - AV. JOANA GOMES DOS SANTOS E ROTATÓRIA (SÃO JOÃO DO PACUÍ / MG)"]
[null,"Custo Unitário de Referência",null,null,"Minas Gerais"]
[{"$nulls":4}," Janeiro/2025 ",null,null,"Produção da equipe ",168.2,{"$f":"VLOOKUP(A400,ORÇAMENTO!$A$10:$L$58,7,1)","v":"M3"}]
[null,5502978,"COMPACTAÇÃO DE ATERROS A 100% DO PROCTOR NORMAL",{"$nulls":5},"Valores em reais (R$)"]
[null,"A - EQUIPAMENTOS",null,"Quantidade","Utilização",null,"Custo Horário",null,null,"Custo"]
[{"$nulls":4},"Operativa","Improdutiva","Produtivo","Improdutivo",null,"Horário Total"]
[null,"E9571","Caminhão tanque com capacidade de 10.000 l - 188 kW",1,0.9,0.1,323.59019999999998,80.173299999999998,null,{"$f":"D407*(E407*G407+F407*H407)","v":299.24851000000001}]
[null,"E9518","Grade de 24 discos rebocável de D = 60 cm (24\")",1,0.52,0.48,4.9436,3.4426000000000001,null,{"$f":"D408*(E408*G408+F408*H408)","v":4.2231199999999998}]
[null,"E9524","Motoniveladora - 93 kW",1,0.28999999999999998,0.71,288.51479999999998,125.7629,null,172.96095099999997]
[null,"E9685","Rolo compactador pé de carneiro vibratório autopropelido por pneus de 11,6 t - 82 kW",1,1,0,225.9264,101.55289999999999,null,225.9264]
[null,"E9577","Trator agrícola sobre pneus - 77 kW",1,0.52,0.48,152.69229999999999,55.394399999999997,null,{"$f":"D411*(E411*G411+F411*H411)","v":105.98930799999999}]
[{"$nulls":7},"Custo horário total de equipamentos",null,{"$f":"SUM(J407:J411)","v":808.34828900000002}]
[null,"B - MÃO DE OBRA",null,"Quantidade","Unidade",null,"Custo Horário","Custo Horário Total"]
[null,"P9824","Servente",1,"h",null,21.3355,null,null,{"$f":"D414*G414","v":21.3355}]
[null,"-",null,0,0,null,0,null,null,{"$f":"D415*G415","v":0}]
[null,null,null,"Custo horário total de mão de obra",{"$nulls":5},{"$f":"SUM(J414:J415)","v":21.3355}]
[null,null,null,"Custo horário total de execução",{"$nulls":5},{"$f":"J412+J416","v":829.68378900000005}]
[null,null,null,"Custo unitário de execução",{"$nulls":5},{"$f":"J417/I403","v":4.9327216944114154}]
[{"$nulls":7},"Custo do FIC",null,9.7900000000000001E-2]
[{"$nulls":7},"Custo do FIT",null,0]
[null,"C - MATERIAL",null,"Quantidade","Unidade",null,"Preço Unitário","Custo Unitário"]
[null,"-",0,0,0,null,0,null,null,{"$f":"D422*G422","v":0}]
[null,"-",0,0,0,null,0,null,null,{"$f":"D423*G423","v":0}]
[null,null,null,"Custo unitário total de material",{"$nulls":5},{"$f":"SUM(J422:J423)","v":0}]
[null,"D - ATIVIDADES AUXILIARES",null,"Quantidade","Unidade",null,"Custo Unitário","Custo Unitário"]
[null,"-",0,0,0,null,0,null,null,{"$f":"D426*G426","v":0}]
[null,"-",0,0,0,null,0,null,null,{"$f":"D427*G427","v":0}]
[null,null,null,"Custo total de atividades auxiliares",{"$nulls":5},{"$f":"SUM(J426:J427)","v":0}]
[{"$nulls":7},"Subtotal",null,{"$f":"J418+J424+J428+J419+J420","v":5.0306216944114155}]
[null,"E - TEMPO FIXO",null,"Código","Quantidade","Unidade",null,"Custo Unitário","Custo Unitário"]
[null,"-",0,"-",0,"t",null,0,null,{"$f":"ROUNDDOWN(E431*H431,4)","v":0}]
[null,"-",0,"-",0,"t",null,0,null,{"$f":"ROUNDDOWN(E432*H432,4)","v":0}]
[null,null,null,"Custo unitário total de tempo fixo",{"$nulls":5},{"$f":"SUM(J431:J432)","v":0}]
[null,"F - MOMENTO DE TRANSPORTE",null,"Quantidade","Unidade","DMT",null,null,null,"Custo Unitário"]
[{"$nulls":5},"LN","RP","P"]
[null,"-",0,0,"tkm","5914449","5914464","5914479"]
[null,"-",0,0,"tkm","5914449","5914464","5914479"]
[null,null,null,"Custo unitário total de transporte"]
[{"$nulls":5},"Custo unitário direto total",null,null,null,{"$f":"TRUNC(J429+J433,2)","v":5.03}]
[null,"Obs."]
[]
[{"$f":"A400+1","v":9},"1ª/GRD",{"$nulls":8},{"$f":"J482","v":1.54}]
[null,"OBRA:","DRENAGEM E  PAVIMENTAÇÃO ASFÁLTICA EM CBUQ - AV. JOANA GOMES DOS SANTOS E ROTATÓRIA (SÃO JOÃO DO PACUÍ / MG)"]
[null,"Custo Unitário de Referência",null,null,"Minas Gerais"]
[{"$nulls":4}," Janeiro/2025 ",null,null,"Produção da equipe ",672.8,{"$f":"VLOOKUP(A442,ORÇAMENTO!$A$10:$L$58,7,1)","v":"M2"}]
[null,4011209,"REGULARIZAÇÃO E COMPACTAÇÃO DO SUBLEITO ",{"$nulls":5},"Valores em reais (R$)"]
[null,"A - EQUIPAMENTOS",null,"Quantidade","Utilização",null,"Custo Horário",null,null,"Custo"]
[{"$nulls":4},"Operativa","Improdutiva","Produtivo","Improdutivo",null,"Horário Total"]
[null,"E9571","Caminhão tanque com capacidade de 10.000 l - 188 kW",1,0.61,0.39,323.59019999999998,80.173299999999998,null,{"$f":"D449*(E449*G449+F449*H449)","v":228.65760899999998}]
[null,"E9518","Grade de 24 discos rebocável de D = 60 cm (24\")",1,0.41,0.59000000000000008,4.9436,3.4426000000000001,null,{"$f":"D450*(E450*G450+F450*H450)","v":4.0580099999999995}]
[null,"E9524","Motoniveladora - 93 kW",1,0.43,0.57000000000000006,288.51479999999998,125.7629,null,195.746217]
[null,"E9762","Rolo compactador de pneus autopropelido de 27 t - 85 kW",1,0.96,4.0000000000000036E-2,255.65049999999999,124.5621,null,250.40696399999999]
[null,"E9685","Rolo compactador pé de carneiro vibratório autopropelido por pneus de 11,6 t - 82 kW",1,1,0,225.9264,101.55289999999999,null,225.9264]
[null,"E9577","Trator agrícola sobre pneus - 77 kW",1,0.41,0.59000000000000008,152.69229999999999,55.394399999999997,null,95.286538999999991]
[{"$nulls":7},"Custo horário total de equipamentos",null,{"$f":"SUM(J449:J454)","v":1000.081739}]
[null,"B - MÃO DE OBRA",null,"Quantidade","Unidade",null,"Custo Horário","Custo Horário Total"]
[null,"P9824","Servente",1,"h",null,21.3355,null,null,{"$f":"D457*G457","v":21.3355}]
[null,"-",null,0,0,null,0,null,null,{"$f":"D458*G458","v":0}]
[null,null,null,"Custo horário total de mão de obra",{"$nulls":5},{"$f":"SUM(J457:J458)","v":21.3355}]
[null,null,null,"Custo horário total de execução",{"$nulls":5},{"$f":"J455+J459","v":1021.417239}]
[null,null,null,"Custo unitário de execução",{"$nulls":5},{"$f":"J460/I445","v":1.5181587975624258}]
[{"$nulls":7},"Custo do FIC",null,2.2700000000000001E-2]
[{"$nulls":7},"Custo do FIT",null,0]
[null,"C - MATERIAL",null,"Quantidade","Unidade",null,"Preço Unitário","Custo Unitário"]
[null,"-",0,null,0,null,0,null,null,{"$f":"D465*G465","v":0}]
[null,"-",0,null,0,null,0,null,null,{"$f":"D466*G466","v":0}]
[null,null,null,"Custo unitário total de material",{"$nulls":5},{"$f":"SUM(J465:J466)","v":0}]
[null,"D - ATIVIDADES AUXILIARES",null,"Quantidade","Unidade",null,"Custo Unitário","Custo Unitário"]
[null,"-",0,0,0,null,0,null,null,{"$f":"D469*G469","v":0}]
[null,"-",0,0,0,null,0,null,null,{"$f":"D470*G470","v":0}]
[null,null,null,"Custo total de atividades auxiliares",{"$nulls":5},{"$f":"SUM(J469:J470)","v":0}]
[{"$nulls":7},"Subtotal",null,{"$f":"J461+J467+J471+J462+J463","v":1.5408587975624257}]
[null,"E - TEMPO FIXO",null,"Código","Quantidade","Unidade",null,"Custo Unitário","Custo Unitário"]
[null,"-",0,"-",0,"t",null,0,null,{"$f":"ROUNDDOWN(E474*H474,4)","v":0}]
[null,"-",0,"-",0,"t",null,0,null,{"$f":"ROUNDDOWN(E475*H475,4)","v":0}]
[null,null,null,"Custo unitário total de tempo fixo",{"$nulls":5},{"$f":"SUM(J474:J475)","v":0}]
[null,"F - MOMENTO DE TRANSPORTE",null,"Quantidade","Unidade","DMT",null,null,null,"Custo Unitário"]
[{"$nulls":5},"LN","RP","P"]
[null,"-",0,null,"tkm","5914449","5914464","5914479"]
[null,"-",0,null,"tkm","5914449","5914464","5914479"]
[null,null,null,"Custo unitário total de transporte"]
[{"$nulls":5},"Custo unitário direto total",null,null,null,{"$f":"TRUNC(J472+J476,2)","v":1.54}]
[null,"Obs."]
[]
[{"$f":"A442+1","v":10},"1ª/GRD",{"$nulls":8},{"$f":"J525","v":14.78}]
[null,"OBRA:","DRENAGEM E  PAVIMENTAÇÃO ASFÁLTICA EM CBUQ - AV. JOANA GOMES DOS SANTOS E ROTATÓRIA (SÃO JOÃO DO PACUÍ / MG)"]
[null,"Custo Unitário de Referência",null,null,"Minas Gerais"]
[{"$nulls":4}," Janeiro/2025 ",null,null,"Produção da equipe ",112.13,{"$f":"VLOOKUP(A485,ORÇAMENTO!$A$10:$L$58,7,1)","v":"M3"}]
[null,4011219,"EXECUÇÃO E COMPACTAÇÃO DE BASE PARA PAVIMENTAÇÃO COM SOLO ESTABILIZADO GRANULOMETRICAMENTE SEM MISTURA, COM MATERIAL DE JAZIDA - EXCLUSIVE TRANSPORTE",{"$nulls":5},"Valores em reais (R$)"]
[null,"A - EQUIPAMENTOS",null,"Quantidade","Utilização",null,"Custo Horário",null,null,"Custo"]
[{"$nulls":4},"Operativa","Improdutiva","Produtivo","Improdutivo",null,"Horário Total"]
[null,"E9571","Caminhão tanque com capacidade de 10.000 l - 188 kW",1,0.62,0.38,323.59019999999998,80.173299999999998,null,{"$f":"D492*(E492*G492+F492*H492)","v":231.09177800000001}]
[null,"E9518","Grade de 24 discos rebocável de D = 60 cm (24\")",1,0.34,0.65999999999999992,4.9436,3.4426000000000001,null,{"$f":"D493*(E493*G493+F493*H493)","v":3.9529399999999999}]
[null,"E9524","Motoniveladora - 93 kW",1,0.5,0.5,288.51479999999998,125.7629,null,207.13884999999999]
[null,"E9762","Rolo compactador de pneus autopropelido de 27 t - 85 kW",1,0.96,4.0000000000000036E-2,255.65049999999999,124.5621,null,250.40696399999999]
[null,"E9685","Rolo compactador pé de carneiro vibratório autopropelido por pneus de 11,6 t - 82 kW",1,1,0,225.9264,101.55289999999999,null,225.9264]
[null,"E9577","Trator agrícola sobre pneus - 77 kW",1,0.34,0.65999999999999992,152.69229999999999,55.394399999999997,null,{"$f":"D497*(E497*G497+F497*H497)","v":88.475685999999996}]
[{"$nulls":7},"Custo horário total de equipamentos",null,{"$f":"SUM(J492:J497)","v":1006.992618}]
[null,"B - MÃO DE OBRA",null,"Quantidade","Unidade",null,"Custo Horário","Custo Horário Total"]
[null,"P9824","Servente",1,"h",null,21.3355,null,null,{"$f":"D500*G500","v":21.3355}]
[null,"-",0,0,0,null,0,null,null,{"$f":"D501*G501","v":0}]
[null,null,null,"Custo horário total de mão de obra",{"$nulls":5},{"$f":"SUM(J500:J501)","v":21.3355}]
[null,null,null,"Custo horário total de execução",{"$nulls":5},{"$f":"J498+J502","v":1028.3281179999999}]
[null,null,null,"Custo unitário de execução",{"$nulls":5},{"$f":"J503/I488","v":9.1708563096405946}]
[{"$nulls":7},"Custo do FIC",null,0.18740000000000001]
[{"$nulls":7},"Custo do FIT",null,0]
[null,"C - MATERIAL",null,"Quantidade","Unidade",null,"Preço Unitário","Custo Unitário"]
[null,"-",0,null,0,null,0,null,null,{"$f":"D508*G508","v":0}]
[null,"-",0,null,0,null,0,null,null,{"$f":"D509*G509","v":0}]
[null,null,null,"Custo unitário total de material",{"$nulls":5},{"$f":"SUM(J508:J509)","v":0}]
[null,"D - ATIVIDADES AUXILIARES",null,"Quantidade","Unidade",null,"Custo Unitário","Custo Unitário"]
[null,4016096,"Escavação e carga de material de jazida com escavadeira hidráulica de 1,56 m³",1.1002700000000001,"m³",null,1.37,null,null,{"$f":"D512*G512","v":1.5073699000000003}]
[null,"-",0,0,0,null,0,null,null,{"$f":"D513*G513","v":0}]
[null,null,null,"Custo total de atividades auxiliares",{"$nulls":5},{"$f":"SUM(J512:J513)","v":1.5073699000000003}]
[{"$nulls":7},"Subtotal",null,{"$f":"J504+J510+J514+J505+J506","v":10.865626209640595}]
[null,"E - TEMPO FIXO",null,"Código","Quantidade","Unidade",null,"Custo Unitário","Custo Unitário"]
[null,4016096,"Escavação e carga de material de jazida com escavadeira hidráulica de 1,56 m³",5914354,2.0630099999999998,"t",null,1.9,null,{"$f":"ROUNDDOWN(E517*H517,4)","v":3.9197000000000002}]
[null,"-",0,"-",null,"t",null,0,null,{"$f":"ROUNDDOWN(E518*H518,4)","v":0}]
[null,null,null,"Custo unitário total de tempo fixo",{"$nulls":5},{"$f":"SUM(J517:J518)","v":3.9197000000000002}]
[null,"F - MOMENTO DE TRANSPORTE",null,"Quantidade","Unidade","DMT",null,null,null,"Custo Unitário"]
[{"$nulls":5},"LN","RP","P"]
[null,4016096,"Escavação e carga de material de jazida com escavadeira hidráulica de 1,56 m³",2.0630099999999998,"tkm","5914359","5914374","5914389"]
[null,"-",0,0,"tkm"]
[null,null,null,"Custo unitário total de transporte"]
[{"$nulls":5},"Custo unitário direto total",null,null,null,{"$f":"TRUNC(J515+J519,2)","v":14.78}]
[null,"Obs."]
[]
[12,"1ª/GRD",{"$nulls":8},{"$f":"J564","v":0.4}]
[null,"OBRA:","DRENAGEM E  PAVIMENTAÇÃO ASFÁLTICA EM CBUQ - AV. JOANA GOMES DOS SANTOS E ROTATÓRIA (SÃO JOÃO DO PACUÍ / MG)"]
[null,"Custo Unitário de Referência",null,null,"Minas Gerais"]
[{"$nulls":4}," Janeiro/2025 ",null,null,"Produção da equipe ",1038.46,{"$f":"VLOOKUP(A528,ORÇAMENTO!$A$10:$L$58,7,1)","v":"M2"}]
[null,4011352,"IMPRIMAÇÃO COM EMULSÃO ASFÁLTICA (EAI)",{"$nulls":5},"Valores em reais (R$)"]
[null,"A - EQUIPAMENTOS",null,"Quantidade","Utilização",null,"Custo Horário",null,null,"Custo"]
[{"$nulls":4},"Operativa","Improdutiva","Produtivo","Improdutivo",null,"Horário Total"]
[null,"E9509","Caminhão tanque distribuidor de asfalto com capacidade de 6.000 l - 7 kW/136 kW",1,1,0,261.03050000000002,72.388300000000001,null,{"$f":"D535*(E535*G535+F535*H535)","v":261.03050000000002}]
[null,"E9558","Tanque de estocagem de asfalto com capacidade de 30.000 l",2,1,0,56.138500000000001,38.346699999999998,null,{"$f":"D536*(E536*G536+F536*H536)","v":112.277}]
[{"$nulls":7},"Custo horário total de equipamentos",null,{"$f":"SUM(J535:J536)","v":373.3075}]
[null,"B - MÃO DE OBRA",null,"Quantidade","Unidade",null,"Custo Horário","Custo Horário Total"]
[null,"P9824","Servente",2,"h",null,21.3355,null,null,{"$f":"D539*G539","v":42.670999999999999}]
[null,"-",{"$nulls":7},{"$f":"D540*G540","v":0}]
[null,null,null,"Custo horário total de mão de obra",{"$nulls":5},{"$f":"SUM(J539:J540)","v":42.670999999999999}]
[null,null,null,"Custo horário total de execução",{"$nulls":5},{"$f":"J537+J541","v":415.9785}]
[null,null,null,"Custo unitário de execução",{"$nulls":5},{"$f":"J542/I531","v":0.40057248232960341}]
[{"$nulls":7},"Custo do FIC",null,1.4E-3]
[{"$nulls":7},"Custo do FIT",null,0]
[null,"C - MATERIAL",null,"Quantidade","Unidade",null,"Preço Unitário","Custo Unitário"]
[null,"M2092","Emulsão asfáltica para imprimação",1.2999999999999999E-3,"t",null,0,"FORNECIMENTO COM BDI DIFERENCIADO",null,{"$f":"D547*G547","v":0}]
[null,"-",0,89.28,0,null,0,null,null,{"$f":"D548*G548","v":0}]
[null,null,null,"Custo unitário total de material",{"$nulls":5},{"$f":"SUM(J547:J548)","v":0}]
[null,"D - ATIVIDADES AUXILIARES",null,"Quantidade","Unidade",null,"Custo Unitário","Custo Unitário"]
[null,"-",0,0,0,null,0,null,null,{"$f":"D551*G551","v":0}]
[null,"-",0,0,0,null,0,null,null,{"$f":"D552*G552","v":0}]
[null,null,null,"Custo total de atividades auxiliares",{"$nulls":5},{"$f":"SUM(J551:J552)","v":0}]
[{"$nulls":7},"Subtotal",null,{"$f":"J543+J549+J553+J544+J545","v":0.40197248232960342}]
[null,"E - TEMPO FIXO",null,"Código","Quantidade","Unidade",null,"Custo Unitário","Custo Unitário"]
[null,"-",0,"-",0,"t",null,0,null,{"$f":"ROUNDDOWN(E556*H556,4)","v":0}]
[null,"-",0,"-",0,"t",null,0,null,{"$f":"ROUNDDOWN(E557*H557,4)","v":0}]
[null,null,null,"Custo unitário total de tempo fixo",{"$nulls":5},{"$f":"SUM(J556:J557)","v":0}]
[null,"F - MOMENTO DE TRANSPORTE",null,"Quantidade","Unidade","DMT",null,null,null,"Custo Unitário"]
[{"$nulls":5},"LN","RP","P"]
[null,"-",0,null,"tkm"]
[null,"-",0,null,"tkm"]
[null,null,null,"Custo unitário total de transporte"]
[{"$nulls":5},"Custo unitário direto total",null,null,null,{"$f":"TRUNC(J554+J558,2)","v":0.4}]
[null,"Obs."]
[]
[{"$f":"A528+1","v":13},"1ª/GRD",{"$nulls":8},{"$f":"J603","v":0.27}]
[null,"OBRA:","DRENAGEM E  PAVIMENTAÇÃO ASFÁLTICA EM CBUQ - AV. JOANA GOMES DOS SANTOS E ROTATÓRIA (SÃO JOÃO DO PACUÍ / MG)"]
[null,"Custo Unitário de Referência",null,null,"Minas Gerais"]
[{"$nulls":4}," Janeiro/2025 ",null,null,"Produção da equipe ",1500,{"$f":"VLOOKUP(A567,ORÇAMENTO!$A$10:$L$58,7,1)","v":"M2"}]
[null,4011353,"PINTURA DE LIGAÇÃO COM EMULSÃO ASFÁLTICA RR-1C",{"$nulls":5},"Valores em reais (R$)"]
[null,"A - EQUIPAMENTOS",null,"Quantidade","Utilização",null,"Custo Horário",null,null,"Custo"]
[{"$nulls":4},"Operativa","Improdutiva","Produtivo","Improdutivo",null,"Horário Total"]
[null,"E9509","Caminhão tanque distribuidor de asfalto com capacidade de 6.000 l - 7 kW/136 kW",1,1,0,261.03050000000002,72.388300000000001,null,{"$f":"D574*(E574*G574+F574*H574)","v":261.03050000000002}]
[null,"E9558","Tanque de estocagem de asfalto com capacidade de 30.000 l",2,1,0,56.138500000000001,38.346699999999998,null,{"$f":"D575*(E575*G575+F575*H575)","v":112.277}]
[{"$nulls":7},"Custo horário total de equipamentos",null,{"$f":"SUM(J574:J575)","v":373.3075}]
[null,"B - MÃO DE OBRA",null,"Quantidade","Unidade",null,"Custo Horário","Custo Horário Total"]
[null,"P9824","Servente",2,"h",null,21.3355,null,null,{"$f":"D578*G578","v":42.670999999999999}]
[null,"-",{"$nulls":7},{"$f":"D579*G579","v":0}]
[null,null,null,"Custo horário total de mão de obra",{"$nulls":5},{"$f":"SUM(J578:J579)","v":42.670999999999999}]
[null,null,null,"Custo horário total de execução",{"$nulls":5},{"$f":"J576+J580","v":415.9785}]
[null,null,null,"Custo unitário de execução",{"$nulls":5},{"$f":"J581/I570","v":0.27731899999999998}]
[{"$nulls":7},"Custo do FIC",null,8.9999999999999998E-4]
[{"$nulls":7},"Custo do FIT",null,0]
[null,"C - MATERIAL",null,"Quantidade","Unidade",null,"Preço Unitário","Custo Unitário"]
[null,"M1946","Emulsão asfáltica - RR-1C",4.4999999999999999E-4,"t",null,0,"FORNECIMENTO COM BDI DIFERENCIADO",null,{"$f":"D586*G586","v":0}]
[null,"-",0,null,0,null,0,null,null,{"$f":"D587*G587","v":0}]
[null,null,null,"Custo unitário total de material",{"$nulls":5},{"$f":"SUM(J586:J587)","v":0}]
[null,"D - ATIVIDADES AUXILIARES",null,"Quantidade","Unidade",null,"Custo Unitário","Custo Unitário"]
[null,"-",0,0,0,null,0,null,null,{"$f":"D590*G590","v":0}]
[null,"-",0,0,0,null,0,null,null,{"$f":"D591*G591","v":0}]
[null,null,null,"Custo total de atividades auxiliares",{"$nulls":5},{"$f":"SUM(J590:J591)","v":0}]
[{"$nulls":7},"Subtotal",null,{"$f":"J582+J588+J592+J583+J584","v":0.27821899999999999}]
[null,"E - TEMPO FIXO",null,"Código","Quantidade","Unidade",null,"Custo Unitário","Custo Unitário"]
[null,"-",0,"-",0,"t",null,0,null,{"$f":"ROUNDDOWN(E595*H595,4)","v":0}]
[null,"-",0,"-",0,"t",null,0,null,{"$f":"ROUNDDOWN(E596*H596,4)","v":0}]
[null,null,null,"Custo unitário total de tempo fixo",{"$nulls":5},{"$f":"SUM(J595:J596)","v":0}]
[null,"F - MOMENTO DE TRANSPORTE",null,"Quantidade","Unidade","DMT",null,null,null,"Custo Unitário"]
[{"$nulls":5},"LN","RP","P"]
[null,"-",0,null,"tkm"]
[null,"-",0,null,"tkm"]
[null,null,null,"Custo unitário total de transporte"]
[{"$nulls":5},"Custo unitário direto total",null,null,null,{"$f":"TRUNC(J593+J597,2)","v":0.27}]
[null,"Obs."]
[]
[{"$f":"A567+1","v":14},"1ª/GRD",{"$nulls":8},{"$f":"J643","v":190.78}]
[null,"OBRA:","DRENAGEM E  PAVIMENTAÇÃO ASFÁLTICA EM CBUQ - AV. JOANA GOMES DOS SANTOS E ROTATÓRIA (SÃO JOÃO DO PACUÍ / MG)"]
[null,"Custo Unitário de Referência",null,null,"Minas Gerais"]
[{"$nulls":4}," Janeiro/2025 ",null,null,"Produção da equipe ",99.6,{"$f":"VLOOKUP(A606,ORÇAMENTO!$A$10:$L$58,7,1)","v":"T"}]
[null,4011463,"EXECUÇÃO DE PAVIMENTO COM APLICAÇÃO DE CONCRETO ASFÁLTICO USINADO A QUENTE (CBUQ), CAMADA DE ROLAMENTO - EXCLUSIVE TRANSPORTE",{"$nulls":5},"Valores em reais (R$)"]
[null,"A - EQUIPAMENTOS",null,"Quantidade","Utilização",null,"Custo Horário",null,null,"Custo"]
[{"$nulls":4},"Operativa","Improdutiva","Produtivo","Improdutivo",null,"Horário Total"]
[null,"E9762","Rolo compactador de pneus autopropelido de 27 t - 85 kW",1,0.71,0.28999999999999998,255.65049999999999,124.5621,null,{"$f":"D613*(E613*G613+F613*H613)","v":217.63486399999999}]
[null,"E9681","Rolo compactador liso tandem vibratório autopropelido de 10,4 t - 82 kW",1,0.82,0.18,296.77460000000002,113.3899,null,{"$f":"D614*(E614*G614+F614*H614)","v":263.765354}]
[null,"E9545","Vibroacabadora de asfalto sobre esteiras - 97 kW",1,1,0,359.27379999999999,154.22659999999999,null,{"$f":"D615*(E615*G615+F615*H615)","v":359.27379999999999}]
[{"$nulls":7},"Custo horário total de equipamentos",null,{"$f":"SUM(J613:J615)","v":840.67401799999993}]
[null,"B - MÃO DE OBRA",null,"Quantidade","Unidade",null,"Custo Horário","Custo Horário Total"]
[null,"P9824","Servente",8,"h",null,21.3355,null,null,{"$f":"D618*G618","v":170.684}]
[null,"-",0,null,0,null,0,null,null,{"$f":"D619*G619","v":0}]
[null,null,null,"Custo horário total de mão de obra",{"$nulls":5},{"$f":"SUM(J618:J619)","v":170.684}]
[null,null,null,"Custo horário total de execução",{"$nulls":5},{"$f":"J616+J620","v":1011.3580179999999}]
[null,null,null,"Custo unitário de execução",{"$nulls":5},{"$f":"J621/I609","v":10.154196967871485}]
[{"$nulls":7},"Custo do FIC",null,3.8600000000000002E-2]
[{"$nulls":7},"Custo do FIT",null,0]
[null,"C - MATERIAL",null,"Quantidade","Unidade",null,"Preço Unitário","Custo Unitário"]
[null,"-",0,null,0,null,0,null,null,{"$f":"D626*G626","v":0}]
[null,"-",0,null,0,null,0,null,null,{"$f":"D627*G627","v":0}]
[null,null,null,"Custo unitário total de material",{"$nulls":5},{"$f":"SUM(J626:J627)","v":0}]
[null,"D - ATIVIDADES AUXILIARES",null,"Quantidade","Unidade",null,"Custo Unitário","Custo Unitário"]
[null,6416078,"Usinagem de concreto asfáltico - faixa C-12,5 - areia e brita comerciais",1,"t",null,172.54536519476304,null,null,{"$f":"D630*G630","v":172.54536519476304}]
[null,"-",0,0,0,null,0,null,null,{"$f":"D631*G631","v":0}]
[null,null,null,"Custo total de atividades auxiliares",{"$nulls":5},{"$f":"SUM(J630:J631)","v":172.54536519476304}]
[{"$nulls":7},"Subtotal",null,{"$f":"J622+J628+J632+J623+J624","v":182.73816216263452}]
[null,"E - TEMPO FIXO",null,"Código","Quantidade","Unidade",null,"Custo Unitário","Custo Unitário"]
[null,6416078,"Usinagem de concreto asfáltico - faixa C-12,5 - areia e brita comerciais",5914649,1,"t",null,8.0500000000000007,null,{"$f":"ROUNDDOWN(E635*H635,4)","v":8.0500000000000007}]
[null,"-",0,"-",0,"t",null,0,null,{"$f":"ROUNDDOWN(E636*H636,4)","v":0}]
[null,null,null,"Custo unitário total de tempo fixo",{"$nulls":5},{"$f":"SUM(J635:J636)","v":8.0500000000000007}]
[null,"F - MOMENTO DE TRANSPORTE",null,"Quantidade","Unidade","DMT",null,null,null,"Custo Unitário"]
[{"$nulls":5},"LN","RP","P"]
[null,6416078,"Usinagem de concreto asfáltico - faixa C-12,5 - areia e brita comerciais",1,"tkm"]
[null,"-",0,0,"tkm"]
[null,null,null,"Custo unitário total de transporte"]
[{"$nulls":5},"Custo unitário direto total",null,null,null,{"$f":"TRUNC(J633+J637,2)","v":190.78}]
[null,"Obs."]
[]
[null,"1ª/GRD",{"$nulls":8},{"$f":"J697","v":172.54536519476304}]
[null,"OBRA:","DRENAGEM E  PAVIMENTAÇÃO ASFÁLTICA EM CBUQ - AV. JOANA GOMES DOS SANTOS E ROTATÓRIA (SÃO JOÃO DO PACUÍ / MG)"]
[null,"Custo Unitário de Referência - Auxiliar",null,null,"Minas Gerais"]
[{"$nulls":4}," Janeiro/2025 ",null,null,"Produção da equipe ",99.6,"t"]
[null,6416078,"Usinagem de concreto asfáltico - faixa C - areia e brita comerciais",{"$nulls":5},"Valores em reais (R$)"]
[null,"A - EQUIPAMENTOS",null,"Quantidade","Utilização",null,"Custo Horário",null,null,"Custo"]
[{"$nulls":4},"Operativa","Improdutiva","Produtivo","Improdutivo",null,"Horário Total"]
[null,"E9559","Aquecedor de fluido térmico - 12 kW",1,1,0,70.491399999999999,40.1297,null,{"$f":"D653*(E653*G653+F653*H653)","v":70.491399999999999}]
[null,"E9584","Carregadeira de pneus com capacidade de 1,72 m³ - 113 kW",1,0.86,0.14000000000000001,207.59360000000001,103.7398,null,{"$f":"D654*(E654*G654+F654*H654)","v":193.054068}]
[null,"E9021","Grupo gerador - 456 kVA",1,1,0,415.94510000000002,22.186399999999999,null,415.94510000000002]
[null,"E9558","Tanque de estocagem de asfalto com capacidade de 30.000 l",2,1,0,56.138500000000001,38.346699999999998,null,112.277]
[null,"E9689","Usina de asfalto a quente gravimétrica com capacidade de 100/140 t/h - 260 kW",1,1,0,1239.9634000000001,657.78120000000001,null,{"$f":"D657*(E657*G657+F657*H657)","v":1239.9634000000001}]
[{"$nulls":7},"Custo horário total de equipamentos",null,{"$f":"SUM(J653:J657)","v":2031.7309680000003}]
[null,"B - MÃO DE OBRA",null,"Quantidade","Unidade",null,"Custo Horário","Custo Horário Total"]
[null,"P9824","Servente",4,"h",null,21.3355,null,null,{"$f":"D660*G660","v":85.341999999999999}]
[null,null,null,"Custo horário total de mão de obra",{"$nulls":5},{"$f":"SUM(J660:J660)","v":85.341999999999999}]
[null,null,null,"Custo horário total de execução",{"$nulls":5},{"$f":"J658+J661","v":2117.0729680000004}]
[null,null,null,"Custo unitário de execução",{"$nulls":5},{"$f":"J662/I649","v":21.255752690763057}]
[{"$nulls":7},"Custo do FIC",null,0]
[{"$nulls":7},"Custo do FIT",null,0]
[null,"C - MATERIAL",null,"Quantidade","Unidade",null,"Preço Unitário","Custo Unitário"]
[null,"M0028","Areia média",2.7009999999999999E-2,"m³",null,158.15639999999999,null,null,{"$f":"D667*G667","v":4.2718043639999994}]
[null,"M0005","Brita 0",9.0029999999999999E-2,"m³",null,116.2,null,null,{"$f":"D668*G668","v":10.461486000000001}]
[null,"M0191","Brita 1",3.2149999999999998E-2,"m³",null,116.2,null,null,3.73583]
[null,"M0344","Cal hidratada - a granel",14.4636,"kg",null,0.61650000000000005,null,null,8.9168094]
[null,"M1943","Cimento asfáltico de petróleo - CAP 50/70",5.5449999999999999E-2,"t",null,0,"FORNECIMENTO COM BDI DIFERENCIADO",null,0]
[null,"M1941","Óleo tipo A1",8,"l",null,6.3849,null,null,51.0792]
[null,"M1103","Pedrisco",0.1479,"m³",null,176.94059999999999,null,null,{"$f":"D673*G673","v":26.16951474}]
[null,"M1135","Pó de pedra",0.33631,"m³",null,132.80000000000001,null,null,44.661968000000002]
[null,null,null,"Custo unitário total de material",{"$nulls":5},{"$f":"SUM(J667:J674)","v":149.296612504}]
[null,"D - ATIVIDADES AUXILIARES",null,"Quantidade","Unidade",null,"Custo Unitário","Custo Unitário"]
[null,"-",0,0,0,null,0,null,null,{"$f":"D677*G677","v":0}]
[null,null,null,"Custo total de atividades auxiliares",{"$nulls":5},{"$f":"SUM(J677:J677)","v":0}]
[{"$nulls":7},"Subtotal",null,{"$f":"J663+J675+J678+J664+J665","v":170.55236519476304}]
[null,"E - TEMPO FIXO",null,"Código","Quantidade","Unidade",null,"Custo Unitário","Custo Unitário"]
[null,"M0028","Areia média",5914647,4.052E-2,"t",null,1.83,null,{"$f":"ROUNDDOWN(E681*H681,4)","v":7.4099999999999999E-2}]
[null,"M0005","Brita 0",5914647,0.13505,"t",null,1.83,null,0.24709999999999999]
[null,"M0191","Brita 1",5914647,4.8230000000000002E-2,"t",null,1.83,null,8.8200000000000001E-2]
[null,"M0344","Cal hidratada - a granel",5914363,1.4460000000000001E-2,"t",null,17.61,null,0.25459999999999999]
[null,"M1103","Pedrisco",5914647,0.22184999999999999,"t",null,1.83,null,{"$f":"ROUNDDOWN(E685*H685,4)","v":0.40589999999999998}]
[null,"M1135","Pó de pedra",5914647,0.50446999999999997,"t",null,1.83,null,{"$f":"ROUNDDOWN(E686*H686,4)","v":0.92310000000000003}]
[null,null,null,"Custo unitário total de tempo fixo",{"$nulls":5},{"$f":"SUM(J681:J686)","v":1.9929999999999999}]
[null,"F - MOMENTO DE TRANSPORTE",null,"Quantidade","Unidade","DMT",null,null,null,"Custo Unitário"]
[{"$nulls":5},"LN","RP","P"]
[null,"M0028","Areia média",4.052E-2,"tkm"]
[null,"M0005","Brita 0",0.13505,"tkm"]
[null,"M0191","Brita 1",4.8230000000000002E-2,"tkm"]
[null,"M0344","Cal hidratada - a granel",1.4460000000000001E-2,"tkm"]
[null,"M1103","Pedrisco",0.22184999999999999,"tkm"]
[null,"M1135","Pó de pedra",0.50446999999999997,"tkm"]
[null,null,null,"Custo unitário total de transporte"]
[{"$nulls":5},"Custo unitário direto total",null,null,null,{"$f":"J679+J687","v":172.54536519476304}]
[null,"Obs."]
[]
[{"$f":"A606+1","v":15},"1ª/GRD",{"$nulls":8},{"$f":"J736","v":0.54}]
[null,"OBRA:","DRENAGEM E  PAVIMENTAÇÃO ASFÁLTICA EM CBUQ - AV. JOANA GOMES DOS SANTOS E ROTATÓRIA (SÃO JOÃO DO PACUÍ / MG)"]
[null,"Custo Unitário de Referência",null,null,"Minas Gerais"]
[{"$nulls":4}," Janeiro/2025 ",null,null,"Produção da equipe ",570.61,{"$f":"VLOOKUP(A700,ORÇAMENTO!$A$10:$L$58,7,1)","v":"TXKM"}]
[null,5915321,"TRANSPORTE COM CAMINHÃO BASCULANTE, EM RODOVIA PAVIMENTADA",{"$nulls":5},"Valores em reais (R$)"]
[null,"A - EQUIPAMENTOS",null,"Quantidade","Utilização",null,"Custo Horário",null,null,"Custo"]
[{"$nulls":4},"Operativa","Improdutiva","Produtivo","Improdutivo",null,"Horário Total"]
[null,"E9667","Caminhão basculante com capacidade de 14 m³ - 210 kW",1,1,0,309.83940000000001,90.412199999999999,null,{"$f":"D707*(E707*G707+F707*H707)","v":309.83940000000001}]
[null,"-",0,null,null,null,0,0,null,{"$f":"D708*(E708*G708+F708*H708)","v":0}]
[{"$nulls":7},"Custo horário total de equipamentos",null,{"$f":"SUM(J707:J708)","v":309.83940000000001}]
[null,"B - MÃO DE OBRA",null,"Quantidade","Unidade",null,"Custo Horário","Custo Horário Total"]
[null,"-",0,null,0,null,0,null,null,{"$f":"D711*G711","v":0}]
[null,"-",0,null,0,null,0,null,null,{"$f":"D712*G712","v":0}]
[null,null,null,"Custo horário total de mão de obra",{"$nulls":5},{"$f":"SUM(J711:J712)","v":0}]
[null,null,null,"Custo horário total de execução",{"$nulls":5},{"$f":"J709+J713","v":309.83940000000001}]
[null,null,null,"Custo unitário de execução",{"$nulls":5},{"$f":"J714/I703","v":0.54299679290583758}]
[{"$nulls":7},"Custo do FIC",null,0]
[{"$nulls":7},"Custo do FIT",null,0]
[null,"C - MATERIAL",null,"Quantidade","Unidade",null,"Preço Unitário","Custo Unitário"]
[null,"-",0,0,0,null,0,null,null,{"$f":"D719*G719","v":0}]
[null,"-",0,0,0,null,0,null,null,{"$f":"D720*G720","v":0}]
[null,null,null,"Custo unitário total de material",{"$nulls":5},{"$f":"SUM(J719:J720)","v":0}]
[null,"D - ATIVIDADES AUXILIARES",null,"Quantidade","Unidade",null,"Custo Unitário","Custo Unitário"]
[null,"-",0,0,0,null,0,null,null,{"$f":"D723*G723","v":0}]
[null,"-",0,0,0,null,0,null,null,{"$f":"D724*G724","v":0}]
[null,null,null,"Custo total de atividades auxiliares",{"$nulls":5},{"$f":"SUM(J723:J724)","v":0}]
[{"$nulls":7},"Subtotal",null,{"$f":"J715+J721+J725+J716+J717","v":0.54299679290583758}]
[null,"E - TEMPO FIXO",null,"Código","Quantidade","Unidade",null,"Custo Unitário","Custo Unitário"]
[null,"-",0,"-",0,"t",null,0,null,{"$f":"ROUNDDOWN(E728*H728,4)","v":0}]
[null,"-",0,"-",0,"t",null,0,null,{"$f":"ROUNDDOWN(E729*H729,4)","v":0}]
[null,null,null,"Custo unitário total de tempo fixo",{"$nulls":5},{"$f":"SUM(J728:J729)","v":0}]
[null,"F - MOMENTO DE TRANSPORTE",null,"Quantidade","Unidade","DMT",null,null,null,"Custo Unitário"]
[{"$nulls":5},"LN","RP","P"]
[null,"-",0,0,"tkm"]
[null,"-",0,0,"tkm"]
[null,null,null,"Custo unitário total de transporte"]
[{"$nulls":5},"Custo unitário direto total",null,null,null,{"$f":"TRUNC(J726+J730,2)","v":0.54}]
[null,"Obs."]
[]
[16,"1ª/GRD",{"$nulls":8},{"$f":"J775","v":0.72}]
[null,"OBRA:","DRENAGEM E  PAVIMENTAÇÃO ASFÁLTICA EM CBUQ - AV. JOANA GOMES DOS SANTOS E ROTATÓRIA (SÃO JOÃO DO PACUÍ / MG)"]
[null,"Custo Unitário de Referência",null,null,"Minas Gerais"]
[{"$nulls":4}," Janeiro/2025 ",null,null,"Produção da equipe ",435.75,{"$f":"VLOOKUP(A739,ORÇAMENTO!$A$10:$L$58,7,1)","v":"TXKM"}]
[null,5915320,"TRANSPORTE COM CAMINHÃO BASCULANTE, RODOVIA EM REVESTIMENTO PRIMÁRIO",{"$nulls":5},"Valores em reais (R$)"]
[null,"A - EQUIPAMENTOS",null,"Quantidade","Utilização",null,"Custo Horário",null,null,"Custo"]
[{"$nulls":4},"Operativa","Improdutiva","Produtivo","Improdutivo",null,"Horário Total"]
[null,"E9667","Caminhão basculante com capacidade de 14 m³ - 210 kW",1,1,0,309.83940000000001,90.412199999999999,null,{"$f":"D746*(E746*G746+F746*H746)","v":309.83940000000001}]
[null,"-",0,null,null,null,0,0,null,{"$f":"D747*(E747*G747+F747*H747)","v":0}]
[{"$nulls":7},"Custo horário total de equipamentos",null,{"$f":"SUM(J746:J747)","v":309.83940000000001}]
[null,"B - MÃO DE OBRA",null,"Quantidade","Unidade",null,"Custo Horário","Custo Horário Total"]
[null,"-",0,null,0,null,0,null,null,{"$f":"D750*G750","v":0}]
[null,"-",0,null,0,null,0,null,null,{"$f":"D751*G751","v":0}]
[null,null,null,"Custo horário total de mão de obra",{"$nulls":5},{"$f":"SUM(J750:J751)","v":0}]
[null,null,null,"Custo horário total de execução",{"$nulls":5},{"$f":"J748+J752","v":309.83940000000001}]
[null,null,null,"Custo unitário de execução",{"$nulls":5},{"$f":"J753/I742","v":0.71104853700516357}]
[{"$nulls":7},"Custo do FIC",null,1.4E-2]
[{"$nulls":7},"Custo do FIT",null,0]
[null,"C - MATERIAL",null,"Quantidade","Unidade",null,"Preço Unitário","Custo Unitário"]
[null,"-",0,0,0,null,0,null,null,{"$f":"D758*G758","v":0}]
[null,"-",0,0,0,null,0,null,null,{"$f":"D759*G759","v":0}]
[null,null,null,"Custo unitário total de material",{"$nulls":5},{"$f":"SUM(J758:J759)","v":0}]
[null,"D - ATIVIDADES AUXILIARES",null,"Quantidade","Unidade",null,"Custo Unitário","Custo Unitário"]
[null,"-",0,0,0,null,0,null,null,{"$f":"D762*G762","v":0}]
[null,"-",0,0,0,null,0,null,null,{"$f":"D763*G763","v":0}]
[null,null,null,"Custo total de atividades auxiliares",{"$nulls":5},{"$f":"SUM(J762:J763)","v":0}]
[{"$nulls":7},"Subtotal",null,{"$f":"J754+J760+J764+J755+J756","v":0.72504853700516358}]
[null,"E - TEMPO FIXO",null,"Código","Quantidade","Unidade",null,"Custo Unitário","Custo Unitário"]
[null,"-",0,"-",0,"t",null,0,null,{"$f":"ROUNDDOWN(E767*H767,4)","v":0}]
[null,"-",0,"-",0,"t",null,0,null,{"$f":"ROUNDDOWN(E768*H768,4)","v":0}]
[null,null,null,"Custo unitário total de tempo fixo",{"$nulls":5},{"$f":"SUM(J767:J768)","v":0}]
[null,"F - MOMENTO DE TRANSPORTE",null,"Quantidade","Unidade","DMT",null,null,null,"Custo Unitário"]
[{"$nulls":5},"LN","RP","P"]
[null,"-",0,0,"tkm"]
[null,"-",0,0,"tkm"]
[null,null,null,"Custo unitário total de transporte"]
[{"$nulls":5},"Custo unitário direto total",null,null,null,{"$f":"TRUNC(J765+J769,2)","v":0.72}]
[null,"Obs."]
[]
[{"$f":"A739+1","v":17},"1ª/GRD",{"$nulls":8},{"$f":"J814","v":0.74}]
[null,"OBRA:","DRENAGEM E  PAVIMENTAÇÃO ASFÁLTICA EM CBUQ - AV. JOANA GOMES DOS SANTOS E ROTATÓRIA (SÃO JOÃO DO PACUÍ / MG)"]
[null,"Custo Unitário de Referência",null,null,"Minas Gerais"]
[{"$nulls":4}," Janeiro/2025 ",null,null,"Produção da equipe ",241.03,{"$f":"VLOOKUP(A778,ORÇAMENTO!$A$10:$L$58,7,1)","v":"TXKM"}]
[null,5914434,"TRANSPORTE COM CAMINHÃO CARROCERIA 9T, EM VIA URBANA PAVIMENTADA",{"$nulls":5},"Valores em reais (R$)"]
[null,"A - EQUIPAMENTOS",null,"Quantidade","Utilização",null,"Custo Horário",null,null,"Custo"]
[{"$nulls":4},"Operativa","Improdutiva","Produtivo","Improdutivo",null,"Horário Total"]
[null,"E9508","Caminhão carroceria com capacidade de 9 t - 136 kW",1,1,0,178.82759999999999,67.927099999999996,null,{"$f":"D785*(E785*G785+F785*H785)","v":178.82759999999999}]
[null,"-",0,null,null,null,0,0,null,{"$f":"D786*(E786*G786+F786*H786)","v":0}]
[{"$nulls":7},"Custo horário total de equipamentos",null,{"$f":"SUM(J785:J786)","v":178.82759999999999}]
[null,"B - MÃO DE OBRA",null,"Quantidade","Unidade",null,"Custo Horário","Custo Horário Total"]
[null,"-",0,0,0,null,0,null,null,{"$f":"D789*G789","v":0}]
[null,"-",0,0,0,null,0,null,null,{"$f":"D790*G790","v":0}]
[null,null,null,"Custo horário total de mão de obra",{"$nulls":5},{"$f":"SUM(J789:J790)","v":0}]
[null,null,null,"Custo horário total de execução",{"$nulls":5},{"$f":"J787+J791","v":178.82759999999999}]
[null,null,null,"Custo unitário de execução",{"$nulls":5},{"$f":"J792/I781","v":0.7419308799734472}]
[{"$nulls":7},"Custo do FIC",null,0]
[{"$nulls":7},"Custo do FIT",null,0]
[null,"C - MATERIAL",null,"Quantidade","Unidade",null,"Preço Unitário","Custo Unitário"]
[null,"-",0,0,0,null,0,null,null,{"$f":"D797*G797","v":0}]
[null,"-",0,0,0,null,0,null,null,{"$f":"D798*G798","v":0}]
[null,null,null,"Custo unitário total de material",{"$nulls":5},{"$f":"SUM(J797:J798)","v":0}]
[null,"D - ATIVIDADES AUXILIARES",null,"Quantidade","Unidade",null,"Custo Unitário","Custo Unitário"]
[null,"-",0,0,0,null,0,null,null,{"$f":"D801*G801","v":0}]
[null,"-",0,0,0,null,0,null,null,{"$f":"D802*G802","v":0}]
[null,null,null,"Custo total de atividades auxiliares",{"$nulls":5},{"$f":"SUM(J801:J802)","v":0}]
[{"$nulls":7},"Subtotal",null,{"$f":"J793+J799+J803+J794+J795","v":0.7419308799734472}]
[null,"E - TEMPO FIXO",null,"Código","Quantidade","Unidade",null,"Custo Unitário","Custo Unitário"]
[null,"-",0,"-",0,"t",null,0,null,{"$f":"ROUNDDOWN(E806*H806,4)","v":0}]
[null,"-",0,"-",0,"t",null,0,null,{"$f":"ROUNDDOWN(E807*H807,4)","v":0}]
[null,null,null,"Custo unitário total de tempo fixo",{"$nulls":5},{"$f":"SUM(J806:J807)","v":0}]
[null,"F - MOMENTO DE TRANSPORTE",null,"Quantidade","Unidade","DMT",null,null,null,"Custo Unitário"]
[{"$nulls":5},"LN","RP","P"]
[null,"-",0,0,"tkm"]
[null,"-",0,0,"tkm"]
[null,null,null,"Custo unitário total de transporte"]
[{"$nulls":5},"Custo unitário direto total",null,null,null,{"$f":"TRUNC(J804+J808,2)","v":0.74}]
[null,"Obs."]
[]
[{"$f":"A778+1","v":18},"1ª/GRD",{"$nulls":8},{"$f":"J853","v":0.93}]
[null,"OBRA:","DRENAGEM E  PAVIMENTAÇÃO ASFÁLTICA EM CBUQ - AV. JOANA GOMES DOS SANTOS E ROTATÓRIA (SÃO JOÃO DO PACUÍ / MG)"]
[null,"Custo Unitário de Referência",null,null,"Minas Gerais"]
[{"$nulls":4}," Janeiro/2025 ",null,null,"Produção da equipe ",284.10000000000002,{"$f":"VLOOKUP(A817,ORÇAMENTO!$A$10:$L$58,7,1)","v":"TXKM"}]
[null,5914612,"TRANSPORTE DE MASSA ASFÁLTICA COM CAMINHÃO BASCULANTE, EM VIA URBANA PAVIMENTADA",{"$nulls":5},"Valores em reais (R$)"]
[null,"A - EQUIPAMENTOS",null,"Quantidade","Utilização",null,"Custo Horário",null,null,"Custo"]
[{"$nulls":4},"Operativa","Improdutiva","Produtivo","Improdutivo",null,"Horário Total"]
[null,"E9520","Caminhão com caçamba térmica com capacidade de 6 m³ - 188 kW",1,1,0,265.74349999999998,76.6511,null,{"$f":"D824*(E824*G824+F824*H824)","v":265.74349999999998}]
[null,"-",0,null,null,null,0,0,null,{"$f":"D825*(E825*G825+F825*H825)","v":0}]
[{"$nulls":7},"Custo horário total de equipamentos",null,{"$f":"SUM(J824:J825)","v":265.74349999999998}]
[null,"B - MÃO DE OBRA",null,"Quantidade","Unidade",null,"Custo Horário","Custo Horário Total"]
[null,"-",0,0,0,null,0,null,null,{"$f":"D828*G828","v":0}]
[null,"-",0,0,0,null,0,null,null,{"$f":"D829*G829","v":0}]
[null,null,null,"Custo horário total de mão de obra",{"$nulls":5},{"$f":"SUM(J828:J829)","v":0}]
[null,null,null,"Custo horário total de execução",{"$nulls":5},{"$f":"J826+J830","v":265.74349999999998}]
[null,null,null,"Custo unitário de execução",{"$nulls":5},{"$f":"J831/I820","v":0.9353871876099964}]
[{"$nulls":7},"Custo do FIC",null,0]
[{"$nulls":7},"Custo do FIT",null,0]
[null,"C - MATERIAL",null,"Quantidade","Unidade",null,"Preço Unitário","Custo Unitário"]
[null,"-",0,0,0,null,0,null,null,{"$f":"D836*G836","v":0}]
[null,"-",0,0,0,null,0,null,null,{"$f":"D837*G837","v":0}]
[null,null,null,"Custo unitário total de material",{"$nulls":5},{"$f":"SUM(J836:J837)","v":0}]
[null,"D - ATIVIDADES AUXILIARES",null,"Quantidade","Unidade",null,"Custo Unitário","Custo Unitário"]
[null,"-",0,0,0,null,0,null,null,{"$f":"D840*G840","v":0}]
[null,"-",0,0,0,null,0,null,null,{"$f":"D841*G841","v":0}]
[null,null,null,"Custo total de atividades auxiliares",{"$nulls":5},{"$f":"SUM(J840:J841)","v":0}]
[{"$nulls":7},"Subtotal",null,{"$f":"J832+J838+J842+J833+J834","v":0.9353871876099964}]
[null,"E - TEMPO FIXO",null,"Código","Quantidade","Unidade",null,"Custo Unitário","Custo Unitário"]
[null,"-",0,"-",0,"t",null,0,null,{"$f":"ROUNDDOWN(E845*H845,4)","v":0}]
[null,"-",0,"-",0,"t",null,0,null,{"$f":"ROUNDDOWN(E846*H846,4)","v":0}]
[null,null,null,"Custo unitário total de tempo fixo",{"$nulls":5},{"$f":"SUM(J845:J846)","v":0}]
[null,"F - MOMENTO DE TRANSPORTE",null,"Quantidade","Unidade","DMT",null,null,null,"Custo Unitário"]
[{"$nulls":5},"LN","RP","P"]
[null,"-",0,0,"tkm"]
[null,"-",0,0,"tkm"]
[null,null,null,"Custo unitário total de transporte"]
[{"$nulls":5},"Custo unitário direto total",null,null,null,{"$f":"TRUNC(J843+J847,2)","v":0.93}]
[null,"Obs."]
[]
[{"$f":"A817+1","v":19},"1ª/GRD",{"$nulls":8},{"$f":"J892","v":1.74}]
[null,"OBRA:","DRENAGEM E  PAVIMENTAÇÃO ASFÁLTICA EM CBUQ - AV. JOANA GOMES DOS SANTOS E ROTATÓRIA (SÃO JOÃO DO PACUÍ / MG)"]
[null,"Custo Unitário de Referência",null,null,"Minas Gerais"]
[{"$nulls":4}," Janeiro/2025 ",null,null,"Produção da equipe ",149.4,{"$f":"VLOOKUP(A856,ORÇAMENTO!$A$10:$L$58,7,1)","v":"TXKM"}]
[null,5914622,"TRANSPORTE COM CAMINHÃO TANQUE DE TRANSPORTE DE MATERIAL ASFÁLTICO DE 30000 L, EM VIA URBANA PAVIMENTADA",{"$nulls":5},"Valores em reais (R$)"]
[null,"A - EQUIPAMENTOS",null,"Quantidade","Utilização",null,"Custo Horário",null,null,"Custo"]
[{"$nulls":4},"Operativa","Improdutiva","Produtivo","Improdutivo",null,"Horário Total"]
[null,"E9509","Caminhão tanque distribuidor de asfalto com capacidade de 6.000 l - 7 kW/136 kW",1,1,0,261.03050000000002,72.388300000000001,null,{"$f":"D863*(E863*G863+F863*H863)","v":261.03050000000002}]
[null,"-",0,null,null,null,0,0,null,{"$f":"D864*(E864*G864+F864*H864)","v":0}]
[{"$nulls":7},"Custo horário total de equipamentos",null,{"$f":"SUM(J863:J864)","v":261.03050000000002}]
[null,"B - MÃO DE OBRA",null,"Quantidade","Unidade",null,"Custo Horário","Custo Horário Total"]
[null,"-",0,0,0,null,0,null,null,{"$f":"D867*G867","v":0}]
[null,"-",0,0,0,null,0,null,null,{"$f":"D868*G868","v":0}]
[null,null,null,"Custo horário total de mão de obra",{"$nulls":5},{"$f":"SUM(J867:J868)","v":0}]
[null,null,null,"Custo horário total de execução",{"$nulls":5},{"$f":"J865+J869","v":261.03050000000002}]
[null,null,null,"Custo unitário de execução",{"$nulls":5},{"$f":"J870/I859","v":1.7471921017402945}]
[{"$nulls":7},"Custo do FIC",null,0]
[{"$nulls":7},"Custo do FIT",null,0]
[null,"C - MATERIAL",null,"Quantidade","Unidade",null,"Preço Unitário","Custo Unitário"]
[null,"-",0,996,0,null,0,null,null,{"$f":"D875*G875","v":0}]
[null,"-",0,89.28,0,null,0,null,null,{"$f":"D876*G876","v":0}]
[null,null,null,"Custo unitário total de material",{"$nulls":5},{"$f":"SUM(J875:J876)","v":0}]
[null,"D - ATIVIDADES AUXILIARES",null,"Quantidade","Unidade",null,"Custo Unitário","Custo Unitário"]
[null,"-",0,0,0,null,0,null,null,{"$f":"D879*G879","v":0}]
[null,"-",0,0,0,null,0,null,null,{"$f":"D880*G880","v":0}]
[null,null,null,"Custo total de atividades auxiliares",{"$nulls":5},{"$f":"SUM(J879:J880)","v":0}]
[{"$nulls":7},"Subtotal",null,{"$f":"J871+J877+J881+J872+J873","v":1.7471921017402945}]
[null,"E - TEMPO FIXO",null,"Código","Quantidade","Unidade",null,"Custo Unitário","Custo Unitário"]
[null,"-",0,"-",0,"t",null,0,null,{"$f":"ROUNDDOWN(E884*H884,4)","v":0}]
[null,"-",0,"-",0,"t",null,0,null,{"$f":"ROUNDDOWN(E885*H885,4)","v":0}]
[null,null,null,"Custo unitário total de tempo fixo",{"$nulls":5},{"$f":"SUM(J884:J885)","v":0}]
[null,"F - MOMENTO DE TRANSPORTE",null,"Quantidade","Unidade","DMT",null,null,null,"Custo Unitário"]
[{"$nulls":5},"LN","RP","P"]
[null,"-",0,0,"tkm"]
[null,"-",0,0,"tkm"]
[null,null,null,"Custo unitário total de transporte"]
[{"$nulls":5},"Custo unitário direto total",null,null,null,{"$f":"TRUNC(J882+J886,2)","v":1.74}]
[null,"Obs."]
[]
[{"$f":"A856+1","v":20},"1ª/GRD",{"$nulls":8},{"$f":"J932","v":58.82}]
[null,"OBRA:","DRENAGEM E  PAVIMENTAÇÃO ASFÁLTICA EM CBUQ - AV. JOANA GOMES DOS SANTOS E ROTATÓRIA (SÃO JOÃO DO PACUÍ / MG)"]
[null,"Custo Unitário de Referência",null,null,"Minas Gerais"]
[{"$nulls":4}," Janeiro/2025 ",null,null,"Produção da equipe ",1,{"$f":"VLOOKUP(A895,ORÇAMENTO!$A$10:$L$58,7,1)","v":"M"}]
[null,94267,"GUIA (MEIO-FIO) E SARJETA CONJUGADOS DE CONCRETO, MOLDADA IN LOCO COM EXTRUSORA, 45 CM BASE (15 CM BASE DA GUIA + 30 CM BASE DA SARJETA) X 22 CM ALTURA",{"$nulls":5},"Valores em reais (R$)"]
[null,"A - EQUIPAMENTOS",null,"Quantidade","Utilização",null,"Custo Horário",null,null,"Custo"]
[{"$nulls":4},"Operativa","Improdutiva","Produtivo","Improdutivo",null,"Horário Total"]
[null,"E9103","Extrusora para meio-fio de concreto - 10,44 kW",1,1.8200000000000001E-2,9.11E-2,44.7117,31.4786,null,{"$f":"D902*(E902*G902+F902*H902)","v":3.6814534000000001}]
[null,"-",0,null,null,null,0,0,null,{"$f":"D903*(E903*G903+F903*H903)","v":0}]
[{"$nulls":7},"Custo horário total de equipamentos",null,{"$f":"SUM(J902:J903)","v":3.6814534000000001}]
[null,"B - MÃO DE OBRA",null,"Quantidade","Unidade",null,"Custo Horário","Custo Horário Total"]
[null,"P9821","Pedreiro",0.22650000000000001,"h",null,26.6785,null,null,{"$f":"D906*G906","v":6.0426802500000001}]
[null,"P9802","Ajudante especializado",0.10929999999999999,"h",null,27.0715,null,null,{"$f":"D907*G907","v":2.95891495}]
[null,"P9824","Servente",0.45300000000000001,"h",null,21.3355,null,null,{"$f":"D908*G908","v":9.6649814999999997}]
[null,null,null,"Custo horário total de mão de obra",{"$nulls":5},{"$f":"SUM(J906:J908)","v":18.6665767}]
[null,null,null,"Custo horário total de execução",{"$nulls":5},{"$f":"J904+J909","v":22.348030099999999}]
[null,null,null,"Custo unitário de execução",{"$nulls":5},{"$f":"J910/I898","v":22.348030099999999}]
[{"$nulls":7},"Custo do FIC",null,0]
[{"$nulls":7},"Custo do FIT",null,0]
[null,"C - MATERIAL",null,"Quantidade","Unidade",null,"Preço Unitário","Custo Unitário"]
[null,"M0028","Areia média",1.49E-2,"m³",null,158.15639999999999,null,null,{"$f":"D915*G915","v":2.3565303599999998}]
[null,"-",0,null,0,null,0,null,null,0]
[null,null,null,"Custo unitário total de material",{"$nulls":5},{"$f":"SUM(J915:J916)","v":2.3565303599999998}]
[null,"D - ATIVIDADES AUXILIARES",null,"Quantidade","Unidade",null,"Custo Unitário","Custo Unitário"]
[null,1107892,"Concreto fck = 20 MPa - confecção em betoneira e lançamento manual - areia e brita comerciais",6.7299999999999999E-2,"m³",null,483.94,null,null,{"$f":"D919*G919","v":32.569161999999999}]
[null,1109671,"Argamassa de cimento e areia 1:4 - confecção em betoneira e lançamento manual - areia comercial",3.3E-3,"m³",null,470.75,null,null,1.5534749999999999]
[null,null,null,"Custo total de atividades auxiliares",{"$nulls":5},{"$f":"SUM(J919:J920)","v":34.122636999999997}]
[{"$nulls":7},"Subtotal",null,{"$f":"J911+J917+J921+J912+J913","v":58.827197459999994}]
[null,"E - TEMPO FIXO",null,"Código","Quantidade","Unidade",null,"Custo Unitário","Custo Unitário"]
[null,"-",0,"-",0,"t",null,0,null,{"$f":"ROUNDDOWN(E924*H924,4)","v":0}]
[null,"-",0,"-",0,"t",null,0,null,{"$f":"ROUNDDOWN(E925*H925,4)","v":0}]
[null,null,null,"Custo unitário total de tempo fixo",{"$nulls":5},{"$f":"SUM(J924:J925)","v":0}]
[null,"F - MOMENTO DE TRANSPORTE",null,"Quantidade","Unidade","DMT",null,null,null,"Custo Unitário"]
[{"$nulls":5},"LN","RP","P"]
[null,"-",0,0,"tkm"]
[null,"-",0,0,"tkm"]
[null,null,null,"Custo unitário total de transporte"]
[{"$nulls":5},"Custo unitário direto total",null,null,null,{"$f":"TRUNC(J922+J926,2)","v":58.82}]
[null,"Obs."]
[]
[22,"1ª/GRD",{"$nulls":8},{"$f":"J972","v":36.39}]
[null,"OBRA:","DRENAGEM E  PAVIMENTAÇÃO ASFÁLTICA EM CBUQ - AV. JOANA GOMES DOS SANTOS E ROTATÓRIA (SÃO JOÃO DO PACUÍ / MG)"]
[null,"Custo Unitário de Referência",null,null,"Minas Gerais"]
[{"$nulls":4}," Janeiro/2025 ",null,null,"Produção da equipe ",1,{"$f":"VLOOKUP(A935,ORÇAMENTO!$A$10:$L$58,7,1)","v":"M"}]
[null,94263,"GUIA (MEIO-FIO) CONCRETO, MOLDADA IN LOCO EM TRECHO RETO COM EXTRUSORA, 13 CM BASE X 22 CM ALTURA",{"$nulls":5},"Valores em reais (R$)"]
[null,"A - EQUIPAMENTOS",null,"Quantidade","Utilização",null,"Custo Horário",null,null,"Custo"]
[{"$nulls":4},"Operativa","Improdutiva","Produtivo","Improdutivo",null,"Horário Total"]
[null,"E9103","Extrusora para meio-fio de concreto - 10,44 kW",1,1.44E-2,7.22E-2,44.7117,31.4786,null,{"$f":"D942*(E942*G942+F942*H942)","v":2.9166034000000001}]
[null,"-",0,null,null,null,0,0,null,{"$f":"D943*(E943*G943+F943*H943)","v":0}]
[{"$nulls":7},"Custo horário total de equipamentos",null,{"$f":"SUM(J942:J943)","v":2.9166034000000001}]
[null,"B - MÃO DE OBRA",null,"Quantidade","Unidade",null,"Custo Horário","Custo Horário Total"]
[null,"P9821","Pedreiro",0.2039,"h",null,26.6785,null,null,{"$f":"D946*G946","v":5.4397461499999995}]
[null,"P9802","Ajudante especializado",8.6699999999999999E-2,"h",null,27.0715,null,null,{"$f":"D947*G947","v":2.3470990500000002}]
[null,"P9824","Servente",0.4078,"h",null,21.3355,null,null,{"$f":"D948*G948","v":8.7006169}]
[null,null,null,"Custo horário total de mão de obra",{"$nulls":5},{"$f":"SUM(J946:J948)","v":16.487462100000002}]
[null,null,null,"Custo horário total de execução",{"$nulls":5},{"$f":"J944+J949","v":19.404065500000002}]
[null,null,null,"Custo unitário de execução",{"$nulls":5},{"$f":"J950/I938","v":19.404065500000002}]
[{"$nulls":7},"Custo do FIC",null,"-"]
[{"$nulls":7},"Custo do FIT",null,"-"]
[null,"C - MATERIAL",null,"Quantidade","Unidade",null,"Preço Unitário","Custo Unitário"]
[null,"M0028","Areia média",6.6E-3,"m³",null,158.15639999999999,null,null,{"$f":"D955*G955","v":1.04383224}]
[null,"-",0,null,0,null,0,null,null,{"$f":"D956*G956","v":0}]
[null,null,null,"Custo unitário total de material",{"$nulls":5},{"$f":"SUM(J955:J956)","v":1.04383224}]
[null,"D - ATIVIDADES AUXILIARES",null,"Quantidade","Unidade",null,"Custo Unitário","Custo Unitário"]
[null,1107892,"Concreto fck = 20 MPa - confecção em betoneira e lançamento manual - areia e brita comerciais",3.1399999999999997E-2,"m³",null,483.94,null,null,{"$f":"D959*G959","v":15.195715999999999}]
[null,1109671,"Argamassa de cimento e areia 1:4 - confecção em betoneira e lançamento manual - areia comercial",1.6000000000000001E-3,"m³",null,470.75,null,null,{"$f":"D960*G960","v":0.75319999999999998}]
[null,null,null,"Custo total de atividades auxiliares",{"$nulls":5},{"$f":"SUM(J959:J960)","v":15.948915999999999}]
[{"$nulls":7},"Subtotal",null,{"$f":"J951+J957+J961","v":36.396813739999999}]
[null,"E - TEMPO FIXO",null,"Código","Quantidade","Unidade",null,"Custo Unitário","Custo Unitário"]
[null,"-",0,"-",0,"t",null,0,null,{"$f":"ROUNDDOWN(E964*H964,4)","v":0}]
[null,"-",0,"-",0,"t",null,0,null,{"$f":"ROUNDDOWN(E965*H965,4)","v":0}]
[null,null,null,"Custo unitário total de tempo fixo",{"$nulls":5},{"$f":"SUM(J964:J965)","v":0}]
[null,"F - MOMENTO DE TRANSPORTE",null,"Quantidade","Unidade","DMT",null,null,null,"Custo Unitário"]
[{"$nulls":5},"LN","RP","P"]
[null,"-",0,0,"tkm"]
[null,"-",0,0,"tkm"]
[null,null,null,"Custo unitário total de transporte"]
[{"$nulls":5},"Custo unitário direto total",null,null,null,{"$f":"TRUNC(J962+J966,2)","v":36.39}]
[null,"Obs."]
[]
[{"$f":"A935+1","v":23},"1ª/GRD",{"$nulls":8},{"$f":"J1013","v":192.82}]
[null,"OBRA:","DRENAGEM E  PAVIMENTAÇÃO ASFÁLTICA EM CBUQ - AV. JOANA GOMES DOS SANTOS E ROTATÓRIA (SÃO JOÃO DO PACUÍ / MG)"]
[null,"Custo Unitário de Referência",null,null,"Minas Gerais"]
[{"$nulls":4}," Janeiro/2025 ",null,null,"Produção da equipe ",1,{"$f":"VLOOKUP(A975,ORÇAMENTO!$A$10:$L$58,7,1)","v":"UNID."}]
[null,2003103,"ENTRADA PARA DESCIDA D'ÁGUA - AREIA E BRITA COMERCIAIS",{"$nulls":5},"Valores em reais (R$)"]
[null,"A - EQUIPAMENTOS",null,"Quantidade","Utilização",null,"Custo Horário",null,null,"Custo"]
[{"$nulls":4},"Operativa","Improdutiva","Produtivo","Improdutivo",null,"Horário Total"]
[null,"-",0,null,null,null,0,0,null,{"$f":"D982*(E982*G982+F982*H982)","v":0}]
[null,"-",0,null,null,null,0,0,null,{"$f":"D983*(E983*G983+F983*H983)","v":0}]
[{"$nulls":7},"Custo horário total de equipamentos",null,{"$f":"SUM(J982:J983)","v":0}]
[null,"B - MÃO DE OBRA",null,"Quantidade","Unidade",null,"Custo Horário","Custo Horário Total"]
[null,"-",0,null,0,null,0,null,null,{"$f":"D986*G986","v":0}]
[{"$nulls":9},{"$f":"D987*G987","v":0}]
[null,null,null,"Custo horário total de mão de obra",{"$nulls":5},{"$f":"SUM(J986:J987)","v":0}]
[null,null,null,"Custo horário total de execução",{"$nulls":5},{"$f":"J984+J988","v":0}]
[null,null,null,"Custo unitário de execução",{"$nulls":5},{"$f":"J989/I978","v":0}]
[{"$nulls":7},"Custo do FIC",null,0]
[{"$nulls":7},"Custo do FIT",null,0]
[null,"C - MATERIAL",null,"Quantidade","Unidade",null,"Preço Unitário","Custo Unitário"]
[null,"-",0,null,0,null,0,null,null,{"$f":"D994*G994","v":0}]
[null,"-",0,null,0,null,0,null,null,0]
[null,null,null,"Custo unitário total de material",{"$nulls":5},{"$f":"SUM(J994:J995)","v":0}]
[null,"D - ATIVIDADES AUXILIARES",null,"Quantidade","Unidade",null,"Custo Unitário","Custo Unitário"]
[null,4805756,"Apiloamento manual de superfície com espessura de 15 cm",1.2107000000000001,"m²",null,4.8,null,null,{"$f":"D998*G998","v":5.8113600000000005}]
[null,1107892,"Concreto fck = 20 MPa - confecção em betoneira e lançamento manual - areia e brita comerciais",0.17910000000000001,"m³",null,483.94,null,null,{"$f":"D999*G999","v":86.673653999999999}]
[null,4805750,"Escavação manual em material de 1ª categoria na profundidade de até 1 m",0.1211,"m³",null,43.54,null,null,5.2726939999999995]
[null,3103302,"Fôrmas de tábuas de pinho para dispositivos de drenagem - utilização de 3 vezes - confecção, instalação e retirada",1.2862,"m²",null,73.91,null,null,95.063041999999996]
[null,null,null,"Custo total de atividades auxiliares",{"$nulls":5},{"$f":"SUM(J998:J1001)","v":192.82075}]
[{"$nulls":7},"Subtotal",null,{"$f":"J990+J996+J1002+J991+J992","v":192.82075}]
[null,"E - TEMPO FIXO",null,"Código","Quantidade","Unidade",null,"Custo Unitário","Custo Unitário"]
[null,"-",0,"-",0,"t",null,0,null,{"$f":"ROUNDDOWN(E1005*H1005,4)","v":0}]
[null,"-",0,"-",0,"t",null,0,null,{"$f":"ROUNDDOWN(E1006*H1006,4)","v":0}]
[null,null,null,"Custo unitário total de tempo fixo",{"$nulls":5},{"$f":"SUM(J1005:J1006)","v":0}]
[null,"F - MOMENTO DE TRANSPORTE",null,"Quantidade","Unidade","DMT",null,null,null,"Custo Unitário"]
[{"$nulls":5},"LN","RP","P"]
[null,"-",0,0,"tkm"]
[null,"-",0,0,"tkm"]
[null,null,null,"Custo unitário total de transporte"]
[{"$nulls":5},"Custo unitário direto total",null,null,null,{"$f":"TRUNC(J1003+J1007,2)","v":192.82}]
[null,"Obs."]
[]
[{"$f":"A975+1","v":24},"1ª/GRD",{"$nulls":8},{"$f":"J1055","v":228.56}]
[null,"OBRA:","DRENAGEM E  PAVIMENTAÇÃO ASFÁLTICA EM CBUQ - AV. JOANA GOMES DOS SANTOS E ROTATÓRIA (SÃO JOÃO DO PACUÍ / MG)"]
[null,"Custo Unitário de Referência",null,null,"Minas Gerais"]
[{"$nulls":4}," Janeiro/2025 ",null,null,"Produção da equipe ",1,{"$f":"VLOOKUP(A1016,ORÇAMENTO!$A$10:$L$58,7,1)","v":"M"}]
[null,2003389,"DESCIDA D'ÁGUA DE ATERRO TIPO RÁPIDO - AREIA E BRITA COMERCIAIS",{"$nulls":5},"Valores em reais (R$)"]
[null,"A - EQUIPAMENTOS",null,"Quantidade","Utilização",null,"Custo Horário",null,null,"Custo"]
[{"$nulls":4},"Operativa","Improdutiva","Produtivo","Improdutivo",null,"Horário Total"]
[null,"-",0,null,null,null,0,0,null,{"$f":"D1023*(E1023*G1023+F1023*H1023)","v":0}]
[null,"-",0,null,null,null,0,0,null,{"$f":"D1024*(E1024*G1024+F1024*H1024)","v":0}]
[{"$nulls":7},"Custo horário total de equipamentos",null,{"$f":"SUM(J1023:J1024)","v":0}]
[null,"B - MÃO DE OBRA",null,"Quantidade","Unidade",null,"Custo Horário","Custo Horário Total"]
[null,"P9821","Pedreiro",0.25,"h",null,26.6785,null,null,{"$f":"D1027*G1027","v":6.6696249999999999}]
[null,"P9824","Servente",2,"h",null,21.3355,null,null,{"$f":"D1028*G1028","v":42.670999999999999}]
[null,null,null,"Custo horário total de mão de obra",{"$nulls":5},{"$f":"SUM(J1027:J1028)","v":49.340625000000003}]
[null,null,null,"Custo horário total de execução",{"$nulls":5},{"$f":"J1025+J1029","v":49.340625000000003}]
[null,null,null,"Custo unitário de execução",{"$nulls":5},{"$f":"J1030/I1019","v":49.340625000000003}]
[{"$nulls":7},"Custo do FIC",null,0]
[{"$nulls":7},"Custo do FIT",null,0]
[null,"C - MATERIAL",null,"Quantidade","Unidade",null,"Preço Unitário","Custo Unitário"]
[null,"M2117","Meio tubo de concreto simples - D = 0,40 m",1,"m",null,47.0441,null,null,{"$f":"D1035*G1035","v":47.0441}]
[null,"-",0,null,0,null,0,null,null,{"$f":"D1036*G1036","v":0}]
[null,null,null,"Custo unitário total de material",{"$nulls":5},{"$f":"SUM(J1035:J1036)","v":47.0441}]
[null,"D - ATIVIDADES AUXILIARES",null,"Quantidade","Unidade",null,"Custo Unitário","Custo Unitário"]
[null,4805756,"Apiloamento manual de superfície com espessura de 15 cm",0.68,"m²",null,4.8,null,null,{"$f":"D1039*G1039","v":3.2640000000000002}]
[null,1109669,"Argamassa de cimento e areia 1:3 - confecção em betoneira e lançamento manual - areia comercial",4.0000000000000002E-4,"m³",null,507.26,null,null,{"$f":"D1040*G1040","v":0.202904}]
[null,1107892,"Concreto fck = 20 MPa - confecção em betoneira e lançamento manual - areia e brita comerciais",0.1389,"m³",null,483.94,null,null,{"$f":"D1041*G1041","v":67.219266000000005}]
[null,4805750,"Escavação manual em material de 1ª categoria na profundidade de até 1 m",0.17710000000000001,"m³",null,43.54,null,null,{"$f":"D1042*G1042","v":7.710934}]
[null,3103302,"Fôrmas de tábuas de pinho para dispositivos de drenagem - utilização de 3 vezes - confecção, instalação e retirada",0.68,"m²",null,73.91,null,null,{"$f":"D1043*G1043","v":50.258800000000001}]
[null,null,null,"Custo total de atividades auxiliares",{"$nulls":5},{"$f":"SUM(J1039:J1043)","v":128.65590399999999}]
[{"$nulls":7},"Subtotal",null,{"$f":"J1031+J1037+J1044+J1032+J1033","v":225.040629}]
[null,"E - TEMPO FIXO",null,"Código","Quantidade","Unidade",null,"Custo Unitário","Custo Unitário"]
[null,"M2117","Meio tubo de concreto simples - D = 0,40 m",5914655,0.10838,"t",null,32.520000000000003,null,{"$f":"ROUNDDOWN(E1047*H1047,4)","v":3.5245000000000002}]
[null,"-",0,"-",null,"t",null,0,null,0]
[null,null,null,"Custo unitário total de tempo fixo",{"$nulls":5},{"$f":"SUM(J1047:J1048)","v":3.5245000000000002}]
[null,"F - MOMENTO DE TRANSPORTE",null,"Quantidade","Unidade","DMT",null,null,null,"Custo Unitário"]
[{"$nulls":5},"LN","RP","P"]
[null,"M2117","Meio tubo de concreto simples - D = 0,40 m",0.10838,"tkm"]
[null,"-",0,0,"tkm"]
[null,null,null,"Custo unitário total de transporte"]
[{"$nulls":5},"Custo unitário direto total",null,null,null,{"$f":"TRUNC(J1045+J1049,2)","v":228.56}]
[null,"Obs."]
[]
[26,"1ª/GRD",{"$nulls":8},{"$f":"J1096","v":2406.9899999999998}]
[null,"OBRA:","DRENAGEM E  PAVIMENTAÇÃO ASFÁLTICA EM CBUQ - AV. JOANA GOMES DOS SANTOS E ROTATÓRIA (SÃO JOÃO DO PACUÍ / MG)"]
[null,"Custo Unitário de Referência",null,null,"Minas Gerais"]
[{"$nulls":4}," Janeiro/2025 ",null,null,"Produção da equipe ",1,{"$f":"VLOOKUP(A1058,ORÇAMENTO!$A$10:$L$58,7,1)","v":"UNID."}]
[null,2003463,"DISSIPADOR DE ENERGIA - AREIA, BRITA E PEDRA DE MÃO COMERCIAIS",{"$nulls":5},"Valores em reais (R$)"]
[null,"A - EQUIPAMENTOS",null,"Quantidade","Utilização",null,"Custo Horário",null,null,"Custo"]
[{"$nulls":4},"Operativa","Improdutiva","Produtivo","Improdutivo",null,"Horário Total"]
[null,"-",0,null,null,null,0,0,null,{"$f":"D1065*(E1065*G1065+F1065*H1065)","v":0}]
[null,"-",0,null,null,null,0,0,null,{"$f":"D1066*(E1066*G1066+F1066*H1066)","v":0}]
[{"$nulls":7},"Custo horário total de equipamentos",null,{"$f":"SUM(J1065:J1066)","v":0}]
[null,"B - MÃO DE OBRA",null,"Quantidade","Unidade",null,"Custo Horário","Custo Horário Total"]
[null,"P9824","Servente",3.0659999999999998,"h",null,21.3355,null,null,{"$f":"D1069*G1069","v":65.414642999999998}]
[null,"-",0,null,0,null,0,null,null,{"$f":"D1070*G1070","v":0}]
[null,null,null,"Custo horário total de mão de obra",{"$nulls":5},{"$f":"SUM(J1069:J1070)","v":65.414642999999998}]
[null,null,null,"Custo horário total de execução",{"$nulls":5},{"$f":"J1067+J1071","v":65.414642999999998}]
[null,null,null,"Custo unitário de execução",{"$nulls":5},{"$f":"J1072/I1061","v":65.414642999999998}]
[{"$nulls":7},"Custo do FIC",null,0]
[{"$nulls":7},"Custo do FIT",null,0]
[null,"C - MATERIAL",null,"Quantidade","Unidade",null,"Preço Unitário","Custo Unitário"]
[null,"M1097","Pedra de mão ou rachão",1.2193000000000001,"m³",null,159.5925,null,null,{"$f":"D1077*G1077","v":194.59113525000001}]
[null,"-",0,0,0,null,0,null,null,0]
[null,null,null,"Custo unitário total de material",{"$nulls":5},{"$f":"SUM(J1077:J1078)","v":194.59113525000001}]
[null,"D - ATIVIDADES AUXILIARES",null,"Quantidade","Unidade",null,"Custo Unitário","Custo Unitário"]
[null,1107892,"Concreto fck = 20 MPa - confecção em betoneira e lançamento manual - areia e brita comerciais",2.8536000000000001,"m³",null,483.94,null,null,{"$f":"D1081*G1081","v":1380.971184}]
[null,4805756,"Apiloamento manual de superfície com espessura de 15 cm",16.5303,"m²",null,4.8,null,null,{"$f":"D1082*G1082","v":79.345439999999996}]
[null,4805750,"Escavação manual em material de 1ª categoria na profundidade de até 1 m",3.3060999999999998,"m³",null,43.54,null,null,143.94759399999998]
[null,3103302,"Fôrmas de tábuas de pinho para dispositivos de drenagem - utilização de 3 vezes - confecção, instalação e retirada",7.2977999999999996,"m²",null,73.91,null,null,{"$f":"D1084*G1084","v":539.3803979999999}]
[null,null,null,"Custo total de atividades auxiliares",{"$nulls":5},{"$f":"SUM(J1081:J1084)","v":2143.644616}]
[{"$nulls":7},"Subtotal",null,{"$f":"J1073+J1079+J1085+J1074+J1075","v":2403.6503942499999}]
[null,"E - TEMPO FIXO",null,"Código","Quantidade","Unidade",null,"Custo Unitário","Custo Unitário"]
[null,"M1097","Pedra de mão ou rachão",5914647,1.8289500000000001,"t",null,1.83,null,{"$f":"ROUNDDOWN(E1088*H1088,4)","v":3.3469000000000002}]
[null,"-",0,"-",0,"t",null,0,null,{"$f":"ROUNDDOWN(E1089*H1089,4)","v":0}]
[null,null,null,"Custo unitário total de tempo fixo",{"$nulls":5},{"$f":"SUM(J1088:J1089)","v":3.3469000000000002}]
[null,"F - MOMENTO DE TRANSPORTE",null,"Quantidade","Unidade","DMT",null,null,null,"Custo Unitário"]
[{"$nulls":5},"LN","RP","P"]
[null,"M1097","Pedra de mão ou rachão",1.8289500000000001,"tkm","5914359","5914374","5914389"]
[null,"-",0,null,"tkm"]
[null,null,null,"Custo unitário total de transporte"]
[{"$nulls":5},"Custo unitário direto total",null,null,null,{"$f":"TRUNC(J1086+J1090,2)","v":2406.9899999999998}]
[null,"Obs."]
[]
[31,"1ª/GRD",{"$nulls":8},{"$f":"J1139","v":24252.34}]
[null,"OBRA:","DRENAGEM E  PAVIMENTAÇÃO ASFÁLTICA EM CBUQ - AV. JOANA GOMES DOS SANTOS E ROTATÓRIA (SÃO JOÃO DO PACUÍ / MG)"]
[null,"Custo Unitário de Referência",null,null,"Minas Gerais"]
[{"$nulls":4}," Janeiro/2025 ",null,null,"Produção da equipe ",1,{"$f":"VLOOKUP(A1099,ORÇAMENTO!$A$10:$L$58,7,1)","v":"UNID."}]
[null,705241,"BOCA PARA BUEIRO SIMPLES CELULAR DE CONCRETO (BSCC), 2,50 X 2,50M - AREIA E BRITA COMERCIAIS",{"$nulls":5},"Valores em reais (R$)"]
[null,"A - EQUIPAMENTOS",null,"Quantidade","Utilização",null,"Custo Horário",null,null,"Custo"]
[{"$nulls":4},"Operativa","Improdutiva","Produtivo","Improdutivo",null,"Horário Total"]
[null,"-",0,null,null,null,0,0,null,{"$f":"D1106*(E1106*G1106+F1106*H1106)","v":0}]
[null,"-",0,null,null,null,0,0,null,{"$f":"D1107*(E1107*G1107+F1107*H1107)","v":0}]
[{"$nulls":7},"Custo horário total de equipamentos",null,{"$f":"SUM(J1106:J1107)","v":0}]
[null,"B - MÃO DE OBRA",null,"Quantidade","Unidade",null,"Custo Horário","Custo Horário Total"]
[null,"-",0,null,0,null,0,null,null,{"$f":"D1110*G1110","v":0}]
[null,"-",0,null,0,null,0,null,null,{"$f":"D1111*G1111","v":0}]
[null,null,null,"Custo horário total de mão de obra",{"$nulls":5},{"$f":"SUM(J1110:J1111)","v":0}]
[null,null,null,"Custo horário total de execução",{"$nulls":5},{"$f":"J1108+J1112","v":0}]
[null,null,null,"Custo unitário de execução",{"$nulls":5},{"$f":"J1113/I1102","v":0}]
[{"$nulls":7},"Custo do FIC",null,0]
[{"$nulls":7},"Custo do FIT",null,0]
[null,"C - MATERIAL",null,"Quantidade","Unidade",null,"Preço Unitário","Custo Unitário"]
[null,"-",0,0,0,null,0,null,null,{"$f":"D1118*G1118","v":0}]
[null,"-",0,0,0,null,0,null,null,{"$f":"D1119*G1119","v":0}]
[null,null,null,"Custo unitário total de material",{"$nulls":5},{"$f":"SUM(J1118:J1119)","v":0}]
[null,"D - ATIVIDADES AUXILIARES",null,"Quantidade","Unidade",null,"Custo Unitário","Custo Unitário"]
[null,1100657,"Adensamento de concreto por vibrador de imersão",12.175000000000001,"m³",null,3.34,null,null,{"$f":"D1122*G1122","v":40.664500000000004}]
[null,1109669,"Argamassa de cimento e areia 1:3 - confecção em betoneira e lançamento manual - areia comercial",0.67500000000000004,"m³",null,507.26,null,null,{"$f":"D1123*G1123","v":342.40050000000002}]
[null,407819,"Armação em aço CA-50 - fornecimento, preparo e colocação",878,"kg",null,12.08,null,null,10606.24]
[null,1107892,"Concreto fck = 20 MPa - confecção em betoneira e lançamento manual - areia e brita comerciais",12.175000000000001,"m³",null,483.94,null,null,5891.9695000000002]
[null,1106057,"Concreto magro - confecção em betoneira e lançamento manual - areia e brita comerciais",4.3499999999999996,"m³",null,471.16,null,null,2049.5459999999998]
[null,3103302,"Fôrmas de tábuas de pinho para dispositivos de drenagem - utilização de 3 vezes - confecção, instalação e retirada",72,"m²",null,73.91,null,null,{"$f":"D1127*G1127","v":5321.5199999999995}]
[null,null,null,"Custo total de atividades auxiliares",{"$nulls":5},{"$f":"SUM(J1122:J1127)","v":24252.340499999998}]
[{"$nulls":7},"Subtotal",null,{"$f":"J1114+J1120+J1128+J1115+J1116","v":24252.340499999998}]
[null,"E - TEMPO FIXO",null,"Código","Quantidade","Unidade",null,"Custo Unitário","Custo Unitário"]
[null,"-",0,"-",0,"t",null,0,null,{"$f":"ROUNDDOWN(E1131*H1131,4)","v":0}]
[null,"-",0,"-",0,"t",null,0,null,{"$f":"ROUNDDOWN(E1132*H1132,4)","v":0}]
[null,null,null,"Custo unitário total de tempo fixo",{"$nulls":5},{"$f":"SUM(J1131:J1132)","v":0}]
[null,"F - MOMENTO DE TRANSPORTE",null,"Quantidade","Unidade","DMT",null,null,null,"Custo Unitário"]
[{"$nulls":5},"LN","RP","P"]
[null,"-",0,0,"tkm"]
[null,"-",0,0,"tkm"]
[null,null,null,"Custo unitário total de transporte"]
[{"$nulls":5},"Custo unitário direto total",null,null,null,{"$f":"TRUNC(J1129+J1133,2)","v":24252.34}]
[null,"Obs."]
[]
[{"$f":"A1099+1","v":32},"1ª/GRD",{"$nulls":8},{"$f":"J1183","v":4475.91}]
[null,"OBRA:","DRENAGEM E  PAVIMENTAÇÃO ASFÁLTICA EM CBUQ - AV. JOANA GOMES DOS SANTOS E ROTATÓRIA (SÃO JOÃO DO PACUÍ / MG)"]
[null,"Custo Unitário de Referência",null,null,"Minas Gerais"]
[{"$nulls":4}," Janeiro/2025 ",null,null,"Produção da equipe ",2.0750000000000002,{"$f":"VLOOKUP(A1142,ORÇAMENTO!$A$10:$L$58,7,1)","v":"M"}]
[null,705197,"CORPO DE BUEIRO SIMPLES CELULAR DE CONCRETO (BSCC), 2,50 X 2,50M - MOLDADO NO LOCAL, ALTURA DO ATERRO ATÉ 1,0M - AREIA E BRITA COMERCIAIS",{"$nulls":5},"Valores em reais (R$)"]
[null,"A - EQUIPAMENTOS",null,"Quantidade","Utilização",null,"Custo Horário",null,null,"Custo"]
[{"$nulls":4},"Operativa","Improdutiva","Produtivo","Improdutivo",null,"Horário Total"]
[null,"-",0,null,null,null,0,0,null,{"$f":"D1149*(E1149*G1149+F1149*H1149)","v":0}]
[null,"-",0,null,null,null,0,0,null,{"$f":"D1150*(E1150*G1150+F1150*H1150)","v":0}]
[{"$nulls":7},"Custo horário total de equipamentos",null,{"$f":"SUM(J1149:J1150)","v":0}]
[null,"B - MÃO DE OBRA",null,"Quantidade","Unidade",null,"Custo Horário","Custo Horário Total"]
[null,"-",0,null,0,null,0,null,null,{"$f":"D1153*G1153","v":0}]
[null,"-",0,null,0,null,0,null,null,{"$f":"D1154*G1154","v":0}]
[null,null,null,"Custo horário total de mão de obra",{"$nulls":5},{"$f":"SUM(J1153:J1154)","v":0}]
[null,null,null,"Custo horário total de execução",{"$nulls":5},{"$f":"J1151+J1155","v":0}]
[null,null,null,"Custo unitário de execução",{"$nulls":5},{"$f":"J1156/I1145","v":0}]
[{"$nulls":7},"Custo do FIC",null,0]
[{"$nulls":7},"Custo do FIT",null,0]
[null,"C - MATERIAL",null,"Quantidade","Unidade",null,"Preço Unitário","Custo Unitário"]
[null,"M0446","Compensado resinado - E = 10 mm",8.9340000000000003E-2,"m²",null,27.522200000000002,null,null,{"$f":"D1161*G1161","v":2.4588333480000002}]
[null,"M0786","Placa de poliestireno expandido (EPS)",8.8999999999999995E-4,"m³",null,355,null,null,{"$f":"D1162*G1162","v":0.31595000000000001}]
[null,null,null,"Custo unitário total de material",{"$nulls":5},{"$f":"SUM(J1161:J1162)","v":2.7747833480000001}]
[null,"D - ATIVIDADES AUXILIARES",null,"Quantidade","Unidade",null,"Custo Unitário","Custo Unitário"]
[null,1100657,"Adensamento de concreto por vibrador de imersão",2.21,"m³",null,3.34,null,null,{"$f":"D1165*G1165","v":7.3813999999999993}]
[null,1109669,"Argamassa de cimento e areia 1:3 - confecção em betoneira e lançamento manual - areia comercial",0.13,"m³",null,507.26,null,null,{"$f":"D1166*G1166","v":65.943799999999996}]
[null,407819,"Armação em aço CA-50 - fornecimento, preparo e colocação",152.923,"kg",null,12.08,null,null,1847.3098400000001]
[null,1107892,"Concreto fck = 20 MPa - confecção em betoneira e lançamento manual - areia e brita comerciais",2.21,"m³",null,483.94,null,null,1069.5074]
[null,1106057,"Concreto magro - confecção em betoneira e lançamento manual - areia e brita comerciais",0.32,"m³",null,471.16,null,null,150.77120000000002]
[null,2105605,"Escoramento para corpo de bueiros celulares - utilização de 3 vezes - confecção, instalação e retirada",6.25,"m³",null,55.77,null,null,{"$f":"D1170*G1170","v":348.5625}]
[null,3108005,"Fôrmas de compensado resinado 14 mm - uso geral - utilização de 3 vezes - confecção, instalação e retirada",13.2,"m²",null,74.52,null,null,983.66399999999987]
[null,null,null,"Custo total de atividades auxiliares",{"$nulls":5},{"$f":"SUM(J1165:J1171)","v":4473.1401400000004}]
[{"$nulls":7},"Subtotal",null,{"$f":"J1157+J1163+J1172+J1158+J1159","v":4475.9149233480002}]
[null,"E - TEMPO FIXO",null,"Código","Quantidade","Unidade",null,"Custo Unitário","Custo Unitário"]
[null,"-",0,"-",0,"t",null,0,null,{"$f":"ROUNDDOWN(E1175*H1175,4)","v":0}]
[null,"-",0,"-",0,"t",null,0,null,{"$f":"ROUNDDOWN(E1176*H1176,4)","v":0}]
[null,null,null,"Custo unitário total de tempo fixo",{"$nulls":5},{"$f":"SUM(J1175:J1176)","v":0}]
[null,"F - MOMENTO DE TRANSPORTE",null,"Quantidade","Unidade","DMT",null,null,null,"Custo Unitário"]
[{"$nulls":5},"LN","RP","P"]
[null,"M2171","Tubo de concreto armado PA1 - D = 0,80 m",0,"tkm","5914584","5914599","5914614"]
[null,"-",0,0,"tkm"]
[null,null,null,"Custo unitário total de transporte"]
[{"$nulls":5},"Custo unitário direto total",null,null,null,{"$f":"TRUNC(J1173+J1177,2)","v":4475.91}]
[null,"Obs."]
[]
[39,"1ª/GRD",{"$nulls":8},{"$f":"J1222","v":6.63}]
[null,"OBRA:","DRENAGEM E  PAVIMENTAÇÃO ASFÁLTICA EM CBUQ - AV. JOANA GOMES DOS SANTOS E ROTATÓRIA (SÃO JOÃO DO PACUÍ / MG)"]
[null,"Custo Unitário de Referência",null,null,"Minas Gerais"]
[{"$nulls":4}," Janeiro/2025 ",null,null,"Produção da equipe ",26,{"$f":"VLOOKUP(A1186,ORÇAMENTO!$A$10:$L$58,7,1)","v":"M3"}]
[null,4805757,"ESCAVAÇÃO MECÂNICA DE VALAS EM MATERIAL DE 1ª CATEGORIA",{"$nulls":5},"Valores em reais (R$)"]
[null,"A - EQUIPAMENTOS",null,"Quantidade","Utilização",null,"Custo Horário",null,null,"Custo"]
[{"$nulls":4},"Operativa","Improdutiva","Produtivo","Improdutivo",null,"Horário Total"]
[null,"E9526","Retroescavadeira de pneus - capacidade da caçamba da pá-carregadeira de 0,76 m³ e da retroescavadeira de 0,29 m³ - 58 kW ",1,1,0,147.6585,74.887,null,{"$f":"D1193*(E1193*G1193+F1193*H1193)","v":147.6585}]
[null,"-",0,0,0,0,0,0,null,{"$f":"D1194*(E1194*G1194+F1194*H1194)","v":0}]
[{"$nulls":7},"Custo horário total de equipamentos",null,{"$f":"SUM(J1193:J1194)","v":147.6585}]
[null,"B - MÃO DE OBRA",null,"Quantidade","Unidade",null,"Custo Horário","Custo Horário Total"]
[null,"P9824","Servente",1,"h",null,21.3355,null,null,{"$f":"D1197*G1197","v":21.3355}]
[null,"-",0,0,0,null,0,null,null,{"$f":"D1198*G1198","v":0}]
[null,null,null,"Custo horário total de mão de obra",{"$nulls":5},{"$f":"SUM(J1197:J1198)","v":21.3355}]
[null,null,null,"Custo horário total de execução",{"$nulls":5},{"$f":"J1195+J1199","v":168.994}]
[null,null,null,"Custo unitário de execução",{"$nulls":5},{"$f":"J1200/I1189","v":6.499769230769231}]
[{"$nulls":7},"Custo do FIC",null,0.13750000000000001]
[{"$nulls":7},"Custo do FIT",null,0]
[null,"C - MATERIAL",null,"Quantidade","Unidade",null,"Preço Unitário","Custo Unitário"]
[null,"-",0,0,0,null,0,null,null,{"$f":"D1205*G1205","v":0}]
[null,"-",0,0,0,null,0,null,null,0]
[null,null,null,"Custo unitário total de material",{"$nulls":5},{"$f":"SUM(J1205:J1206)","v":0}]
[null,"D - ATIVIDADES AUXILIARES",null,"Quantidade","Unidade",null,"Custo Unitário","Custo Unitário"]
[null,"-",0,0,0,null,0,null,null,{"$f":"D1209*G1209","v":0}]
[null,"-",0,0,0,null,0,null,null,{"$f":"D1210*G1210","v":0}]
[null,null,null,"Custo total de atividades auxiliares",{"$nulls":5},{"$f":"SUM(J1209:J1210)","v":0}]
[{"$nulls":7},"Subtotal",null,{"$f":"J1201+J1207+J1211+J1202+J1203","v":6.6372692307692311}]
[null,"E - TEMPO FIXO",null,"Código","Quantidade","Unidade",null,"Custo Unitário","Custo Unitário"]
[null,"-",0,"-",0,"t",null,0,null,{"$f":"ROUNDDOWN(E1214*H1214,4)","v":0}]
[null,"-",0,"-",0,"t",null,0,null,{"$f":"ROUNDDOWN(E1215*H1215,4)","v":0}]
[null,null,null,"Custo unitário total de tempo fixo",{"$nulls":5},{"$f":"SUM(J1214:J1215)","v":0}]
[null,"F - MOMENTO DE TRANSPORTE",null,"Quantidade","Unidade","DMT",null,null,null,"Custo Unitário"]
[{"$nulls":5},"LN","RP","P"]
[null,"-",0,0,"tkm"]
[null,"-",0,0,"tkm"]
[null,null,null,"Custo unitário total de transporte"]
[{"$nulls":5},"Custo unitário direto total",null,null,null,{"$f":"TRUNC(J1212+J1216,2)","v":6.63}]
[null,"Obs."]
[]
[{"$f":"A1186+1","v":40},"1ª/GRD",{"$nulls":8},{"$f":"J1261","v":4.8}]
[null,"OBRA:","DRENAGEM E  PAVIMENTAÇÃO ASFÁLTICA EM CBUQ - AV. JOANA GOMES DOS SANTOS E ROTATÓRIA (SÃO JOÃO DO PACUÍ / MG)"]
[null,"Custo Unitário de Referência",null,null,"Minas Gerais"]
[{"$nulls":4}," Janeiro/2025 ",null,null,"Produção da equipe ",4.4444400000000002,{"$f":"VLOOKUP(A1225,ORÇAMENTO!$A$10:$L$58,7,1)","v":"M2"}]
[null,4805756,"APILOAMENTO MANUAL DE FUNDO DE VALA",{"$nulls":5},"Valores em reais (R$)"]
[null,"A - EQUIPAMENTOS",null,"Quantidade","Utilização",null,"Custo Horário",null,null,"Custo"]
[{"$nulls":4},"Operativa","Improdutiva","Produtivo","Improdutivo",null,"Horário Total"]
[null,"-",0,null,null,null,0,0,null,{"$f":"D1232*(E1232*G1232+F1232*H1232)","v":0}]
[null,"-",0,null,null,null,0,0,null,{"$f":"D1233*(E1233*G1233+F1233*H1233)","v":0}]
[{"$nulls":7},"Custo horário total de equipamentos",null,{"$f":"SUM(J1232:J1233)","v":0}]
[null,"B - MÃO DE OBRA",null,"Quantidade","Unidade",null,"Custo Horário","Custo Horário Total"]
[null,"P9824","Servente",1,"h",null,21.3355,null,null,{"$f":"D1236*G1236","v":21.3355}]
[null,"-",0,null,0,null,0,null,null,{"$f":"D1237*G1237","v":0}]
[null,null,null,"Custo horário total de mão de obra",{"$nulls":5},{"$f":"SUM(J1236:J1237)","v":21.3355}]
[null,null,null,"Custo horário total de execução",{"$nulls":5},{"$f":"J1234+J1238","v":21.3355}]
[null,null,null,"Custo unitário de execução",{"$nulls":5},{"$f":"J1239/I1228","v":4.8004923004923006}]
[{"$nulls":7},"Custo do FIC",null,0]
[{"$nulls":7},"Custo do FIT",null,0]
[null,"C - MATERIAL",null,"Quantidade","Unidade",null,"Preço Unitário","Custo Unitário"]
[null,"-",0,0,0,null,0,null,null,{"$f":"D1244*G1244","v":0}]
[null,"-",0,0,0,null,0,null,null,0]
[null,null,null,"Custo unitário total de material",{"$nulls":5},{"$f":"SUM(J1244:J1245)","v":0}]
[null,"D - ATIVIDADES AUXILIARES",null,"Quantidade","Unidade",null,"Custo Unitário","Custo Unitário"]
[null,"-",0,0,0,null,0,null,null,{"$f":"D1248*G1248","v":0}]
[null,"-",0,0,0,null,0,null,null,{"$f":"D1249*G1249","v":0}]
[null,null,null,"Custo total de atividades auxiliares",{"$nulls":5},{"$f":"SUM(J1248:J1249)","v":0}]
[{"$nulls":7},"Subtotal",null,{"$f":"J1240+J1246+J1250","v":4.8004923004923006}]
[null,"E - TEMPO FIXO",null,"Código","Quantidade","Unidade",null,"Custo Unitário","Custo Unitário"]
[null,"-",0,"-",0,"t",null,0,null,{"$f":"ROUNDDOWN(E1253*H1253,4)","v":0}]
[null,"-",0,"-",0,"t",null,0,null,{"$f":"ROUNDDOWN(E1254*H1254,4)","v":0}]
[null,null,null,"Custo unitário total de tempo fixo",{"$nulls":5},{"$f":"SUM(J1253:J1254)","v":0}]
[null,"F - MOMENTO DE TRANSPORTE",null,"Quantidade","Unidade","DMT",null,null,null,"Custo Unitário"]
[{"$nulls":5},"LN","RP","P"]
[null,"-",0,0,"tkm"]
[null,"-",0,0,"tkm"]
[null,null,null,"Custo unitário total de transporte"]
[{"$nulls":5},"Custo unitário direto total",null,null,null,{"$f":"TRUNC(J1251+J1255,2)","v":4.8}]
[null,"Obs."]
[]
[{"$f":"A1225+1","v":41},"1ª/GRD",{"$nulls":8},{"$f":"J1303","v":153.53}]
[null,"OBRA:","DRENAGEM E  PAVIMENTAÇÃO ASFÁLTICA EM CBUQ - AV. JOANA GOMES DOS SANTOS E ROTATÓRIA (SÃO JOÃO DO PACUÍ / MG)"]
[null,"Custo Unitário de Referência",null,null,"Minas Gerais"]
[{"$nulls":4}," Janeiro/2025 ",null,null,"Produção da equipe ",1,{"$f":"VLOOKUP(A1264,ORÇAMENTO!$A$10:$L$58,7,1)","v":"M2"}]
[null,2106292,"ESCORAMENTO CONTÍNUO DE VALAS COM TÁBUAS E LONGARINAS, PROFUNDIDADE ATÉ 4,0M - CONFECÇÃO, INSTALAÇÃO E RETIRADA",{"$nulls":5},"Valores em reais (R$)"]
[null,"A - EQUIPAMENTOS",null,"Quantidade","Utilização",null,"Custo Horário",null,null,"Custo"]
[{"$nulls":4},"Operativa","Improdutiva","Produtivo","Improdutivo",null,"Horário Total"]
[null,"-",0,null,null,null,0,0,null,{"$f":"D1271*(E1271*G1271+F1271*H1271)","v":0}]
[null,"-",0,null,null,null,0,0,null,{"$f":"D1272*(E1272*G1272+F1272*H1272)","v":0}]
[{"$nulls":7},"Custo horário total de equipamentos",null,{"$f":"SUM(J1271:J1272)","v":0}]
[null,"B - MÃO DE OBRA",null,"Quantidade","Unidade",null,"Custo Horário","Custo Horário Total"]
[null,"P9801","Ajudante",3,"h",null,23.050599999999999,null,null,{"$f":"D1275*G1275","v":69.151799999999994}]
[null,"P9808","Carpinteiro",1.5,"h",null,26.4529,null,null,{"$f":"D1276*G1276","v":39.679349999999999}]
[null,null,null,"Custo horário total de mão de obra",{"$nulls":5},{"$f":"SUM(J1275:J1276)","v":108.83114999999999}]
[null,null,null,"Custo horário total de execução",{"$nulls":5},{"$f":"J1273+J1277","v":108.83114999999999}]
[null,null,null,"Custo unitário de execução",{"$nulls":5},{"$f":"J1278/I1267","v":108.83114999999999}]
[{"$nulls":7},"Custo do FIC",null,0]
[{"$nulls":7},"Custo do FIT",null,0]
[null,"C - MATERIAL",null,"Quantidade","Unidade",null,"Preço Unitário","Custo Unitário"]
[null,"M1811","Longarina de madeira de primeira - L = 16 cm e E = 6 cm",0.40425,"m",null,47.557499999999997,null,null,{"$f":"D1283*G1283","v":19.225119374999998}]
[null,"M1205","Prego de ferro",8.6209999999999995E-2,"kg",null,16.544499999999999,null,null,{"$f":"D1284*G1284","v":1.4263013449999999}]
[null,"M0286","Tábua - E = 2,5 cm e L = 30 cm",1.5159400000000001,"m",null,15.537800000000001,null,null,23.554372532000002]
[null,null,null,"Custo unitário total de material",{"$nulls":5},{"$f":"SUM(J1283:J1285)","v":44.205793251999999}]
[null,"D - ATIVIDADES AUXILIARES",null,"Quantidade","Unidade",null,"Custo Unitário","Custo Unitário"]
[null,"-",0,0,0,null,0,null,null,{"$f":"D1288*G1288","v":0}]
[null,"-",0,0,0,null,0,null,null,{"$f":"D1289*G1289","v":0}]
[null,null,null,"Custo total de atividades auxiliares",{"$nulls":5},{"$f":"SUM(J1288:J1289)","v":0}]
[{"$nulls":7},"Subtotal",null,{"$f":"J1279+J1286+J1290+J1280+J1281","v":153.03694325199999}]
[null,"E - TEMPO FIXO",null,"Código","Quantidade","Unidade",null,"Custo Unitário","Custo Unitário"]
[null,"M1811","Longarina de madeira de primeira - L = 16 cm e E = 6 cm",5914655,3.8800000000000002E-3,"t",null,32.520000000000003,null,{"$f":"ROUNDDOWN(E1293*H1293,4)","v":0.12609999999999999}]
[null,"M1205","Prego de ferro",5914655,9.0000000000000006E-5,"t",null,32.520000000000003,null,2.8999999999999998E-3]
[null,"M0286","Tábua - E = 2,5 cm e L = 30 cm",5914655,1.137E-2,"t",null,32.520000000000003,null,0.36969999999999997]
[null,null,null,"Custo unitário total de tempo fixo",{"$nulls":5},{"$f":"SUM(J1293:J1295)","v":0.49869999999999998}]
[null,"F - MOMENTO DE TRANSPORTE",null,"Quantidade","Unidade","DMT",null,null,null,"Custo Unitário"]
[{"$nulls":5},"LN","RP","P"]
[null,"M1811","Longarina de madeira de primeira - L = 16 cm e E = 6 cm",3.8800000000000002E-3,"tkm"]
[null,"M1205","Prego de ferro",9.0000000000000006E-5,"tkm"]
[null,"M0286","Tábua - E = 2,5 cm e L = 30 cm",1.137E-2,"tkm"]
[null,null,null,"Custo unitário total de transporte"]
[{"$nulls":5},"Custo unitário direto total",null,null,null,{"$f":"TRUNC(J1291+J1296,2)","v":153.53}]
[null,"Obs."]
[]
[{"$f":"A1264+1","v":42},"1ª/GRD",{"$nulls":8},{"$f":"J1342","v":16.68}]
[null,"OBRA:","DRENAGEM E  PAVIMENTAÇÃO ASFÁLTICA EM CBUQ - AV. JOANA GOMES DOS SANTOS E ROTATÓRIA (SÃO JOÃO DO PACUÍ / MG)"]
[null,"Custo Unitário de Referência",null,null,"Minas Gerais"]
[{"$nulls":4}," Janeiro/2025 ",null,null,"Produção da equipe ",3.1124999999999998,{"$f":"VLOOKUP(A1306,ORÇAMENTO!$A$10:$L$58,7,1)","v":"M3"}]
[null,4815671,"REATERRO E COMPACTAÇÃO MANUAL DE VALAS COM SOQUETE VIBRATÓRIO",{"$nulls":5},"Valores em reais (R$)"]
[null,"A - EQUIPAMENTOS",null,"Quantidade","Utilização",null,"Custo Horário",null,null,"Custo"]
[{"$nulls":4},"Operativa","Improdutiva","Produtivo","Improdutivo",null,"Horário Total"]
[null,"E9647","Compactador manual com soquete vibratório - 4,10 kW",1,1,0,9.2759,1.022,null,{"$f":"D1313*(E1313*G1313+F1313*H1313)","v":9.2759}]
[null,"-",0,0,0,0,0,0,null,{"$f":"D1314*(E1314*G1314+F1314*H1314)","v":0}]
[{"$nulls":7},"Custo horário total de equipamentos",null,{"$f":"SUM(J1313:J1314)","v":9.2759}]
[null,"B - MÃO DE OBRA",null,"Quantidade","Unidade",null,"Custo Horário","Custo Horário Total"]
[null,"P9824","Servente",2,"h",null,21.3355,null,null,{"$f":"D1317*G1317","v":42.670999999999999}]
[null,"-",0,0,0,null,0,null,null,{"$f":"D1318*G1318","v":0}]
[null,null,null,"Custo horário total de mão de obra",{"$nulls":5},{"$f":"SUM(J1317:J1318)","v":42.670999999999999}]
[null,null,null,"Custo horário total de execução",{"$nulls":5},{"$f":"J1315+J1319","v":51.946899999999999}]
[null,null,null,"Custo unitário de execução",{"$nulls":5},{"$f":"J1320/I1309","v":16.689767068273092}]
[{"$nulls":7},"Custo do FIC",null,0]
[{"$nulls":7},"Custo do FIT",null,0]
[null,"C - MATERIAL",null,"Quantidade","Unidade",null,"Preço Unitário","Custo Unitário"]
[null,"-",0,0,0,null,0,null,null,{"$f":"D1325*G1325","v":0}]
[null,"-",0,0,0,null,0,null,null,0]
[null,null,null,"Custo unitário total de material",{"$nulls":5},{"$f":"SUM(J1325:J1326)","v":0}]
[null,"D - ATIVIDADES AUXILIARES",null,"Quantidade","Unidade",null,"Custo Unitário","Custo Unitário"]
[null,"-",0,0,0,null,0,null,null,{"$f":"D1329*G1329","v":0}]
[null,"-",0,0,0,null,0,null,null,{"$f":"D1330*G1330","v":0}]
[null,null,null,"Custo total de atividades auxiliares",{"$nulls":5},{"$f":"SUM(J1329:J1330)","v":0}]
[{"$nulls":7},"Subtotal",null,{"$f":"J1321+J1327+J1331+J1322+J1323","v":16.689767068273092}]
[null,"E - TEMPO FIXO",null,"Código","Quantidade","Unidade",null,"Custo Unitário","Custo Unitário"]
[null,"-",0,"-",0,"t",null,0,null,{"$f":"ROUNDDOWN(E1334*H1334,4)","v":0}]
[null,"-",0,"-",0,"t",null,0,null,{"$f":"ROUNDDOWN(E1335*H1335,4)","v":0}]
[null,null,null,"Custo unitário total de tempo fixo",{"$nulls":5},{"$f":"SUM(J1334:J1335)","v":0}]
[null,"F - MOMENTO DE TRANSPORTE",null,"Quantidade","Unidade","DMT",null,null,null,"Custo Unitário"]
[{"$nulls":5},"LN","RP","P"]
[null,"-",0,0,"tkm"]
[null,"-",0,0,"tkm"]
[null,null,null,"Custo unitário total de transporte"]
[{"$nulls":5},"Custo unitário direto total",null,null,null,{"$f":"TRUNC(J1332+J1336,2)","v":16.68}]
[null,"Obs."]
[]
[{"$f":"A1306+1","v":43},"1ª/GRD",{"$nulls":8},{"$f":"J1385","v":720.64}]
[null,"OBRA:","DRENAGEM E  PAVIMENTAÇÃO ASFÁLTICA EM CBUQ - AV. JOANA GOMES DOS SANTOS E ROTATÓRIA (SÃO JOÃO DO PACUÍ / MG)"]
[null,"Custo Unitário de Referência",null,null,"Minas Gerais"]
[{"$nulls":4}," Janeiro/2025 ",null,null,"Produção da equipe ",1,{"$f":"VLOOKUP(A1345,ORÇAMENTO!$A$10:$L$58,7,1)","v":"M3"}]
[null,94990,"EXECUÇÃO DE PASSEIO (CALÇADA) OU PISO DE CONCRETO MOLDADO IN LOCO, ACABAMENTO CONVENCIONAL, NÃO ARMADO",{"$nulls":5},"Valores em reais (R$)"]
[null,"A - EQUIPAMENTOS",null,"Quantidade","Utilização",null,"Custo Horário",null,null,"Custo"]
[{"$nulls":4},"Operativa","Improdutiva","Produtivo","Improdutivo",null,"Horário Total"]
[null,"-",0,null,null,null,0,0,null,{"$f":"D1352*(E1352*G1352+F1352*H1352)","v":0}]
[null,"-",0,null,null,null,0,0,null,{"$f":"D1353*(E1353*G1353+F1353*H1353)","v":0}]
[{"$nulls":7},"Custo horário total de equipamentos",null,{"$f":"SUM(J1352:J1353)","v":0}]
[null,"B - MÃO DE OBRA",null,"Quantidade","Unidade",null,"Custo Horário","Custo Horário Total"]
[null,"P9808","Carpinteiro",1.6268,"h",null,26.4529,null,null,{"$f":"D1356*G1356","v":43.033577719999997}]
[null,"P9821","Pedreiro",1.4149,"h",null,26.6785,null,null,{"$f":"D1357*G1357","v":37.747409650000002}]
[null,"P9824","Servente",3.0417000000000001,"h",null,21.3355,null,null,64.896190349999998]
[null,null,null,"Custo horário total de mão de obra",{"$nulls":5},{"$f":"SUM(J1356:J1358)","v":145.67717771999997}]
[null,null,null,"Custo horário total de execução",{"$nulls":5},{"$f":"J1354+J1359","v":145.67717771999997}]
[null,null,null,"Custo unitário de execução",{"$nulls":5},{"$f":"J1360/I1348","v":145.67717771999997}]
[{"$nulls":7},"Custo do FIC",null,0]
[{"$nulls":7},"Custo do FIT",null,0]
[null,"C - MATERIAL",null,"Quantidade","Unidade",null,"Preço Unitário","Custo Unitário"]
[null,"M1358","Sarrafo em madeira de terceira - E = 2,5 cm e L = 5 cm",10,"m",null,1.9665999999999999,null,null,{"$f":"D1365*G1365","v":19.666}]
[null,"M1205","Prego de ferro",0.2994,"kg",null,16.544499999999999,null,null,{"$f":"D1366*G1366","v":4.9534232999999999}]
[null,"M3949","Desmoldante para fôrmas metálicas",2.1299999999999999E-2,"l",null,16.5001,null,null,0.35145212999999997]
[null,"M0451","Concreto usinado - fck = 20 MPa (comercial)",1,"m³",null,550,"SINAPI",null,550]
[null,"-",0,null,0,null,0,null,null,0]
[null,null,null,"Custo unitário total de material",{"$nulls":5},{"$f":"SUM(J1365:J1369)","v":574.97087542999998}]
[null,"D - ATIVIDADES AUXILIARES",null,"Quantidade","Unidade",null,"Custo Unitário","Custo Unitário"]
[null,"-",0,null,0,null,0,null,null,{"$f":"D1372*G1372","v":0}]
[null,"-",0,null,0,null,0,null,null,{"$f":"D1373*G1373","v":0}]
[null,null,null,"Custo total de atividades auxiliares",{"$nulls":5},{"$f":"SUM(J1372:J1373)","v":0}]
[{"$nulls":7},"Subtotal",null,{"$f":"J1361+J1370+J1374+J1362+J1363","v":720.6480531499999}]
[null,"E - TEMPO FIXO",null,"Código","Quantidade","Unidade",null,"Custo Unitário","Custo Unitário"]
[null,"-",0,"-",null,"t",null,0,null,{"$f":"ROUNDDOWN(E1377*H1377,4)","v":0}]
[null,"-",0,"-",null,"t",null,0,null,{"$f":"ROUNDDOWN(E1378*H1378,4)","v":0}]
[null,null,null,"Custo unitário total de tempo fixo",{"$nulls":5},{"$f":"SUM(J1377:J1378)","v":0}]
[null,"F - MOMENTO DE TRANSPORTE",null,"Quantidade","Unidade","DMT",null,null,null,"Custo Unitário"]
[{"$nulls":5},"LN","RP","P"]
[null,"-",0,null,"tkm"]
[null,"-",0,null,"tkm"]
[null,null,null,"Custo unitário total de transporte"]
[{"$nulls":5},"Custo unitário direto total",null,null,null,{"$f":"TRUNC(J1375+J1379,2)","v":720.64}]
[null,"Obs."]
[]
[46,"1ª/GRD",{"$nulls":8},{"$f":"J1424","v":259.45999999999998}]
[null,"OBRA:","DRENAGEM E  PAVIMENTAÇÃO ASFÁLTICA EM CBUQ - AV. JOANA GOMES DOS SANTOS E ROTATÓRIA (SÃO JOÃO DO PACUÍ / MG)"]
[null,"Custo Unitário de Referência",null,null,"Minas Gerais"]
[{"$nulls":4}," Janeiro/2025 ",null,null,"Produção da equipe ",3,{"$f":"VLOOKUP(A1388,ORÇAMENTO!$A$10:$L$58,7,1)","v":"UN."}]
[null,5213440,"PLACA DE REGULAMENTAÇÃO EM AÇO, D=60CM - PELÍCULA RETRORREFLETIVA - FORNECIMENTO E INSTALAÇÃO, INCLUSIVE  SUPORTE",{"$nulls":5},"Valores em reais (R$)"]
[null,"A - EQUIPAMENTOS",null,"Quantidade","Utilização",null,"Custo Horário",null,null,"Custo"]
[{"$nulls":4},"Operativa","Improdutiva","Produtivo","Improdutivo",null,"Horário Total"]
[null,"E9687","Caminhão carroceria com capacidade de 5 t - 115 kW",1,0.3,0.7,146.88079999999999,57.423099999999998,null,{"$f":"D1395*(E1395*G1395+F1395*H1395)","v":84.260409999999993}]
[null,"-",0,null,null,null,0,0,null,{"$f":"D1396*(E1396*G1396+F1396*H1396)","v":0}]
[{"$nulls":7},"Custo horário total de equipamentos",null,{"$f":"SUM(J1395:J1396)","v":84.260409999999993}]
[null,"B - MÃO DE OBRA",null,"Quantidade","Unidade",null,"Custo Horário","Custo Horário Total"]
[null,"P9830","Montador",1,"h",null,36.409500000000001,null,null,{"$f":"D1399*G1399","v":36.409500000000001}]
[null,"P9824","Servente",2,"h",null,21.3355,null,null,{"$f":"D1400*G1400","v":42.670999999999999}]
[null,null,null,"Custo horário total de mão de obra",{"$nulls":5},{"$f":"SUM(J1399:J1400)","v":79.080500000000001}]
[null,null,null,"Custo horário total de execução",{"$nulls":5},{"$f":"J1397+J1401","v":163.34091000000001}]
[null,null,null,"Custo unitário de execução",{"$nulls":5},{"$f":"J1402/I1391","v":54.44697}]
[{"$nulls":7},"Custo do FIC",null,0]
[{"$nulls":7},"Custo do FIT",null,0]
[null,"C - MATERIAL",null,"Quantidade","Unidade",null,"Preço Unitário","Custo Unitário"]
[null,"-",0,null,0,null,0,null,null,{"$f":"D1407*G1407","v":0}]
[null,"-",0,null,0,null,0,null,null,{"$f":"D1408*G1408","v":0}]
[null,null,null,"Custo unitário total de material",{"$nulls":5},{"$f":"SUM(J1407:J1408)","v":0}]
[null,"D - ATIVIDADES AUXILIARES",null,"Quantidade","Unidade",null,"Custo Unitário","Custo Unitário"]
[null,5213414,"Placa em aço nº 16 galvanizado com película retrorrefletiva tipo I + SI - confecção",0.35993999999999998,"m²",null,569.58000000000004,null,null,{"$f":"D1411*G1411","v":205.01462520000001}]
[null,"-",0,null,0,null,0,null,null,{"$f":"D1412*G1412","v":0}]
[null,null,null,"Custo total de atividades auxiliares",{"$nulls":5},{"$f":"SUM(J1411:J1412)","v":205.01462520000001}]
[{"$nulls":7},"Subtotal",null,{"$f":"J1403+J1409+J1413+J1404+J1405","v":259.46159520000003}]
[null,"E - TEMPO FIXO",null,"Código","Quantidade","Unidade",null,"Custo Unitário","Custo Unitário"]
[null,"-",0,"-",null,"t",null,0,null,{"$f":"ROUNDDOWN(E1416*H1416,4)","v":0}]
[null,"-",0,"-",null,"t",null,0,null,{"$f":"ROUNDDOWN(E1417*H1417,4)","v":0}]
[null,null,null,"Custo unitário total de tempo fixo",{"$nulls":5},{"$f":"SUM(J1416:J1417)","v":0}]
[null,"F - MOMENTO DE TRANSPORTE",null,"Quantidade","Unidade","DMT",null,null,null,"Custo Unitário"]
[{"$nulls":5},"LN","RP","P"]
[null,"-",0,null,"tkm"]
[null,"-",0,null,"tkm"]
[null,null,null,"Custo unitário total de transporte"]
[{"$nulls":5},"Custo unitário direto total",null,null,null,{"$f":"TRUNC(J1414+J1418,2)","v":259.45999999999998}]
[null,"Obs."]
[]
[49,"1ª/GRD",{"$nulls":8},{"$f":"J1470","v":29.17}]
[null,"OBRA:","DRENAGEM E  PAVIMENTAÇÃO ASFÁLTICA EM CBUQ - AV. JOANA GOMES DOS SANTOS E ROTATÓRIA (SÃO JOÃO DO PACUÍ / MG)"]
[null,"Custo Unitário de Referência",null,null,"Minas Gerais"]
[{"$nulls":4}," Janeiro/2025 ",null,null,"Produção da equipe ",149.4,{"$f":"VLOOKUP(A1427,ORÇAMENTO!$A$10:$L$58,7,1)","v":"M2"}]
[null,5213401,"PINTURA DE EIXO VIÁRIO SOBRE ASFALTO COM TINTA RETRORREFLETIVA A BASE DE RESINA ACRÍLICA COM MICROESFERAS DE VIDRO, APLICAÇÃO MECÂNICA COM DEMARCADORA AUTOPROPELIDA",{"$nulls":5},"Valores em reais (R$)"]
[null,"A - EQUIPAMENTOS",null,"Quantidade","Utilização",null,"Custo Horário",null,null,"Custo"]
[{"$nulls":4},"Operativa","Improdutiva","Produtivo","Improdutivo",null,"Horário Total"]
[null,"E9644","Caminhão demarcador de faixas com sistema de pintura a frio - 28 kW/115 kW",1,1,0,374.84390000000002,155.3843,null,{"$f":"D1434*(E1434*G1434+F1434*H1434)","v":374.84390000000002}]
[null,"-",0,null,null,null,0,0,null,{"$f":"D1435*(E1435*G1435+F1435*H1435)","v":0}]
[{"$nulls":7},"Custo horário total de equipamentos",null,{"$f":"SUM(J1434:J1435)","v":374.84390000000002}]
[null,"B - MÃO DE OBRA",null,"Quantidade","Unidade",null,"Custo Horário","Custo Horário Total"]
[null,"P9853","Pré-marcador",1,"h",null,22.8993,null,null,{"$f":"D1438*G1438","v":22.8993}]
[null,"P9824","Servente",4,"h",null,21.3355,null,null,{"$f":"D1439*G1439","v":85.341999999999999}]
[null,null,null,"Custo horário total de mão de obra",{"$nulls":5},{"$f":"SUM(J1438:J1439)","v":108.2413}]
[null,null,null,"Custo horário total de execução",{"$nulls":5},{"$f":"J1436+J1440","v":483.08519999999999}]
[null,null,null,"Custo unitário de execução",{"$nulls":5},{"$f":"J1441/I1430","v":3.2335020080321284}]
[{"$nulls":7},"Custo do FIC",null,0]
[{"$nulls":7},"Custo do FIT",null,0]
[null,"C - MATERIAL",null,"Quantidade","Unidade",null,"Preço Unitário","Custo Unitário"]
[null,"M2037","Microesferas refletivas de vidro tipo I-B",0.12,"kg",null,8.7245000000000008,null,null,{"$f":"D1446*G1446","v":1.04694}]
[null,"M2038","Microesferas refletivas de vidro tipo II-A",0.35,"kg",null,8.9086999999999996,null,null,{"$f":"D1447*G1447","v":3.1180449999999995}]
[null,"M2034","Solvente para tinta à base de resina acrílica",0.03,"l",null,16.8491,null,null,0.50547299999999995]
[null,"M2044","Tinta à base de resina acrílica emulsionada em água para pré-marcação viária",9.7000000000000005E-4,"l",null,21.025400000000001,null,null,2.0394638000000003E-2]
[null,"M2027","Tinta à base de resina acrílica estirenada para demarcação viária",0.6,"l",null,35.350499999999997,null,null,21.210299999999997]
[null,null,null,"Custo unitário total de material",{"$nulls":5},{"$f":"SUM(J1446:J1450)","v":25.901152637999996}]
[null,"D - ATIVIDADES AUXILIARES",null,"Quantidade","Unidade",null,"Custo Unitário","Custo Unitário"]
[null,"-",0,null,0,null,0,null,null,{"$f":"D1453*G1453","v":0}]
[null,"-",0,null,0,null,0,null,null,{"$f":"D1454*G1454","v":0}]
[null,null,null,"Custo total de atividades auxiliares",{"$nulls":5},{"$f":"SUM(J1453:J1454)","v":0}]
[{"$nulls":7},"Subtotal",null,{"$f":"J1442+J1451+J1455+J1443+J1444","v":29.134654646032125}]
[null,"E - TEMPO FIXO",null,"Código","Quantidade","Unidade",null,"Custo Unitário","Custo Unitário"]
[null,"M2037","Microesferas refletivas de vidro tipo I-B",5914655,1.2E-4,"t",null,32.520000000000003,null,{"$f":"ROUNDDOWN(E1458*H1458,4)","v":3.8999999999999998E-3}]
[null,"M2038","Microesferas refletivas de vidro tipo II-A",5914655,3.5E-4,"t",null,32.520000000000003,null,{"$f":"ROUNDDOWN(E1459*H1459,4)","v":1.1299999999999999E-2}]
[null,"M2034","Solvente para tinta à base de resina acrílica",5914655,3.0000000000000001E-5,"t",null,32.520000000000003,null,8.9999999999999998E-4]
[null,"M2027","Tinta à base de resina acrílica estirenada para demarcação viária",5914655,8.3000000000000001E-4,"t",null,32.520000000000003,null,2.69E-2]
[null,null,null,"Custo unitário total de tempo fixo",{"$nulls":5},{"$f":"SUM(J1458:J1461)","v":4.2999999999999997E-2}]
[null,"F - MOMENTO DE TRANSPORTE",null,"Quantidade","Unidade","DMT",null,null,null,"Custo Unitário"]
[{"$nulls":5},"LN","RP","P"]
[null,"M2037","Microesferas refletivas de vidro tipo I-B",1.2E-4,"tkm"]
[null,"M2038","Microesferas refletivas de vidro tipo II-A",3.5E-4,"tkm"]
[null,"M2034","Solvente para tinta à base de resina acrílica",3.0000000000000001E-5,"tkm"]
[null,"M2027","Tinta à base de resina acrílica estirenada para demarcação viária",8.3000000000000001E-4,"tkm"]
[null,null,null,"Custo unitário total de transporte"]
[{"$nulls":5},"Custo unitário direto total",null,null,null,{"$f":"TRUNC(J1456+J1462,2)","v":29.17}]
[null,"Obs."]
[]
[{"$f":"A1427+1","v":50},"1ª/GRD",{"$nulls":8},{"$f":"J1511","v":31.08}]
[null,"OBRA:","DRENAGEM E  PAVIMENTAÇÃO ASFÁLTICA EM CBUQ - AV. JOANA GOMES DOS SANTOS E ROTATÓRIA (SÃO JOÃO DO PACUÍ / MG)"]
[null,"Custo Unitário de Referência",null,null,"Minas Gerais"]
[{"$nulls":4}," Janeiro/2025 ",null,null,"Produção da equipe ",36,{"$f":"VLOOKUP(A1473,ORÇAMENTO!$A$10:$L$58,7,1)","v":"UNID."}]
[null,5213360,"TACHA REFLETIVA EM PLÁSTICO INJETADO - BIDIRECIONAL COM UM PINO - FORNECIMENTO E COLOCAÇÃO",{"$nulls":5},"Valores em reais (R$)"]
[null,"A - EQUIPAMENTOS",null,"Quantidade","Utilização",null,"Custo Horário",null,null,"Custo"]
[{"$nulls":4},"Operativa","Improdutiva","Produtivo","Improdutivo",null,"Horário Total"]
[null,"E9687","Caminhão carroceria com capacidade de 5 t - 115 kW",1,1,0,146.88079999999999,57.423099999999998,null,{"$f":"D1480*(E1480*G1480+F1480*H1480)","v":146.88079999999999}]
[null,"E9764","Grupo gerador - 7,2 kVA",1,1,0,10.466200000000001,0.4899,null,{"$f":"D1481*(E1481*G1481+F1481*H1481)","v":10.466200000000001}]
[null,"E9675","Martelete perfurador/rompedor elétrico - 1,50 kW",1,1,0,1.2357,0.68189999999999995,null,{"$f":"D1482*(E1482*G1482+F1482*H1482)","v":1.2357}]
[{"$nulls":7},"Custo horário total de equipamentos",null,{"$f":"SUM(J1480:J1482)","v":158.58269999999999}]
[null,"B - MÃO DE OBRA",null,"Quantidade","Unidade",null,"Custo Horário","Custo Horário Total"]
[null,"P9830","Montador",1,"h",null,36.409500000000001,null,null,{"$f":"D1485*G1485","v":36.409500000000001}]
[null,"P9824","Servente",5,"h",null,21.3355,null,null,{"$f":"D1486*G1486","v":106.67749999999999}]
[null,null,null,"Custo horário total de mão de obra",{"$nulls":5},{"$f":"SUM(J1485:J1486)","v":143.08699999999999}]
[null,null,null,"Custo horário total de execução",{"$nulls":5},{"$f":"J1483+J1487","v":301.66969999999998}]
[null,null,null,"Custo unitário de execução",{"$nulls":5},{"$f":"J1488/I1476","v":8.3797138888888885}]
[{"$nulls":7},"Custo do FIC",null,0]
[{"$nulls":7},"Custo do FIT",null,0]
[null,"C - MATERIAL",null,"Quantidade","Unidade",null,"Preço Unitário","Custo Unitário"]
[null,"M2041","Adesivo à base de resina poliéster",0.10292,"kg",null,28.1373,null,null,{"$f":"D1493*G1493","v":2.8958909159999999}]
[null,"M1528","Broca de widia - D = 13 mm e C = 150 mm",3.4099999999999998E-3,"un",null,20.665500000000002,null,null,{"$f":"D1494*G1494","v":7.0469354999999997E-2}]
[null,"M3821","Tacha refletiva em plástico injetado bidirecional com um pino - tipo I",1,"un",null,19.734000000000002,null,null,19.734000000000002]
[null,null,null,"Custo unitário total de material",{"$nulls":5},{"$f":"SUM(J1493:J1495)","v":22.700360271000001}]
[null,"D - ATIVIDADES AUXILIARES",null,"Quantidade","Unidade",null,"Custo Unitário","Custo Unitário"]
[null,"-",0,null,0,null,0,null,null,{"$f":"D1498*G1498","v":0}]
[null,"-",0,null,0,null,0,null,null,{"$f":"D1499*G1499","v":0}]
[null,null,null,"Custo total de atividades auxiliares",{"$nulls":5},{"$f":"SUM(J1498:J1499)","v":0}]
[{"$nulls":7},"Subtotal",null,{"$f":"J1489+J1496+J1500+J1490+J1491","v":31.080074159888888}]
[null,"E - TEMPO FIXO",null,"Código","Quantidade","Unidade",null,"Custo Unitário","Custo Unitário"]
[null,"M2041","Adesivo à base de resina poliéster",5914655,1E-4,"t",null,32.520000000000003,null,{"$f":"ROUNDDOWN(E1503*H1503,4)","v":3.2000000000000002E-3}]
[null,"M3821","Tacha refletiva em plástico injetado bidirecional com um pino - tipo I",5914655,1.6000000000000001E-4,"t",null,32.520000000000003,null,{"$f":"ROUNDDOWN(E1504*H1504,4)","v":5.1999999999999998E-3}]
[null,null,null,"Custo unitário total de tempo fixo",{"$nulls":5},{"$f":"SUM(J1503:J1504)","v":8.3999999999999995E-3}]
[null,"F - MOMENTO DE TRANSPORTE",null,"Quantidade","Unidade","DMT",null,null,null,"Custo Unitário"]
[{"$nulls":5},"LN","RP","P"]
[null,"M2041","Adesivo à base de resina poliéster",1E-4,"tkm"]
[null,"M3821","Tacha refletiva em plástico injetado bidirecional com um pino - tipo I",1.6000000000000001E-4,"tkm"]
[null,null,null,"Custo unitário total de transporte"]
[{"$nulls":5},"Custo unitário direto total",null,null,null,{"$f":"TRUNC(J1501+J1505,2)","v":31.08}]
[null,"Obs."]
[]
[{"$f":"A1473+1","v":51},"1ª/GRD",{"$nulls":8},{"$f":"J1557","v":41.95}]
[null,"OBRA:","DRENAGEM E  PAVIMENTAÇÃO ASFÁLTICA EM CBUQ - AV. JOANA GOMES DOS SANTOS E ROTATÓRIA (SÃO JOÃO DO PACUÍ / MG)"]
[null,"Custo Unitário de Referência",null,null,"Minas Gerais"]
[{"$nulls":4}," Janeiro/2025 ",null,null,"Produção da equipe ",30.18,{"$f":"VLOOKUP(A1514,ORÇAMENTO!$A$10:$L$58,7,1)","v":"M2"}]
[null,5213405,"PINTURA DE FAIXA DE PEDESTRE OU ZEBRADA TINTA RETRORREFLETIVA A BASE DE RESINA ACRÍLICA COM MICROESFERAS DE VIDRO, APLICAÇÃO MANUAL",{"$nulls":5},"Valores em reais (R$)"]
[null,"A - EQUIPAMENTOS",null,"Quantidade","Utilização",null,"Custo Horário",null,null,"Custo"]
[{"$nulls":4},"Operativa","Improdutiva","Produtivo","Improdutivo",null,"Horário Total"]
[null,"E9644","Caminhão demarcador de faixas com sistema de pintura a frio - 28 kW/115 kW",1,1,0,374.84390000000002,155.3843,null,{"$f":"D1521*(E1521*G1521+F1521*H1521)","v":374.84390000000002}]
[null,"-",0,null,null,null,0,0,null,{"$f":"D1522*(E1522*G1522+F1522*H1522)","v":0}]
[{"$nulls":7},"Custo horário total de equipamentos",null,{"$f":"SUM(J1521:J1522)","v":374.84390000000002}]
[null,"B - MÃO DE OBRA",null,"Quantidade","Unidade",null,"Custo Horário","Custo Horário Total"]
[null,"P9853","Pré-marcador",1,"h",null,22.8993,null,null,{"$f":"D1525*G1525","v":22.8993}]
[null,"P9824","Servente",4,"h",null,21.3355,null,null,{"$f":"D1526*G1526","v":85.341999999999999}]
[null,null,null,"Custo horário total de mão de obra",{"$nulls":5},{"$f":"SUM(J1525:J1526)","v":108.2413}]
[null,null,null,"Custo horário total de execução",{"$nulls":5},{"$f":"J1523+J1527","v":483.08519999999999}]
[null,null,null,"Custo unitário de execução",{"$nulls":5},{"$f":"J1528/I1517","v":16.006799204771372}]
[{"$nulls":7},"Custo do FIC",null,0]
[{"$nulls":7},"Custo do FIT",null,0]
[null,"C - MATERIAL",null,"Quantidade","Unidade",null,"Preço Unitário","Custo Unitário"]
[null,"M2037","Microesferas refletivas de vidro tipo I-B",0.12,"kg",null,8.7245000000000008,null,null,{"$f":"D1533*G1533","v":1.04694}]
[null,"M2038","Microesferas refletivas de vidro tipo II-A",0.35,"kg",null,8.9086999999999996,null,null,{"$f":"D1534*G1534","v":3.1180449999999995}]
[null,"M2034","Solvente para tinta à base de resina acrílica",0.03,"l",null,16.8491,null,null,0.50547299999999995]
[null,"M2044","Tinta à base de resina acrílica emulsionada em água para pré-marcação viária",9.7000000000000005E-4,"l",null,21.025400000000001,null,null,2.0394638000000003E-2]
[null,"M2027","Tinta à base de resina acrílica estirenada para demarcação viária",0.6,"l",null,35.350499999999997,null,null,21.210299999999997]
[null,null,null,"Custo unitário total de material",{"$nulls":5},{"$f":"SUM(J1533:J1537)","v":25.901152637999996}]
[null,"D - ATIVIDADES AUXILIARES",null,"Quantidade","Unidade",null,"Custo Unitário","Custo Unitário"]
[null,"-",0,null,0,null,0,null,null,{"$f":"D1540*G1540","v":0}]
[null,"-",0,null,0,null,0,null,null,{"$f":"D1541*G1541","v":0}]
[null,null,null,"Custo total de atividades auxiliares",{"$nulls":5},{"$f":"SUM(J1540:J1541)","v":0}]
[{"$nulls":7},"Subtotal",null,{"$f":"J1529+J1538+J1542+J1530+J1531","v":41.907951842771368}]
[null,"E - TEMPO FIXO",null,"Código","Quantidade","Unidade",null,"Custo Unitário","Custo Unitário"]
[null,"M2037","Microesferas refletivas de vidro tipo I-B",5914655,1.2E-4,"t",null,32.520000000000003,null,{"$f":"ROUNDDOWN(E1545*H1545,4)","v":3.8999999999999998E-3}]
[null,"M2038","Microesferas refletivas de vidro tipo II-A",5914655,3.5E-4,"t",null,32.520000000000003,null,{"$f":"ROUNDDOWN(E1546*H1546,4)","v":1.1299999999999999E-2}]
[null,"M2034","Solvente para tinta à base de resina acrílica",5914655,3.0000000000000001E-5,"t",null,32.520000000000003,null,8.9999999999999998E-4]
[null,"M2027","Tinta à base de resina acrílica estirenada para demarcação viária",5914655,8.3000000000000001E-4,"t",null,32.520000000000003,null,2.69E-2]
[null,null,null,"Custo unitário total de tempo fixo",{"$nulls":5},{"$f":"SUM(J1545:J1548)","v":4.2999999999999997E-2}]
[null,"F - MOMENTO DE TRANSPORTE",null,"Quantidade","Unidade","DMT",null,null,null,"Custo Unitário"]
[{"$nulls":5},"LN","RP","P"]
[null,"M2037","Microesferas refletivas de vidro tipo I-B",1.2E-4,"tkm"]
[null,"M2038","Microesferas refletivas de vidro tipo II-A",3.5E-4,"tkm"]
[null,"M2034","Solvente para tinta à base de resina acrílica",3.0000000000000001E-5,"tkm"]
[null,"M2027","Tinta à base de resina acrílica estirenada para demarcação viária",8.3000000000000001E-4,"tkm"]
[null,null,null,"Custo unitário total de transporte"]
[{"$nulls":5},"Custo unitário direto total",null,null,null,{"$f":"TRUNC(J1543+J1549,2)","v":41.95}]
[null,"Obs."]

{"sheet":"CPU-FORNEC","index":2,"n_rows":92,"n_cols":14,"rows_kept":92,"cut":false,"hidden":false,"merged":[[71,0,80,0],[71,1,71,3],[71,4,71,7],[72,2,72,5],[73,2,73,3],[74,1,74,7],[77,1,77,3],[77,5,77,6],[78,1,78,6],[79,1,79,6],[80,1,80,6],[0,0,26,0],[0,1,0,3],[0,4,0,7],[22,1,22,3],[49,0,58,0],[49,1,49,3],[49,4,49,7],[50,2,50,5],[51,2,51,3],[52,1,52,7],[55,1,55,3],[55,5,55,6],[56,1,56,6],[57,1,57,6],[58,1,58,6],[27,1,27,3],[27,4,27,7],[28,2,28,5],[27,0,36,0],[29,2,29,3],[30,1,30,7],[33,1,33,3],[33,5,33,6],[34,1,34,6],[35,1,35,6],[36,1,36,6],[0,10,0,11],[1,2,1,5],[1,10,1,11],[2,2,2,3],[3,1,3,7],[22,5,22,6],[23,1,23,6],[24,1,24,6],[25,1,25,6],[5,1,5,7],[9,1,9,7],[13,1,13,7],[17,1,17,7],[38,0,47,0],[38,1,38,3],[38,4,38,7],[39,2,39,5],[40,2,40,3],[41,1,41,7],[44,1,44,3],[44,5,44,6],[45,1,45,6],[46,1,46,6],[47,1,47,6],[60,0,69,0],[60,1,60,3],[60,4,60,7],[61,2,61,5],[62,2,62,3],[63,1,63,7],[66,1,66,3],[66,5,66,6],[67,1,67,6],[68,1,68,6],[69,1,69,6],[81,1,81,7],[82,0,91,0],[82,1,82,3],[82,4,82,7],[83,2,83,5],[84,2,84,3],[85,1,85,7],[88,1,88,3],[88,5,88,6],[89,1,89,6],[90,1,90,6],[91,1,91,6]]}
[1,"CODEVASF",null,null," COMPOSIÇÃO DE PREÇO UNITÁRIO",null,null,null,{"$f":"H24","v":0},{"$f":"H26","v":0},"BDI CALCULADO:",null,{"$f":"ORÇAMENTO!L6","v":15}]
[null,"OBRA:  ","DRENAGEM E  PAVIMENTAÇÃO ASFÁLTICA EM CBUQ - AV. JOANA GOMES DOS SANTOS E ROTATÓRIA (SÃO JOÃO DO PACUÍ / MG)",null,null,null,"DATA: ",{"$f":"ORÇAMENTO!C6","v":" ABRIL / 2025"},null,null,"BDI DIFERENCIADO:",null,{"$f":"'BDI FORN'!D31/100","v":0.15}]
[null,"SERVIÇO:  ","CPU.1",null,"Referência:","CODEVASF","UNIDADE: ",{"$f":"VLOOKUP(A1,ORÇAMENTO!A11:L35,5)","v":"MOBILIZAÇÃO E DESMOBILIZAÇÃO"}]
[]
[null,"TIPO ITEM","CODIGO ITEM","DESCRIÇÃO ITEM","UNIDADE ITEM","COEFICIENTE","PRECO UNITARIO","CUSTO TOTAL",null,"distancia =",90,"B.DESPACHO"]
[null,"EQUIPAMENTOS",{"$nulls":7},"Pá carregadeira ",null,null,10.1," ton"]
[null,null,"E9001","E9001","E9001",null,"E9001"]
[]
[]
[null,"MÃO DE OBRA"]
[]
[]
[]
[null,"MATERIAIS"]
[]
[]
[{"$nulls":7},{"$f":"ROUNDDOWN(F17*G17,2)","v":0},null,"Motoniveladora ",null,null,12.47," ton"]
[null,"ATIVIDADES AUXILIARES",{"$nulls":7},"Trator de pneus",null,null,2.8," ton"]
[{"$nulls":7},{"$f":"ROUNDDOWN(F19*G19,2)","v":0}]
[{"$nulls":7},0]
[{"$nulls":7},0]
[{"$nulls":7},{"$f":"ROUNDDOWN(F22*G22,2)","v":0},null,"Rolo Compactador ",null,null,15.33," ton"]
[null,"PRODUÇÃO DA EQUIPE",null,null,1,"CUSTO ",null,{"$f":"SUM(H6:H22)","v":0},null,"Grade de disco",null,null,1," ton"]
[null,"TOTAL",{"$nulls":5},{"$f":"H23/E23","v":0},"OK","RETROESCAVADEIRA",null,null,6.67," ton"]
[null,"BDI                %",{"$nulls":5},{"$f":"1+$M$1","v":16}]
[null,"TOTAL DO SERVIÇO - R$",{"$nulls":5},{"$f":"ROUND(H24*H25,2)","v":0}]
[]
["F1","CODEVASF",null,null," COMPOSIÇÃO DE PREÇO UNITÁRIO",null,null,null,{"$f":"H35","v":3532.13},{"$f":"H37","v":4061.95}]
[null,"OBRA:  ","DRENAGEM E  PAVIMENTAÇÃO ASFÁLTICA EM CBUQ - AV. JOANA GOMES DOS SANTOS E ROTATÓRIA (SÃO JOÃO DO PACUÍ / MG)",null,null,null,"DATA: ",{"$f":"$H$2","v":" ABRIL / 2025"}]
[null,"SERVIÇO:  ","AQUISIÇÃO DE EMULSÃO ASFÁLTICA PARA IMPRIMAÇÃO (EAI) - EXCLUSIVE TRANSPORTE",null,"Referência:","CODEVASF","UNIDADE: ",{"$f":"VLOOKUP(A28,ORÇAMENTO!$A$11:$L$65,7)","v":"T"}]
[]
[null,"TIPO ITEM","CODIGO ITEM","DESCRIÇÃO ITEM","UNIDADE ITEM","COEFICIENTE","PRECO UNITARIO","CUSTO TOTAL"]
[null,"INSUMO","ANP","EMULSÃO ASFÁLTICA PARA SERVIÇO DE IMPRIMAÇÃO (MEMÓRIA EM ANEXO)","T",1,3532.1370595881235,{"$f":"ROUNDDOWN(F33*G33,2)","v":3532.13}]
[null,"PRODUÇÃO DA EQUIPE",null,null,1,"CUSTO ",null,{"$f":"SUM(H33:H33)","v":3532.13}]
[null,"TOTAL",{"$nulls":5},{"$f":"H34/E34","v":3532.13}]
[null,"BDI                %",{"$nulls":5},{"$f":"1+$M$2","v":1.1499999999999999}]
[null,"TOTAL DO SERVIÇO - R$",{"$nulls":5},{"$f":"ROUND(H35*H36,2)","v":4061.95},"OK"]
[]
["F2","CODEVASF",null,null," COMPOSIÇÃO DE PREÇO UNITÁRIO",null,null,null,{"$f":"H46","v":407.31},{"$f":"H48","v":468.41}]
[null,"OBRA:  ","DRENAGEM E  PAVIMENTAÇÃO ASFÁLTICA EM CBUQ - AV. JOANA GOMES DOS SANTOS E ROTATÓRIA (SÃO JOÃO DO PACUÍ / MG)",null,null,null,"DATA: ",{"$f":"$H$2","v":" ABRIL / 2025"}]
[null,"SERVIÇO:  ","TRANSPORTE DE EMULSÃO ASFÁLTICA PARA IMPRIMAÇÃO (EAI)",null,"Referência:","CODEVASF","UNIDADE: ",{"$f":"VLOOKUP(A39,ORÇAMENTO!$A$11:$L$65,7)","v":"T"}]
[]
[null,"TIPO ITEM","CODIGO ITEM","DESCRIÇÃO ITEM","UNIDADE ITEM","COEFICIENTE","PRECO UNITARIO","CUSTO TOTAL"]
[null,"INSUMO"," - ","TRANSPORTE DE EMULSÃO ASFÁLTICA PARA IMPRIMAÇÃO (EAI), INCLUINDO CUSTO TOTAL DO TRANSPORTE (COMBUSTÍVEL, PEDÁGIOS, ETC.) E ICMS - MEMÓRIA ANEXA","T",1,407.31285714285713,{"$f":"ROUNDDOWN(F44*G44,2)","v":407.31}]
[null,"PRODUÇÃO DA EQUIPE",null,null,1,"CUSTO ",null,{"$f":"SUM(H44:H44)","v":407.31}]
[null,"TOTAL",{"$nulls":5},{"$f":"H45/E45","v":407.31}]
[null,"BDI                %",{"$nulls":5},{"$f":"1+$M$2","v":1.1499999999999999}]
[null,"TOTAL DO SERVIÇO - R$",{"$nulls":5},{"$f":"ROUND(H46*H47,2)","v":468.41},"OK"]
[]
["F3","CODEVASF",null,null," COMPOSIÇÃO DE PREÇO UNITÁRIO",null,null,null,{"$f":"H57","v":3480.79},{"$f":"H59","v":4002.91}]
[null,"OBRA:  ","DRENAGEM E  PAVIMENTAÇÃO ASFÁLTICA EM CBUQ - AV. JOANA GOMES DOS SANTOS E ROTATÓRIA (SÃO JOÃO DO PACUÍ / MG)",null,null,null,"DATA: ",{"$f":"$H$2","v":" ABRIL / 2025"}]
[null,"SERVIÇO:  ","AQUISIÇÃO DE EMULSAO ASFALTICA CATIONICA RR-1C - EXCLUSIVE TRANSPORTE",null,"Referência:","CODEVASF","UNIDADE: ",{"$f":"VLOOKUP(A50,ORÇAMENTO!$A$11:$L$65,7)","v":"T"}]
[]
[null,"TIPO ITEM","CODIGO ITEM","DESCRIÇÃO ITEM","UNIDADE ITEM","COEFICIENTE","PRECO UNITARIO","CUSTO TOTAL"]
[null,"INSUMO","ANP","EMULSÃO ASFÁLTICA CATIÔNICA RR-1C(MEMÓRIA EM ANEXO)","T",1,3480.7926129148304,{"$f":"ROUNDDOWN(F55*G55,2)","v":3480.79}]
[null,"PRODUÇÃO DA EQUIPE",null,null,1,"CUSTO ",null,{"$f":"SUM(H55:H55)","v":3480.79}]
[null,"TOTAL",{"$nulls":5},{"$f":"H56/E56","v":3480.79},"OK"]
[null,"BDI                %",{"$nulls":5},{"$f":"1+$M$2","v":1.1499999999999999}]
[null,"TOTAL DO SERVIÇO - R$",{"$nulls":5},{"$f":"ROUND(H57*H58,2)","v":4002.91}]
[]
["F4","CODEVASF",null,null," COMPOSIÇÃO DE PREÇO UNITÁRIO",null,null,null,{"$f":"H68","v":496.49},{"$f":"H70","v":570.96}]
[null,"OBRA:  ","DRENAGEM E  PAVIMENTAÇÃO ASFÁLTICA EM CBUQ - AV. JOANA GOMES DOS SANTOS E ROTATÓRIA (SÃO JOÃO DO PACUÍ / MG)",null,null,null,"DATA: ",{"$f":"$H$2","v":" ABRIL / 2025"}]
[null,"SERVIÇO:  ","TRANSPORTE DE EMULSÃO ASFÁLTICA CATIONICA RR-1C",null,"Referência:","CODEVASF","UNIDADE: ",{"$f":"VLOOKUP(A61,ORÇAMENTO!$A$11:$L$65,7)","v":"T"}]
[]
[null,"TIPO ITEM","CODIGO ITEM","DESCRIÇÃO ITEM","UNIDADE ITEM","COEFICIENTE","PRECO UNITARIO","CUSTO TOTAL"]
[null,"INSUMO"," - ","TRANSPORTE DE EMULSÃO ASFÁLTICA CATIONICA TIPO RR-1C, INCLUINDO CUSTO TOTAL DO TRANSPORTE (COMBUSTÍVEL, PEDÁGIOS, ETC.) E ICMS - MEMÓRIA ANEXA","T",1,496.48999999999995,{"$f":"ROUNDDOWN(F66*G66,2)","v":496.49}]
[null,"PRODUÇÃO DA EQUIPE",null,null,1,"CUSTO ",null,{"$f":"SUM(H66:H66)","v":496.49}]
[null,"TOTAL",{"$nulls":5},{"$f":"H67/E67","v":496.49},"OK"]
[null,"BDI                %",{"$nulls":5},{"$f":"1+$M$2","v":1.1499999999999999}]
[null,"TOTAL DO SERVIÇO - R$",{"$nulls":5},{"$f":"ROUND(H68*H69,2)","v":570.96}]
[]
["F5","CODEVASF",null,null," COMPOSIÇÃO DE PREÇO UNITÁRIO",null,null,null,{"$f":"H79","v":4815.2},{"$f":"H81","v":5537.48}]
[null,"OBRA:  ","DRENAGEM E  PAVIMENTAÇÃO ASFÁLTICA EM CBUQ - AV. JOANA GOMES DOS SANTOS E ROTATÓRIA (SÃO JOÃO DO PACUÍ / MG)",null,null,null,"DATA: ",{"$f":"$H$2","v":" ABRIL / 2025"}]
[null,"SERVIÇO:  ","AQUISIÇÃO DE CONCRETO ASFÁLTICO DE PETRÓLEO - CAP 50/70 - EXCLUSIVE TRANSPORTE",null,"Referência:","CODEVASF","UNIDADE: ",{"$f":"VLOOKUP(A72,ORÇAMENTO!$A$11:$L$65,7)","v":"T"}]
[]
[null,"TIPO ITEM","CODIGO ITEM","DESCRIÇÃO ITEM","UNIDADE ITEM","COEFICIENTE","PRECO UNITARIO","CUSTO TOTAL"]
[null,"INSUMO",1518,"CIMENTOS ASFÁLTICO DE PETRÓLEO TIPO CAP 50/70 (MEMÓRIA EM ANEXO)","T",1,4815.2051307564443,{"$f":"ROUNDDOWN(F77*G77,2)","v":4815.2}]
[null,"PRODUÇÃO DA EQUIPE",null,null,1,"CUSTO ",null,{"$f":"SUM(H77:H77)","v":4815.2}]
[null,"TOTAL",{"$nulls":5},{"$f":"H78/E78","v":4815.2}]
[null,"BDI                %",{"$nulls":5},{"$f":"1+$M$2","v":1.1499999999999999}]
[null,"TOTAL DO SERVIÇO - R$",{"$nulls":5},{"$f":"ROUND(H79*H80,2)","v":5537.48}]
[]
["F6","CODEVASF",null,null," COMPOSIÇÃO DE PREÇO UNITÁRIO",null,null,null,{"$f":"H90","v":387.92},{"$f":"H92","v":446.11}]
[null,"OBRA:  ","DRENAGEM E  PAVIMENTAÇÃO ASFÁLTICA EM CBUQ - AV. JOANA GOMES DOS SANTOS E ROTATÓRIA (SÃO JOÃO DO PACUÍ / MG)",null,null,null,"DATA: ",{"$f":"$H$2","v":" ABRIL / 2025"}]
[null,"SERVIÇO:  ","TRANSPORTE DE CONCRETO ASFÁLTICO DE PETRÓLEO - CAP 50/70",null,"Referência:","CODEVASF","UNIDADE: ",{"$f":"VLOOKUP(A83,ORÇAMENTO!$A$11:$L$65,7)","v":"T"}]
[]
[null,"TIPO ITEM","CODIGO ITEM","DESCRIÇÃO ITEM","UNIDADE ITEM","COEFICIENTE","PRECO UNITARIO","CUSTO TOTAL"]
[null,"INSUMO"," - ","TRANSPORTE DE CIMENTO ASFÁLTICO DE PETRÓLEO TIPO CAP 50-70, INCLUINDO CUSTO TOTAL DO TRANSPORTE (COMBUSTÍVEL, PEDÁGIOS, ETC.) E ICMS - MEMÓRIA ANEXA","T",1,387.91999999999996,{"$f":"ROUNDDOWN(F88*G88,2)","v":387.92}]
[null,"PRODUÇÃO DA EQUIPE",null,null,1,"CUSTO ",null,{"$f":"SUM(H88:H88)","v":387.92}]
[null,"TOTAL",{"$nulls":5},{"$f":"H89/E89","v":387.92}]
[null,"BDI                %",{"$nulls":5},{"$f":"1+$M$2","v":1.1499999999999999}]
[null,"TOTAL DO SERVIÇO - R$",{"$nulls":5},{"$f":"ROUND(H90*H91,2)","v":446.11}]

{"sheet":"BDI SERV","index":3,"n_rows":60,"n_cols":5,"rows_kept":60,"cut":false,"hidden":false,"merged":[[35,0,35,5],[36,0,36,5],[38,1,38,4],[39,2,39,3],[0,1,2,4],[25,1,25,3],[26,1,26,2],[26,3,26,4],[27,3,27,4]]}
[null,"DETALHAMENTO DO BDI - SERVIÇOS"]
[]
[]
[null,"Item","Descrição dos Serviços","% - PV","% - CD"]
[]
[null,1,"ADMINISTRAÇÃO CENTRAL"," ",{"$f":"SUM(E7:E9)","v":4.01}]
[null,"1.1","ESCRITÓRIO CENTRAL",null,4.01]
[null,"1.2","VIAGENS"]
[null,"1.3","OUTROS"]
[null," "," "," "," "]
[null,2,"IMPOSTOS E TAXAS",{"$f":"SUM(D12:D15)","v":5.15},{"$f":"SUM(E12:E15)","v":0}]
[null,"2.1","ISS - Proposta",{"$f":"D34*100","v":1.5}]
[null,"2.2","PIS",0.65]
[null,"2.3","Cofins",3]
[null,"2.4","Contribuição Previdenciaria (CPRB)"]
[]
[null,3,"TAXA DE RISCO",null,{"$f":"SUM(E18:E20)","v":0.96}]
[null,"3.1","SEGURO",null,0.2]
[null,"3.2","RISCO",null,0.56000000000000005]
[null,"3.3","GARANTIA",null,0.2]
[]
[null,4,"DESPESAS FINANCEIRAS",null,1.1100000000000001]
[]
[null,5,"LUCRO",null,8]
[]
[null,"BDI APRESENTADO:",null,null,{"$f":"IF($D$41=$C$43,$D$43,IF($D$41=$C$44,$D$44,IF($D$41=$C$44,$D$44,IF($D$41=$C$45,$D$45,0))))","v":20.85}]
[]
[null,null,"Legislação Municipal:"," Lei Complementar nº 410/2021"]
[null,null,"Município:","São João do Pacuí"]
[null,null,"Alíquota ISSQN:",0.05,"Município"]
[null,null,"Base de Cálculo:",0.3,"Art.64 §3º - IV a"]
[null,null,"Valor Serviço:",{"$f":"ORÇAMENTO!O3","v":0}]
[null,null,"Dedução - Material (estimado):",{"$f":"0.7*D32","v":0},{"$f":"D33/D32","v":{"$error":"#DIV/0!"}}]
[null,null,"ISSQN BDI:",{"$f":"IF(D32=\"\",0,ROUND(IF(D31=D49,((1-(D33/D32))*D30),D30*D31),4))","v":1.4999999999999999E-2},"(*)"]
[]
["Acórdão nº 2.622/2013 - TCU Plenário"]
["BDI = ARRED((((((1+(AC+TR)/100)*(1+DF/100)*(1+L/100))/(1-IMP/100))-1)*100);2)"]
[]
[null,"(*) É obrigação da licitante a verificação da Legislação Tributária vigente no município, bem como o cálculo dos valores totais de serviços e materiais estimados, para apresentação de sua proposta."]
[]
[null,null,"Forma de Cálculo do BDI:","BDI - Acórdão nº 2.622/2013 - TCU"]
[]
[null,null,"BDI - Digitado",{"$f":"ROUND(E6+E11+E17+E22+E24,2)","v":14.08}]
[null,null,"BDI - Calculado",{"$f":"ROUND((((1+(E6/100+E22/100+E17/100))/(1-(D11/100+E24/100)))-1)*100,2)","v":22.14}]
[null,null,"BDI - Acórdão nº 2.622/2013 - TCU",{"$f":"ROUND((((((1+(E6+E17)/100)*(1+E22/100)*(1+E24/100))/(1-D11/100))-1)*100),2)","v":20.85}]
[]
[]
[]
[null,null,null,"Dedução - Material","Município"]
[null,null,null,0.1,"Simples Nacional"]
[null,null,null,0.2,"Municípios Indefinidos"]
[null,null,null,0.3]
[null,null,null,0.4]
[null,null,null,0.5]
[null,null,null,0.6]
[null,null,null,0.7]
[null,null,null,0.8]
[null,null,null,0.9]
[null,null,null,1]
[null,null,null,{"$f":"E31","v":"Art.64 §3º - IV a"}]

{"sheet":"BDI FORN","index":4,"n_rows":37,"n_cols":5,"rows_kept":37,"cut":false,"hidden":false,"merged":[[31,1,31,2],[32,0,34,5],[36,0,36,5],[0,1,2,4],[3,1,4,1],[3,2,4,2],[28,0,28,5],[30,1,30,2]]}
[null,"DETALHAMENTO DO BDI - FORNECIMENTO \n(MATERIAL ASFÁLTICO)"]
[]
[]
[null,"Item","Descrição dos Serviços","%","%"]
[null,null,null,"PV","CD"]
[]
[null,1,"ADMINISTRAÇÃO CENTRAL"," ",3.45]
[null,"1.1","ESCRITÓRIO CENTRAL"," "," "]
[null,"1.2","VIAGENS"," "," "]
[null,"1.3","OUTROS"," "," "]
[null," "," "," "," "]
[null,2,"IMPOSTOS E TAXAS",{"$f":"SUM(D13:D16)","v":3.65},{"$f":"SUM(E13:E16)","v":4.5600000000000005}]
[null,"2.1","ISS (*)",null,{"$f":"ROUND(D13*1.2515,2)","v":0}]
[null,"2.2","PIS",0.65,{"$f":"ROUND(D14*1.2515,2)","v":0.81}]
[null,"2.3","Cofins",3,{"$f":"ROUND(D15*1.2515,2)","v":3.75}]
[null,"2.4","CONTRIBUIÇÃO PREVIDENCIÁRIA SOBRE A RENDA BRUTA",0,{"$f":"ROUND(D16*1.2515,2)","v":0}]
[]
[null,3,"TAXA DE RISCO"," ",{"$f":"SUM(E19:E22)","v":1.08}]
[null,"3.1","SEGURO",null,0.24]
[null,"3.2","RISCO",null,0.6]
[null,"3.3","GARANTIA",null,0.24]
[]
[null,4,"DESPESAS FINANCEIRAS"," ",0.85]
[]
[null,5,"LUCRO",null,5.1100000000000003]
[]
[null," ","BDI - CALCULADO"," ",{"$f":"ROUND((((1+(E7+E18)/100)*(1+E23/100)*(1+E25/100)/(1-D12/100)-1)*100),2)","v":15}]
[]
["BDI = ((1+((AC+S+R+G)/100))x(1+DF/100)x(1+L/100)/(1-I/100)-1)*100"]
[]
[null,"BDI (CALCULADO):",null,{"$f":"ROUND((((1+((E7+E18)/100))*(1+E23/100)*(1+E25/100))/(1-D12/100)-1)*100,2)","v":15},"%"]
[null," "]
[]
[]
[]
[]
["BDI EM CONFORMIDADE COM OS ACÓRDÃOS Nº 2369/2011 e ACÓRDÃO Nº 2.622/2013 - TCU - PLENÁRIO"]

{"sheet":"CRONOGRAMA","index":5,"n_rows":19,"n_cols":12,"rows_kept":19,"cut":false,"hidden":false,"merged":[[15,1,16,2],[18,1,22,11],[11,0,12,0],[11,1,12,1],[11,2,12,2],[13,0,14,0],[13,1,14,1],[13,2,14,2],[9,0,10,0],[9,1,10,1],[9,2,10,2],[3,1,3,10],[5,0,6,0],[5,1,6,1],[5,2,6,2],[7,0,8,0],[7,1,8,1],[7,2,8,2],[0,1,0,11],[1,1,2,1],[1,2,2,4],[1,6,1,11],[2,6,2,11]]}
[null,"CRONOGRAMA FÍSICO-FINANCEIRO"]
[null,"OBRA: ",{"$f":"ORÇAMENTO!C5","v":"DRENAGEM E  PAVIMENTAÇÃO ASFÁLTICA EM CBUQ - AV. JOANA GOMES DOS SANTOS E ROTATÓRIA (SÃO JOÃO DO PACUÍ / MG)"},null,null,"VALOR:",{"$f":"ORÇAMENTO!L58","v":1999927.25}]
[{"$nulls":5},"PRAZO: ","180 DIAS "]
[]
[null,"ITEM","ETAPAS/DESCRIÇAO","FISICO/  FINANCEIRO","TOTAL    ETAPAS","MÊS 1","MÊS 2","MÊS 3","MÊS 4","MÊS 5","MÊS 6","TOTAL"]
["A",{"$f":"ORÇAMENTO!B10","v":1},{"$f":"ORÇAMENTO!E10","v":"SERVIÇOS PRELIMINARES "},"FISICO ",{"$f":"ROUND(E7/$G$2,4)","v":0.1011},0.25,0.15,0.15,0.15,0.15,0.15,{"$f":"SUM(F6:K6)","v":1}]
[null,null,null,"FINANCEIRO",{"$f":"ORÇAMENTO!L10","v":202224.08000000005},{"$f":"ROUND($E$7*F6,2)","v":50556.02},{"$f":"ROUND($E$7*G6,2)","v":30333.61},{"$f":"ROUND($E$7*H6,2)","v":30333.61},{"$f":"ROUND($E$7*I6,2)","v":30333.61},30333.61,30333.61,{"$f":"SUM(F7:K7)","v":202224.07}]
["B",{"$f":"VLOOKUP(A8,ORÇAMENTO!$A$10:$L$58,2)","v":2},{"$f":"VLOOKUP(A8,ORÇAMENTO!$A$10:$L$58,5)","v":"TERRAPLANAGEM E PAVIMENTAÇÃO"},"FISICO ",{"$f":"ROUND(E9/$G$2,4)","v":0.34110000000000001},0.1,0.2,0.2,0.2,0.2,0.1,{"$f":"SUM(F8:K8)","v":0.99999999999999989}]
[null,null,null,"FINANCEIRO",{"$f":"ORÇAMENTO!L20","v":682114.15},{"$f":"ROUND($E$9*F8,2)","v":68211.42},{"$f":"ROUND($E$9*G8,2)","v":136422.82999999999},{"$f":"ROUND($E$9*H8,2)","v":136422.82999999999},{"$f":"ROUND($E$9*I8,2)","v":136422.82999999999},136422.82999999999,68211.42,{"$f":"SUM(F9:K9)","v":682114.15999999992}]
["C",{"$f":"VLOOKUP(A10,ORÇAMENTO!$A$10:$L$58,2)","v":3},{"$f":"VLOOKUP(A10,ORÇAMENTO!$A$10:$L$58,5)","v":"TRANSPORTE DE MATERIAIS"},"FISICO ",{"$f":"ROUND(E11/$G$2,4)","v":0.11700000000000001},0.25,0.5,0.25,null,null,null,{"$f":"SUM(F10:K10)","v":1}]
[null,null,null,"FINANCEIRO",{"$f":"ORÇAMENTO!L28","v":234060},{"$f":"ROUND($E$11*F10,2)","v":58515},{"$f":"ROUND($E$11*G10,2)","v":117030},{"$f":"ROUND($E$11*H10,2)","v":58515},{"$f":"ROUND($E$11*I10,2)","v":0},0,0,{"$f":"SUM(F11:K11)-0.04","v":234059.96}]
["E",{"$f":"VLOOKUP(A12,ORÇAMENTO!$A$10:$L$58,2)","v":4},{"$f":"VLOOKUP(A12,ORÇAMENTO!$A$10:$L$58,5)","v":"DRENAGEM E OBRAS COMPLEMENTARES"},"FISICO ",{"$f":"ROUND(E13/$G$2,4)","v":0.254},0.3,0.3,0.1,0.1,0.1,0.1,{"$f":"SUM(F12:K12)","v":0.99999999999999989}]
[null,null,null,"FINANCEIRO",{"$f":"ORÇAMENTO!L34","v":508023.12},{"$f":"ROUND($E$13*F12,2)","v":152406.94},{"$f":"ROUND($E$13*G12,2)","v":152406.94},{"$f":"ROUND($E$13*H12,2)","v":50802.31},{"$f":"ROUND($E$13*I12,2)","v":50802.31},50802.31,50802.31,{"$f":"SUM(F13:K13)-0.02","v":508023.1}]
["F",{"$f":"VLOOKUP(A14,ORÇAMENTO!$A$10:$L$58,2)","v":5},{"$f":"VLOOKUP(A14,ORÇAMENTO!$A$10:$L$58,5)","v":"FORNECIMENTOS - MATERIAL ASFÁLTICO (BDI DIFERENCIADO)"},"FISICO ",{"$f":"ROUND(E15/$G$2,4)","v":0.18679999999999999},null,0.2,0.2,0.2,0.2,0.2,{"$f":"SUM(F14:K14)","v":1}]
[null,null,null,"FINANCEIRO",{"$f":"ORÇAMENTO!L51","v":373505.89999999997},{"$f":"ROUND($E$15*F14,2)","v":0},74701.179999999993,74701.179999999993,74701.179999999993,74701.179999999993,74701.179999999993,{"$f":"SUM(F15:K15)-0.02","v":373505.87999999995}]
[null,"TOTAL",null,"FISICO ",{"$f":"SUM(F16:K16)","v":1},{"$f":"F17/$E$17","v":0.16485068644371939},{"$f":"G17/$E$17","v":0.25545657223281498},{"$f":"H17/$E$17","v":0.1753938449511101},{"$f":"I17/$E$17","v":0.14613528067083439},0.14613528067083439,0.11202833503068674,{"$f":"SUM(F16:K16)","v":1}]
[null,null,null,"FINANCEIRO",{"$f":"E11+E9+E7+E15+E13","v":1999927.25},{"$f":"F11+F9+F7+F15+F13","v":329689.38},{"$f":"G11+G9+G7+G15+G13","v":510894.56},350774.93,292259.93,292259.93,224048.52,{"$f":"SUM(F17:K17)","v":1999927.2499999998}]
[]
[null,"OBSERVAÇÕES:"]