{"text_format":"2","workbook":"xlsx","n_sheets":6,"sheets":["ORÇAMENTO","CPU-SERV","CPU-FORNEC","BDI SERV","BDI FORN","CRONOGRAMA"],"not_rendered":{"charts":0,"images":3,"macros":0,"external_links":1,"defined_names":8,"comments":2,"pivot_tables":0},"unopened":[],"bounds":{"document_bytes":16777216,"sheet_cells":100000,"run_cost":"one","rows_first":2000,"rows_last":500,"rows_between":2000,"halvings":0,"cell_chars":16384,"cell_head_chars":4096},"cells_cut":0,"cells_raw":0,"read":"whole","date_system":"1900"}

{"sheet":"ORÇAMENTO","index":0,"n_rows":58,"n_cols":12,"rows_kept":58,"cut":false,"hidden":false,"merged":[[9,14,9,16],[57,1,57,4],[0,0,8,0],[0,4,0,11],[1,4,1,11],[2,4,2,11],[6,1,6,4],[7,1,7,11],[4,2,4,7],[5,2,5,7],[4,8,4,10],[5,8,5,10],[6,8,6,10]]}
["<---- NUMERAR SERVIÇOS PARA CPU",null,null,null,"Ministério do Desenvolvimento Regional"]
[{"$nulls":4},"Companhia de Desenvolvimento dos Vales do São Francisco e do Parnaíba"]
[{"$nulls":4},"1ª Superintendência Regional"]
[]
[null,"OBRA: ","DRENAGEM E  PAVIMENTAÇÃO ASFÁLTICA EM CBUQ - AV. JOANA GOMES DOS SANTOS E ROTATÓRIA (SÃO JOÃO DO PACUÍ / MG)",{"$nulls":5},"BDI Serviços (%):",null,null,{"$f":"'BDI SERV'!E26","v":20.85}]
[null,"DATA:"," ABRIL / 2025",{"$nulls":5},"BDI Diferenciado Serviços (%):",null,null,{"$f":"'BDI FORN'!D31","v":15}]
[null,"PRAZO DE EXECUÇÃO:     180 DIAS",{"$nulls":6},"BDI Fornecimentos (%):",null,null,{"$f":"'BDI FORN'!D31","v":15}]
[null,"PLANILHA DE ORÇAMENTAÇÃO"]
[null,"ITEM","CÓDIGO","FONTE","DISCRIMINAÇÃO","TIPO","UNID.","QUANT.","VR.UNIT.S/BDI","PR. UNIT.C/BDI","C. TOT.S/BDI","P. TOT.C/BDI"]
["A",1,null,null,"SERVIÇOS PRELIMINARES ",{"$nulls":6},{"$f":"SUM(L11:L19)","v":202224.08000000005}]
{"$rows_left_out":49}
{"sheet":"CPU-SERV","index":1,"n_rows":1558,"n_cols":11,"rows_kept":1558,"cut":false,"hidden":false,"merged":[[357,5,357,7],[321,0,358,0],[356,3,356,7],[317,3,317,7],[318,5,318,7],[331,7,331,9],[334,3,334,7],[335,3,335,7],[336,3,336,7],[339,7,339,9],[342,3,342,7],[343,7,343,9],[346,3,346,7],[348,8,348,9],[351,3,351,7],[352,1,353,2],[352,3,353,3],[352,4,353,4],[352,5,352,7],[352,9,353,9],[274,3,275,3],[274,4,275,4],[274,5,274,7],[274,9,275,9],[278,3,278,7],[279,5,279,7],[282,0,319,0],[283,2,283,9],[284,1,285,3],[284,4,284,5],[285,4,285,5],[286,2,286,7],[286,8,286,9],[287,1,288,2],[287,3,288,3],[287,4,287,5],[287,6,287,7],[292,7,292,9],[295,3,295,7],[296,3,296,7],[297,3,297,7],[300,7,300,9],[303,3,303,7],[304,7,304,9],[307,3,307,7],[309,8,309,9],[312,3,312,7],[313,1,314,2],[313,3,314,3],[313,4,314,4],[313,5,313,7],[313,9,314,9],[229,3,229,7],[231,8,231,9],[234,3,234,7],[235,1,236,2],[235,3,236,3],[235,4,236,4],[235,5,235,7],[235,9,236,9],[239,3,239,7],[240,5,240,7],[243,0,280,0],[244,2,244,9],[245,1,246,3],[245,4,245,5],[246,4,246,5],[247,2,247,7],[247,8,247,9],[248,1,249,2],[248,3,249,3],[248,4,248,5],[248,6,248,7],[253,7,253,9],[256,3,256,7],[257,3,257,7],[258,3,258,7],[261,7,261,9],[264,3,264,7],[265,7,265,9],[268,3,268,7],[270,8,270,9],[273,3,273,7],[274,1,275,2],[738,0,775,0],[739,2,739,9],[740,1,741,3],[740,4,740,5],[741,4,741,5],[742,2,742,7],[742,8,742,9],[743,1,744,2],[743,3,744,3],[743,4,743,5],[743,6,743,7],[748,7,748,9],[751,3,751,7],[752,3,752,7],[753,3,753,7],[756,7,756,9],[759,3,759,7],[760,7,760,9],[763,3,763,7],[765,8,765,9],[768,3,768,7],[769,1,770,2],[769,3,770,3],[769,4,770,4],[769,5,769,7],[769,9,770,9],[773,3,773,7],[774,5,774,7],[204,0,241,0],[205,2,205,9],[22,7,22,9],[25,3,25,7],[27,8,27,9],[21,3,21,7],[4,2,4,7],[4,8,4,9],[5,1,6,2],[5,3,6,3],[5,4,5,5],[5,6,5,7],[645,0,697,0],[646,2,646,9],[647,1,648,3],[647,4,647,5],[648,4,648,5],[649,2,649,7],[649,8,649,9],[650,1,651,2],[650,3,651,3],[650,4,650,5],[650,6,650,7],[658,7,658,9],[660,3,660,7],[661,3,661,7],[662,3,662,7],[665,7,665,9],[674,3,674,7],[39,0,81,0],[40,2,40,9],[206,1,207,3],[206,4,206,5],[44,3,45,3],[44,4,44,5],[44,6,44,7],[49,7,49,9],[55,3,55,7],[56,3,56,7],[41,1,42,3],[41,4,41,5],[42,4,42,5],[43,2,43,7],[43,8,43,9],[44,1,45,2],[0,0,37,0],[3,4,3,5],[2,4,2,5],[1,2,1,9],[2,1,3,3],[31,3,32,3],[31,4,32,4],[31,5,31,7],[31,9,32,9],[35,3,35,7],[36,5,36,7],[10,7,10,9],[13,3,13,7],[14,3,14,7],[15,3,15,7],[18,7,18,9],[30,3,30,7],[31,1,32,2],[97,3,97,7],[88,3,89,3],[88,4,88,5],[88,6,88,7],[79,3,79,7],[80,5,80,7],[85,4,85,5],[74,3,74,7],[75,1,76,2],[75,3,76,3],[75,4,76,4],[75,5,75,7],[75,9,76,9],[57,3,57,7],[60,7,60,9],[63,3,63,7],[64,7,64,9],[69,3,69,7],[71,8,71,9],[119,5,119,7],[122,0,161,0],[123,2,123,9],[124,1,125,3],[124,4,124,5],[125,4,125,5],[126,2,126,7],[126,8,126,9],[159,3,159,7],[160,5,160,7],[114,1,115,2],[114,3,115,3],[114,4,115,4],[114,5,114,7],[114,9,115,9],[118,3,118,7],[93,7,93,9],[98,3,98,7],[101,7,101,9],[104,3,104,7],[105,7,105,9],[108,3,108,7],[83,0,120,0],[84,2,84,9],[85,1,86,3],[86,4,86,5],[87,2,87,7],[87,8,87,9],[88,1,89,2],[110,8,110,9],[113,3,113,7],[96,3,96,7],[136,3,136,7],[137,3,137,7],[140,7,140,9],[145,3,145,7],[146,7,146,9],[149,3,149,7],[127,1,128,2],[127,3,128,3],[127,4,127,5],[127,6,127,7],[132,7,132,9],[135,3,135,7],[163,0,202,0],[164,2,164,9],[165,1,166,3],[165,4,165,5],[166,4,166,5],[167,2,167,7],[200,3,200,7],[201,5,201,7],[151,8,151,9],[154,3,154,7],[155,1,156,2],[155,3,156,3],[155,4,156,4],[155,5,155,7],[155,9,156,9],[178,3,178,7],[179,3,179,7],[180,3,180,7],[183,7,183,9],[186,3,186,7],[187,7,187,9],[167,8,167,9],[168,1,169,2],[168,3,169,3],[168,4,168,5],[168,6,168,7],[173,7,173,9],[322,2,322,9],[323,1,324,3],[323,4,323,5],[324,4,324,5],[325,2,325,7],[325,8,325,9],[207,4,207,5],[208,2,208,7],[208,8,208,9],[209,1,210,2],[209,3,210,3],[209,4,209,5],[209,6,209,7],[214,7,214,9],[217,3,217,7],[218,3,218,7],[219,3,219,7],[222,7,222,9],[225,3,225,7],[226,7,226,9],[360,0,397,0],[361,2,361,9],[362,1,363,3],[362,4,362,5],[363,4,363,5],[364,2,364,7],[190,3,190,7],[192,8,192,9],[195,3,195,7],[196,1,197,2],[196,3,197,3],[196,4,197,4],[196,5,196,7],[196,9,197,9],[385,3,385,7],[387,8,387,9],[390,3,390,7],[391,1,392,2],[391,3,392,3],[391,4,392,4],[391,5,391,7],[391,9,392,9],[373,3,373,7],[374,3,374,7],[364,8,364,9],[365,1,366,2],[365,3,366,3],[365,4,365,5],[326,1,327,2],[326,3,327,3],[326,4,326,5],[326,6,326,7],[365,6,365,7],[370,7,370,9],[415,3,415,7],[416,3,416,7],[417,3,417,7],[420,7,420,9],[423,3,423,7],[424,7,424,9],[403,8,403,9],[404,1,405,2],[404,3,405,3],[404,4,404,5],[404,6,404,7],[412,7,412,9],[395,3,395,7],[396,5,396,7],[375,3,375,7],[378,7,378,9],[381,3,381,7],[382,7,382,9],[400,2,400,9],[401,1,402,3],[401,4,401,5],[402,4,402,5],[403,2,403,7],[441,0,482,0],[442,2,442,9],[443,1,444,3],[443,4,443,5],[444,4,444,5],[445,2,445,7],[427,3,427,7],[429,8,429,9],[432,3,432,7],[433,1,434,2],[433,3,434,3],[433,4,434,4],[433,5,433,7],[433,9,434,9],[470,3,470,7],[472,8,472,9],[475,3,475,7],[476,1,477,2],[476,3,477,3],[476,4,477,4],[476,5,476,7],[476,9,477,9],[458,3,458,7],[459,3,459,7],[445,8,445,9],[446,1,447,2],[446,3,447,3],[446,4,446,5],[446,6,446,7],[399,0,439,0],[437,3,437,7],[438,5,438,7],[455,7,455,9],[501,3,501,7],[502,3,502,7],[503,3,503,7],[506,7,506,9],[509,3,509,7],[510,7,510,9],[488,8,488,9],[489,1,490,2],[489,3,490,3],[489,4,489,5],[489,6,489,7],[498,7,498,9],[480,3,480,7],[481,5,481,7],[460,3,460,7],[463,7,463,9],[466,3,466,7],[467,7,467,9],[485,2,485,9],[486,1,487,3],[486,4,486,5],[487,4,487,5],[488,2,488,7],[527,0,564,0],[528,2,528,9],[529,1,530,3],[529,4,529,5],[530,4,530,5],[531,2,531,7],[562,3,562,7],[563,5,563,7],[546,7,546,8],[513,3,513,7],[515,8,515,9],[518,3,518,7],[519,1,520,2],[519,3,520,3],[519,4,520,4],[519,5,519,7],[519,9,520,9],[484,0,525,0],[523,3,523,7],[524,5,524,7],[579,3,579,7],[570,8,570,9],[571,1,572,2],[571,3,572,3],[571,4,571,5],[540,3,540,7],[541,3,541,7],[542,3,542,7],[545,7,545,9],[548,3,548,7],[549,7,549,9],[531,8,531,9],[532,1,533,2],[532,3,533,3],[532,4,532,5],[532,6,532,7],[537,7,537,9],[631,3,631,7],[605,0,643,0],[606,2,606,9],[607,1,608,3],[607,4,607,5],[608,4,608,5],[609,2,609,7],[641,3,641,7],[642,5,642,7],[585,7,585,8],[566,0,603,0],[567,2,567,9],[568,1,569,3],[568,4,568,5],[569,4,569,5],[570,2,570,7],[552,3,552,7],[554,8,554,9],[557,3,557,7],[558,1,559,2],[558,3,559,3],[558,4,559,4],[558,5,558,7],[558,9,559,9],[591,3,591,7],[593,8,593,9],[596,3,596,7],[597,1,598,2],[597,3,598,3],[597,4,598,4],[597,5,597,7],[597,9,598,9],[670,7,670,8],[696,5,696,7],[724,3,724,7],[726,8,726,9],[729,3,729,7],[730,1,731,2],[730,3,731,3],[730,4,731,4],[730,5,730,7],[730,9,731,9],[571,6,571,7],[576,7,576,9],[619,3,619,7],[620,3,620,7],[621,3,621,7],[624,7,624,9],[627,3,627,7],[628,7,628,9],[609,8,609,9],[610,1,611,2],[610,3,611,3],[610,4,610,5],[610,6,610,7],[616,7,616,9],[601,3,601,7],[602,5,602,7],[580,3,580,7],[581,3,581,7],[584,7,584,9],[587,3,587,7],[588,7,588,9],[675,7,675,9],[717,7,717,9],[720,3,720,7],[721,7,721,9],[703,8,703,9],[704,1,705,2],[704,3,705,3],[704,4,704,5],[704,6,704,7],[709,7,709,9],[790,3,790,7],[791,3,791,7],[792,3,792,7],[795,7,795,9],[798,3,798,7],[703,2,703,7],[633,8,633,9],[636,3,636,7],[637,1,638,2],[637,3,638,3],[637,4,638,4],[637,5,637,7],[637,9,638,9],[687,1,688,2],[687,3,688,3],[687,4,688,4],[687,5,687,7],[687,9,688,9],[695,3,695,7],[677,3,677,7],[679,8,679,9],[686,3,686,7],[712,3,712,7],[799,7,799,9],[781,8,781,9],[782,1,783,2],[782,3,783,3],[782,4,782,5],[782,6,782,7],[787,7,787,9],[734,3,734,7],[735,5,735,7],[777,0,814,0],[778,2,778,9],[779,1,780,3],[779,4,779,5],[780,4,780,5],[781,2,781,7],[812,3,812,7],[813,5,813,7],[699,0,736,0],[700,2,700,9],[701,1,702,3],[701,4,701,5],[702,4,702,5],[802,3,802,7],[804,8,804,9],[807,3,807,7],[808,1,809,2],[808,3,809,3],[808,4,809,4],[808,5,808,7],[808,9,809,9],[713,3,713,7],[714,3,714,7],[841,3,841,7],[843,8,843,9],[846,3,846,7],[847,1,848,2],[847,3,848,3],[847,4,848,4],[847,5,847,7],[847,9,848,9],[829,3,829,7],[830,3,830,7],[831,3,831,7],[834,7,834,9],[837,3,837,7],[838,7,838,9],[820,8,820,9],[821,1,822,2],[821,3,822,3],[821,4,821,5],[821,6,821,7],[826,7,826,9],[868,3,868,7],[869,3,869,7],[870,3,870,7],[873,7,873,9],[876,3,876,7],[877,7,877,9],[859,8,859,9],[860,1,861,2],[860,3,861,3],[860,4,860,5],[860,6,860,7],[865,7,865,9],[851,3,851,7],[852,5,852,7],[855,0,892,0],[856,2,856,9],[857,1,858,3],[857,4,857,5],[858,4,858,5],[859,2,859,7],[890,3,890,7],[891,5,891,7],[816,0,853,0],[817,2,817,9],[818,1,819,3],[818,4,818,5],[819,4,819,5],[820,2,820,7],[880,3,880,7],[882,8,882,9],[885,3,885,7],[886,1,887,2],[886,3,887,3],[886,4,887,4],[886,5,886,7],[886,9,887,9],[920,3,920,7],[922,8,922,9],[925,3,925,7],[926,1,927,2],[926,3,927,3],[926,4,927,4],[926,5,926,7],[926,9,927,9],[908,3,908,7],[909,3,909,7],[910,3,910,7],[913,7,913,9],[916,3,916,7],[917,7,917,9],[898,8,898,9],[899,1,900,2],[899,3,900,3],[899,4,899,5],[899,6,899,7],[904,7,904,9],[930,3,930,7],[931,5,931,7],[894,0,932,0],[895,2,895,9],[896,1,897,3],[896,4,896,5],[897,4,897,5],[898,2,898,7],[960,3,960,7],[962,8,962,9],[965,3,965,7],[966,1,967,2],[966,3,967,3],[966,4,967,4],[966,5,966,7],[966,9,967,9],[948,3,948,7],[949,3,949,7],[950,3,950,7],[953,7,953,9],[956,3,956,7],[957,7,957,9],[938,8,938,9],[939,1,940,2],[939,3,940,3],[939,4,939,5],[939,6,939,7],[944,7,944,9],[987,3,987,7],[988,3,988,7],[989,3,989,7],[992,7,992,9],[995,3,995,7],[996,7,996,9],[978,8,978,9],[979,1,980,2],[979,3,980,3],[979,4,979,5],[979,6,979,7],[984,7,984,9],[970,3,970,7],[971,5,971,7],[974,0,1013,0],[975,2,975,9],[976,1,977,3],[976,4,976,5],[977,4,977,5],[978,2,978,7],[1011,3,1011,7],[1012,5,1012,7],[934,0,972,0],[935,2,935,9],[936,1,937,3],[936,4,936,5],[937,4,937,5],[938,2,938,7],[1001,3,1001,7],[1003,8,1003,9],[1006,3,1006,7],[1007,1,1008,2],[1007,3,1008,3],[1007,4,1008,4],[1007,5,1007,7],[1007,9,1008,9],[1043,3,1043,7],[1045,8,1045,9],[1048,3,1048,7],[1049,1,1050,2],[1049,3,1050,3],[1049,4,1050,4],[1049,5,1049,7],[1049,9,1050,9],[1028,3,1028,7],[1029,3,1029,7],[1030,3,1030,7],[1033,7,1033,9],[1036,3,1036,7],[1037,7,1037,9],[1019,8,1019,9],[1020,1,1021,2],[1020,3,1021,3],[1020,4,1020,5],[1020,6,1020,7],[1025,7,1025,9],[1053,3,1053,7],[1054,5,1054,7],[1015,0,1055,0],[1016,2,1016,9],[1017,1,1018,3],[1017,4,1017,5],[1018,4,1018,5],[1019,2,1019,7],[1084,3,1084,7],[1086,8,1086,9],[1089,3,1089,7],[1090,1,1091,2],[1090,3,1091,3],[1090,4,1091,4],[1090,5,1090,7],[1090,9,1091,9],[1070,3,1070,7],[1071,3,1071,7],[1072,3,1072,7],[1075,7,1075,9],[1078,3,1078,7],[1079,7,1079,9],[1061,8,1061,9],[1062,1,1063,2],[1062,3,1063,3],[1062,4,1062,5],[1062,6,1062,7],[1067,7,1067,9],[1094,3,1094,7],[1095,5,1095,7],[1057,0,1096,0],[1058,2,1058,9],[1059,1,1060,3],[1059,4,1059,5],[1060,4,1060,5],[1061,2,1061,7],[1198,3,1198,7],[1199,3,1199,7],[1200,3,1200,7],[1203,7,1203,9],[1206,3,1206,7],[1207,7,1207,9],[1189,8,1189,9],[1190,1,1191,2],[1190,3,1191,3],[1190,4,1190,5],[1190,6,1190,7],[1195,7,1195,9],[1185,0,1222,0],[1186,2,1186,9],[1187,1,1188,3],[1187,4,1187,5],[1188,4,1188,5],[1189,2,1189,7],[1220,3,1220,7],[1221,5,1221,7],[1210,3,1210,7],[1212,8,1212,9],[1215,3,1215,7],[1216,1,1217,2],[1216,3,1217,3],[1216,4,1217,4],[1216,5,1216,7],[1216,9,1217,9],[1249,3,1249,7],[1251,8,1251,9],[1254,3,1254,7],[1255,1,1256,2],[1255,3,1256,3],[1255,4,1256,4],[1255,5,1255,7],[1255,9,1256,9],[1237,3,1237,7],[1238,3,1238,7],[1239,3,1239,7],[1242,7,1242,9],[1245,3,1245,7],[1246,7,1246,9],[1228,8,1228,9],[1229,1,1230,2],[1229,3,1230,3],[1229,4,1229,5],[1229,6,1229,7],[1234,7,1234,9],[1276,3,1276,7],[1277,3,1277,7],[1278,3,1278,7],[1281,7,1281,9],[1285,3,1285,7],[1286,7,1286,9],[1267,8,1267,9],[1268,1,1269,2],[1268,3,1269,3],[1268,4,1268,5],[1268,6,1268,7],[1273,7,1273,9],[1259,3,1259,7],[1260,5,1260,7],[1263,0,1303,0],[1264,2,1264,9],[1265,1,1266,3],[1265,4,1265,5],[1266,4,1266,5],[1267,2,1267,7],[1301,3,1301,7],[1302,5,1302,7],[1224,0,1261,0],[1225,2,1225,9],[1226,1,1227,3],[1226,4,1226,5],[1227,4,1227,5],[1228,2,1228,7],[1289,3,1289,7],[1291,8,1291,9],[1295,3,1295,7],[1296,1,1297,2],[1296,3,1297,3],[1296,4,1297,4],[1296,5,1296,7],[1296,9,1297,9],[1330,3,1330,7],[1332,8,1332,9],[1335,3,1335,7],[1336,1,1337,2],[1336,3,1337,3],[1336,4,1337,4],[1336,5,1336,7],[1336,9,1337,9],[1318,3,1318,7],[1319,3,1319,7],[1320,3,1320,7],[1323,7,1323,9],[1326,3,1326,7],[1327,7,1327,9],[1309,8,1309,9],[1310,1,1311,2],[1310,3,1311,3],[1310,4,1310,5],[1310,6,1310,7],[1315,7,1315,9],[1358,3,1358,7],[1359,3,1359,7],[1360,3,1360,7],[1363,7,1363,9],[1369,3,1369,7],[1370,7,1370,9],[1348,8,1348,9],[1349,1,1350,2],[1349,3,1350,3],[1349,4,1349,5],[1349,6,1349,7],[1354,7,1354,9],[1340,3,1340,7],[1341,5,1341,7],[1344,0,1385,0],[1345,2,1345,9],[1346,1,1347,3],[1346,4,1346,5],[1347,4,1347,5],[1348,2,1348,7],[1383,3,1383,7],[1384,5,1384,7],[1305,0,1342,0],[1306,2,1306,9],[1307,1,1308,3],[1307,4,1307,5],[1308,4,1308,5],[1309,2,1309,7],[1373,3,1373,7],[1375,8,1375,9],[1378,3,1378,7],[1379,1,1380,2],[1429,4,1429,5],[1430,2,1430,7],[1468,3,1468,7],[1469,5,1469,7],[1454,3,1454,7],[1456,8,1456,9],[1461,3,1461,7],[1462,1,1463,2],[1379,3,1380,3],[1379,4,1380,4],[1379,5,1379,7],[1379,9,1380,9],[1412,3,1412,7],[1414,8,1414,9],[1417,3,1417,7],[1418,1,1419,2],[1418,3,1419,3],[1418,4,1419,4],[1418,5,1418,7],[1418,9,1419,9],[1400,3,1400,7],[1401,3,1401,7],[1402,3,1402,7],[1405,7,1405,9],[1408,3,1408,7],[1409,7,1409,9],[1391,8,1391,9],[1392,1,1393,2],[1392,3,1393,3],[1392,4,1392,5],[1392,6,1392,7],[1397,7,1397,9],[1495,3,1495,7],[1496,7,1496,9],[1476,8,1476,9],[1477,1,1478,2],[1477,3,1478,3],[1477,4,1477,5],[1477,6,1477,7],[1483,7,1483,9],[1422,3,1422,7],[1423,5,1423,7],[1387,0,1424,0],[1388,2,1388,9],[1389,1,1390,3],[1389,4,1389,5],[1390,4,1390,5],[1391,2,1391,7],[1439,3,1439,7],[1440,3,1440,7],[1441,3,1441,7],[1444,7,1444,9],[1450,3,1450,7],[1451,7,1451,9],[1430,8,1430,9],[1431,1,1432,2],[1431,3,1432,3],[1431,4,1431,5],[1431,6,1431,7],[1436,7,1436,9],[1426,0,1470,0],[1427,2,1427,9],[1428,1,1429,3],[1428,4,1428,5],[1509,3,1509,7],[1510,5,1510,7],[1513,0,1557,0],[1514,2,1514,9],[1515,1,1516,3],[1515,4,1515,5],[1516,4,1516,5],[1517,2,1517,7],[1555,3,1555,7],[1556,5,1556,7],[1472,0,1511,0],[1473,2,1473,9],[1474,1,1475,3],[1474,4,1474,5],[1475,4,1475,5],[1476,2,1476,7],[1462,3,1463,3],[1462,4,1463,4],[1462,5,1462,7],[1462,9,1463,9],[1499,3,1499,7],[1501,8,1501,9],[1504,3,1504,7],[1505,1,1506,2],[1505,3,1506,3],[1505,4,1506,4],[1505,5,1505,7],[1505,9,1506,9],[1486,3,1486,7],[1487,3,1487,7],[1488,3,1488,7],[1491,7,1491,9],[1541,3,1541,7],[1543,8,1543,9],[1548,3,1548,7],[1549,1,1550,2],[1549,3,1550,3],[1549,4,1550,4],[1549,5,1549,7],[1549,9,1550,9],[1526,3,1526,7]],"merged_total":1067,"flags":["merged_cut"]}
[1,"1ª/GRD",{"$nulls":8},{"$f":"J37","v":15342.3}]
[null,"OBRA:","DRENAGEM E  PAVIMENTAÇÃO ASFÁLTICA EM CBUQ - AV. JOANA GOMES DOS SANTOS E ROTATÓRIA (SÃO JOÃO DO PACUÍ / MG)"]
[null,"Custo Unitário de Referência",null,null,"Minas Gerais"]
[{"$nulls":4}," Janeiro/2025 ",null,null,"Produção da equipe ",0.5,{"$f":"VLOOKUP(A1,ORÇAMENTO!$A$10:$L$58,7,1)","v":"GL"}]
[null,"CPU.1","MOBILIZAÇÃO E DESMOBILIZAÇÃO",{"$nulls":5},"Valores em reais (R$)"]
[null,"A - EQUIPAMENTOS",null,"Quantidade","Utilização",null,"Custo Horário",null,null,"Custo"]
[{"$nulls":4},"Operativa","Improdutiva","Produtivo","Improdutivo",null,"Horário Total"]
[null,"E9687","Caminhão carroceria com capacidade de 5 t - 115 kW",8,0.6,0.4,146.88079999999999,57.423099999999998,null,{"$f":"D8*(E8*G8+F8*H8)","v":888.78175999999996}]
[null,"E9575","Caminhão basculante com caçamba estanque com capacidade de 14 m³ - 210 kW",16,1,0,309.83940000000001,90.412199999999999,null,{"$f":"D9*(E9*G9+F9*H9)","v":4957.4304000000002}]
[{"$nulls":7},"Custo horário total de equipamentos",null,{"$f":"SUM(J8:J9)","v":5846.21216}]
{"$rows_left_out":1549}
{"sheet":"CPU-FORNEC","index":2,"n_rows":92,"n_cols":14,"rows_kept":92,"cut":false,"hidden":false,"merged":[[71,0,80,0],[71,1,71,3],[71,4,71,7],[72,2,72,5],[73,2,73,3],[74,1,74,7],[77,1,77,3],[77,5,77,6],[78,1,78,6],[79,1,79,6],[80,1,80,6],[0,0,26,0],[0,1,0,3],[0,4,0,7],[22,1,22,3],[49,0,58,0],[49,1,49,3],[49,4,49,7],[50,2,50,5],[51,2,51,3],[52,1,52,7],[55,1,55,3],[55,5,55,6],[56,1,56,6],[57,1,57,6],[58,1,58,6],[27,1,27,3],[27,4,27,7],[28,2,28,5],[27,0,36,0],[29,2,29,3],[30,1,30,7],[33,1,33,3],[33,5,33,6],[34,1,34,6],[35,1,35,6],[36,1,36,6],[0,10,0,11],[1,2,1,5],[1,10,1,11],[2,2,2,3],[3,1,3,7],[22,5,22,6],[23,1,23,6],[24,1,24,6],[25,1,25,6],[5,1,5,7],[9,1,9,7],[13,1,13,7],[17,1,17,7],[38,0,47,0],[38,1,38,3],[38,4,38,7],[39,2,39,5],[40,2,40,3],[41,1,41,7],[44,1,44,3],[44,5,44,6],[45,1,45,6],[46,1,46,6],[47,1,47,6],[60,0,69,0],[60,1,60,3],[60,4,60,7],[61,2,61,5],[62,2,62,3],[63,1,63,7],[66,1,66,3],[66,5,66,6],[67,1,67,6],[68,1,68,6],[69,1,69,6],[81,1,81,7],[82,0,91,0],[82,1,82,3],[82,4,82,7],[83,2,83,5],[84,2,84,3],[85,1,85,7],[88,1,88,3],[88,5,88,6],[89,1,89,6],[90,1,90,6],[91,1,91,6]]}
[1,"CODEVASF",null,null," COMPOSIÇÃO DE PREÇO UNITÁRIO",null,null,null,{"$f":"H24","v":0},{"$f":"H26","v":0},"BDI CALCULADO:",null,{"$f":"ORÇAMENTO!L6","v":15}]
[null,"OBRA:  ","DRENAGEM E  PAVIMENTAÇÃO ASFÁLTICA EM CBUQ - AV. JOANA GOMES DOS SANTOS E ROTATÓRIA (SÃO JOÃO DO PACUÍ / MG)",null,null,null,"DATA: ",{"$f":"ORÇAMENTO!C6","v":" ABRIL / 2025"},null,null,"BDI DIFERENCIADO:",null,{"$f":"'BDI FORN'!D31/100","v":0.15}]
[null,"SERVIÇO:  ","CPU.1",null,"Referência:","CODEVASF","UNIDADE: ",{"$f":"VLOOKUP(A1,ORÇAMENTO!A11:L35,5)","v":"MOBILIZAÇÃO E DESMOBILIZAÇÃO"}]
[]
[null,"TIPO ITEM","CODIGO ITEM","DESCRIÇÃO ITEM","UNIDADE ITEM","COEFICIENTE","PRECO UNITARIO","CUSTO TOTAL",null,"distancia =",90,"B.DESPACHO"]
[null,"EQUIPAMENTOS",{"$nulls":7},"Pá carregadeira ",null,null,10.1," ton"]
[null,null,"E9001","E9001","E9001",null,"E9001"]
[]
[]
[null,"MÃO DE OBRA"]
{"$rows_left_out":83}
{"sheet":"BDI SERV","index":3,"n_rows":60,"n_cols":5,"rows_kept":60,"cut":false,"hidden":false,"merged":[[35,0,35,5],[36,0,36,5],[38,1,38,4],[39,2,39,3],[0,1,2,4],[25,1,25,3],[26,1,26,2],[26,3,26,4],[27,3,27,4]]}
[null,"DETALHAMENTO DO BDI - SERVIÇOS"]
[]
[]
[null,"Item","Descrição dos Serviços","% - PV","% - CD"]
[]
[null,1,"ADMINISTRAÇÃO CENTRAL"," ",{"$f":"SUM(E7:E9)","v":4.01}]
[null,"1.1","ESCRITÓRIO CENTRAL",null,4.01]
[null,"1.2","VIAGENS"]
[null,"1.3","OUTROS"]
[null," "," "," "," "]
{"$rows_left_out":51}
{"sheet":"BDI FORN","index":4,"n_rows":37,"n_cols":5,"rows_kept":37,"cut":false,"hidden":false,"merged":[[31,1,31,2],[32,0,34,5],[36,0,36,5],[0,1,2,4],[3,1,4,1],[3,2,4,2],[28,0,28,5],[30,1,30,2]]}
[null,"DETALHAMENTO DO BDI - FORNECIMENTO \n(MATERIAL ASFÁLTICO)"]
[]
[]
[null,"Item","Descrição dos Serviços","%","%"]
[null,null,null,"PV","CD"]
[]
[null,1,"ADMINISTRAÇÃO CENTRAL"," ",3.45]
[null,"1.1","ESCRITÓRIO CENTRAL"," "," "]
[null,"1.2","VIAGENS"," "," "]
[null,"1.3","OUTROS"," "," "]
{"$rows_left_out":28}
{"sheet":"CRONOGRAMA","index":5,"n_rows":19,"n_cols":12,"rows_kept":19,"cut":false,"hidden":false,"merged":[[15,1,16,2],[18,1,22,11],[11,0,12,0],[11,1,12,1],[11,2,12,2],[13,0,14,0],[13,1,14,1],[13,2,14,2],[9,0,10,0],[9,1,10,1],[9,2,10,2],[3,1,3,10],[5,0,6,0],[5,1,6,1],[5,2,6,2],[7,0,8,0],[7,1,8,1],[7,2,8,2],[0,1,0,11],[1,1,2,1],[1,2,2,4],[1,6,1,11],[2,6,2,11]]}
[null,"CRONOGRAMA FÍSICO-FINANCEIRO"]
[null,"OBRA: ",{"$f":"ORÇAMENTO!C5","v":"DRENAGEM E  PAVIMENTAÇÃO ASFÁLTICA EM CBUQ - AV. JOANA GOMES DOS SANTOS E ROTATÓRIA (SÃO JOÃO DO PACUÍ / MG)"},null,null,"VALOR:",{"$f":"ORÇAMENTO!L58","v":1999927.25}]
[{"$nulls":5},"PRAZO: ","180 DIAS "]
[]
[null,"ITEM","ETAPAS/DESCRIÇAO","FISICO/  FINANCEIRO","TOTAL    ETAPAS","MÊS 1","MÊS 2","MÊS 3","MÊS 4","MÊS 5","MÊS 6","TOTAL"]
["A",{"$f":"ORÇAMENTO!B10","v":1},{"$f":"ORÇAMENTO!E10","v":"SERVIÇOS PRELIMINARES "},"FISICO ",{"$f":"ROUND(E7/$G$2,4)","v":0.1011},0.25,0.15,0.15,0.15,0.15,0.15,{"$f":"SUM(F6:K6)","v":1}]
[null,null,null,"FINANCEIRO",{"$f":"ORÇAMENTO!L10","v":202224.08000000005},{"$f":"ROUND($E$7*F6,2)","v":50556.02},{"$f":"ROUND($E$7*G6,2)","v":30333.61},{"$f":"ROUND($E$7*H6,2)","v":30333.61},{"$f":"ROUND($E$7*I6,2)","v":30333.61},30333.61,30333.61,{"$f":"SUM(F7:K7)","v":202224.07}]
["B",{"$f":"VLOOKUP(A8,ORÇAMENTO!$A$10:$L$58,2)","v":2},{"$f":"VLOOKUP(A8,ORÇAMENTO!$A$10:$L$58,5)","v":"TERRAPLANAGEM E PAVIMENTAÇÃO"},"FISICO ",{"$f":"ROUND(E9/$G$2,4)","v":0.34110000000000001},0.1,0.2,0.2,0.2,0.2,0.1,{"$f":"SUM(F8:K8)","v":0.99999999999999989}]
[null,null,null,"FINANCEIRO",{"$f":"ORÇAMENTO!L20","v":682114.15},{"$f":"ROUND($E$9*F8,2)","v":68211.42},{"$f":"ROUND($E$9*G8,2)","v":136422.82999999999},{"$f":"ROUND($E$9*H8,2)","v":136422.82999999999},{"$f":"ROUND($E$9*I8,2)","v":136422.82999999999},136422.82999999999,68211.42,{"$f":"SUM(F9:K9)","v":682114.15999999992}]
["C",{"$f":"VLOOKUP(A10,ORÇAMENTO!$A$10:$L$58,2)","v":3},{"$f":"VLOOKUP(A10,ORÇAMENTO!$A$10:$L$58,5)","v":"TRANSPORTE DE MATERIAIS"},"FISICO ",{"$f":"ROUND(E11/$G$2,4)","v":0.11700000000000001},0.25,0.5,0.25,null,null,null,{"$f":"SUM(F10:K10)","v":1}]
{"$rows_left_out":9}