{"text_format":"2","workbook":"xlsx","n_sheets":7,"sheets":["ORÇAMENTO","CPU-SERV","AUX-VEIC.","CPU-FORNEC","BDI SERV","BDI FORN","CRONOGRAMA"],"not_rendered":{"charts":0,"images":4,"macros":0,"external_links":1,"defined_names":9,"comments":2,"pivot_tables":0},"unopened":[],"bounds":{"document_bytes":16777216,"sheet_cells":100000,"run_cost":"one","rows_first":2000,"rows_last":500,"rows_between":2000,"halvings":0,"cell_chars":16384,"cell_head_chars":4096},"cells_cut":0,"cells_raw":0,"read":"whole","date_system":"1900"}

{"sheet":"ORÇAMENTO","index":0,"n_rows":44,"n_cols":19,"rows_kept":44,"cut":false,"hidden":false,"merged":[[30,14,30,16],[36,14,36,16],[4,9,4,10],[16,14,16,16],[23,14,23,16],[9,14,9,16],[43,1,43,4],[0,0,8,0],[0,4,0,11],[1,4,1,11],[2,4,2,11],[6,1,6,4],[7,1,7,11],[4,2,4,8],[5,2,5,8],[5,9,5,10],[6,9,6,10]]}
["<---- NUMERAR SERVIÇOS PARA CPU",null,null,null,"Ministério do Desenvolvimento Regional"]
[{"$nulls":4},"Companhia de Desenvolvimento dos Vales do São Francisco e do Parnaíba"]
[{"$nulls":4},"1ª Superintendência Regional"]
[]
[null,"OBRA: "," PAVIMENTAÇÃO ASFÁLTICA EM CBUQ - VIAS URBANAS DIVERSAS (ÁGUAS VERMELHAS / MG)",{"$nulls":6},"BDI Serviços % :",null,{"$f":"'BDI SERV'!E26","v":23.32}]
[null,"DATA:"," JUNHO / 2025",{"$nulls":6},"BDI Diferenc. Serviços % :",null,{"$f":"'BDI FORN'!D31","v":15}]
[null,"PRAZO DE EXECUÇÃO:     180 DIAS",{"$nulls":7},"BDI Fornecimentos % :",null,{"$f":"'BDI FORN'!D31","v":15}]
[null,"PLANILHA DE ORÇAMENTAÇÃO"]
[null,"ITEM","CÓDIGO","FONTE","DISCRIMINAÇÃO","TIPO","UNID.","QUANT.","VR.UNIT.S/BDI","PR. UNIT.C/BDI","C. TOT.S/BDI","P. TOT.C/BDI"]
["A",1,null,null,"SERVIÇOS PRELIMINARES ",{"$nulls":5},{"$f":"SUM(K11:K16)","v":178673.69999999998},{"$f":"SUM(L11:L16)","v":220211.07}]
[1,"1.1","CPU.1","CODEVASF","MOBILIZAÇÃO E DESMOBILIZAÇÃO","SERV","GL",1,{"$f":"VLOOKUP(A11,'CPU-SERV'!A:K,11,0)","v":18086.95},{"$f":"TRUNC(_xlfn.IFS(F11=\"SERV\",I11*(1+$L$5/100),F11=\"SERV DIF\",I11*(1+$L$6/100),F11=\"FORN\",I11*(1+$L$7/100)),2)","v":22304.82},{"$f":"TRUNC(H11*I11,2)","v":18086.95},{"$f":"TRUNC(H11*J11,2)","v":22304.82}]
[2,"1.2","CPU.2","CODEVASF","ADMINISTRAÇÃO LOCAL ","SERV","GL",1,{"$f":"VLOOKUP(A12,'CPU-SERV'!A:K,11,0)","v":108051.88},{"$f":"TRUNC(_xlfn.IFS(F12=\"SERV\",I12*(1+$L$5/100),F12=\"SERV DIF\",I12*(1+$L$6/100),F12=\"FORN\",I12*(1+$L$7/100)),2)","v":133249.57},{"$f":"TRUNC(H12*I12,2)","v":108051.88},{"$f":"TRUNC(H12*J12,2)","v":133249.57}]
[3,"1.3","CPU.3","CODEVASF","CANTEIRO DE OBRAS ","SERV","GL",1,{"$f":"VLOOKUP(A13,'CPU-SERV'!A:K,11,0)","v":13722.3},{"$f":"TRUNC(_xlfn.IFS(F13=\"SERV\",I13*(1+$L$5/100),F13=\"SERV DIF\",I13*(1+$L$6/100),F13=\"FORN\",I13*(1+$L$7/100)),2)","v":16922.34},13722.3,16922.34]
[4,"1.4",103689,"SINAPI","PLACA DE OBRA EM CHAPA DE AÇO GALVANIZADO","SERV","M2",6,{"$f":"VLOOKUP(A14,'CPU-SERV'!A:K,11,0)","v":543.91999999999996},{"$f":"TRUNC(_xlfn.IFS(F14=\"SERV\",I14*(1+$L$5/100),F14=\"SERV DIF\",I14*(1+$L$6/100),F14=\"FORN\",I14*(1+$L$7/100)),2)","v":670.76},3263.52,4024.56]
[5,"1.5","CPU.4","SICRO","VEÍCULO PARA A FISCALIZAÇÃO, MÁXIMO 02 ANOS DE USO OU 50.000KM, PREFERENCIALMENTE NA COR BRANCA, COM IDENTIFICAÇÃO CONFORME ESPECIFICAÇÕES DA CODEVASF, INCLUSIVE COMBUSTÍVEL, MANUTENÇÃO, SEGURO E IMPOSTOS - CONFORME ESPECIFICAÇÕES","SERV","MÊS",7,{"$f":"VLOOKUP(A15,'CPU-SERV'!A:K,11,0)","v":4264.1499999999996},{"$f":"TRUNC(_xlfn.IFS(F15=\"SERV\",I15*(1+$L$5/100),F15=\"SERV DIF\",I15*(1+$L$6/100),F15=\"FORN\",I15*(1+$L$7/100)),2)","v":5258.54},29849.05,36809.78]
[6,"1.6",78472,"SINAPI","SERVIÇOS TOPOGRÁFICOS PARA PAVIMENTAÇÃO, INCLUSIVE LEVANTAMENTO PLANIALTIMÉTRICO CADASTRAL, GERAÇÃO DE NOTAS DE SERVIÇO, SEÇÕES TRANSVERSAIS E GREIDE, ESTAQUEAMENTO E ACOMPANHAMENTO EXECUTIVO","SERV","M2",15000,{"$f":"VLOOKUP(A16,'CPU-SERV'!A:K,11,0)","v":0.38},{"$f":"TRUNC(_xlfn.IFS(F16=\"SERV\",I16*(1+$L$5/100),F16=\"SERV DIF\",I16*(1+$L$6/100),F16=\"FORN\",I16*(1+$L$7/100)),2)","v":0.46},5700,6900]
["B",2,null,null,"TERRAPLANAGEM E PAVIMENTAÇÃO",{"$nulls":5},{"$f":"SUM(K18:K23)","v":320217},{"$f":"SUM(L18:L23)","v":394632}]
[7,"2.1",5502140,"SICRO","ESCAVAÇÃO, CARGA E TRANSPORTE DE MATERIAL DE 1ª CATEGORIA - DMT 1.000 A 1.200M, CAMINHO DE SERVIÇO EM REVESTIMENTO PRIMÁRIO","SERV","M3",9000,{"$f":"VLOOKUP(A18,'CPU-SERV'!A:K,11,0)","v":6.74},{"$f":"TRUNC(_xlfn.IFS(F18=\"SERV\",I18*(1+$L$5/100),F18=\"SERV DIF\",I18*(1+$L$6/100),F18=\"FORN\",I18*(1+$L$7/100)),2)","v":8.31},{"$f":"TRUNC(H18*I18,2)","v":60660},{"$f":"TRUNC(H18*J18,2)","v":74790}]
[9,"2.2",4011209,"SICRO","REGULARIZAÇÃO E COMPACTAÇÃO DO SUBLEITO ","SERV","M2",15000,{"$f":"VLOOKUP(A19,'CPU-SERV'!A:K,11,0)","v":1.1499999999999999},{"$f":"TRUNC(_xlfn.IFS(F19=\"SERV\",I19*(1+$L$5/100),F19=\"SERV DIF\",I19*(1+$L$6/100),F19=\"FORN\",I19*(1+$L$7/100)),2)","v":1.41},17250,21150]
[10,"2.3",4011219,"SICRO","EXECUÇÃO E COMPACTAÇÃO DE BASE E OU SUB BASE PARA PAVIMENTAÇÃO COM SOLO ESTABILIZADO GRANULOMETRICAMENTE SEM MISTURA, COM MATERIAL DE JAZIDA - EXCLUSIVE TRANSPORTE","SERV","M3",4500,{"$f":"VLOOKUP(A20,'CPU-SERV'!A:K,11,0)","v":14.78},{"$f":"TRUNC(_xlfn.IFS(F20=\"SERV\",I20*(1+$L$5/100),F20=\"SERV DIF\",I20*(1+$L$6/100),F20=\"FORN\",I20*(1+$L$7/100)),2)","v":18.22},66510,81990]
[12,"2.4",4011352,"SICRO","IMPRIMAÇÃO COM EMULSÃO ASFÁLTICA (EAI)","SERV","M2",15000,{"$f":"VLOOKUP(A21,'CPU-SERV'!A:K,11,0)","v":0.4},{"$f":"TRUNC(_xlfn.IFS(F21=\"SERV\",I21*(1+$L$5/100),F21=\"SERV DIF\",I21*(1+$L$6/100),F21=\"FORN\",I21*(1+$L$7/100)),2)","v":0.49},6000,7350]
[13,"2.5",4011353,"SICRO","PINTURA DE LIGAÇÃO COM EMULSÃO ASFÁLTICA RR-1C","SERV","M2",13000,{"$f":"VLOOKUP(A22,'CPU-SERV'!A:K,11,0)","v":0.27},{"$f":"TRUNC(_xlfn.IFS(F22=\"SERV\",I22*(1+$L$5/100),F22=\"SERV DIF\",I22*(1+$L$6/100),F22=\"FORN\",I22*(1+$L$7/100)),2)","v":0.33},3510,4290]
[14,"2.6",4011463,"SICRO","EXECUÇÃO DE PAVIMENTO COM APLICAÇÃO DE CONCRETO ASFÁLTICO USINADO A QUENTE (CBUQ), CAMADA DE ROLAMENTO - EXCLUSIVE TRANSPORTE","SERV","T",1100,{"$f":"VLOOKUP(A23,'CPU-SERV'!A:K,11,0)","v":151.16999999999999},{"$f":"TRUNC(_xlfn.IFS(F23=\"SERV\",I23*(1+$L$5/100),F23=\"SERV DIF\",I23*(1+$L$6/100),F23=\"FORN\",I23*(1+$L$7/100)),2)","v":186.42},166287,205062,{"$nulls":6},{"$f":"H23*0.25","v":275}]
["C",3,null,null,"TRANSPORTE DE MATERIAIS",{"$nulls":5},{"$f":"SUM(K25:K30)","v":349328.8},{"$f":"SUM(L25:L30)","v":428166.8}]
[15,"3.1",5915321,"SICRO","TRANSPORTE COM CAMINHÃO BASCULANTE, EM RODOVIA PAVIMENTADA","SERV","TXKM",42000,{"$f":"VLOOKUP(A25,'CPU-SERV'!A:K,11,0)","v":0.65},{"$f":"TRUNC(_xlfn.IFS(F25=\"SERV\",I25*(1+$L$5/100),F25=\"SERV DIF\",I25*(1+$L$6/100),F25=\"FORN\",I25*(1+$L$7/100)),2)","v":0.8},{"$f":"TRUNC(H25*I25,2)","v":27300},{"$f":"TRUNC(H25*J25,2)","v":33600}]
[16,"3.2",5915320,"SICRO","TRANSPORTE COM CAMINHÃO BASCULANTE, RODOVIA EM REVESTIMENTO PRIMÁRIO","SERV","TXKM",158000,{"$f":"VLOOKUP(A26,'CPU-SERV'!A:K,11,0)","v":0.72},{"$f":"TRUNC(_xlfn.IFS(F26=\"SERV\",I26*(1+$L$5/100),F26=\"SERV DIF\",I26*(1+$L$6/100),F26=\"FORN\",I26*(1+$L$7/100)),2)","v":0.88},113760,139040]
[17,"3.3",5914434,"SICRO","TRANSPORTE COM CAMINHÃO CARROCERIA 9T, EM VIA URBANA PAVIMENTADA","SERV","TXKM",51000,{"$f":"VLOOKUP(A27,'CPU-SERV'!A:K,11,0)","v":0.74},{"$f":"TRUNC(_xlfn.IFS(F27=\"SERV\",I27*(1+$L$5/100),F27=\"SERV DIF\",I27*(1+$L$6/100),F27=\"FORN\",I27*(1+$L$7/100)),2)","v":0.91},37740,46410]
[18,"3.4",5914612,"SICRO","TRANSPORTE DE MASSA ASFÁLTICA COM CAMINHÃO BASCULANTE COM CAÇAMBA TÉRMICA, EM VIA URBANA PAVIMENTADA","SERV","TXKM",124000,{"$f":"VLOOKUP(A28,'CPU-SERV'!A:K,11,0)","v":0.93},{"$f":"TRUNC(_xlfn.IFS(F28=\"SERV\",I28*(1+$L$5/100),F28=\"SERV DIF\",I28*(1+$L$6/100),F28=\"FORN\",I28*(1+$L$7/100)),2)","v":1.1399999999999999},115320,141360]
[19,"3.5",5914613,"SICRO","TRANSPORTE DE MASSA ASFÁLTICA COM CAMINHÃO BASCULANTE COM CAÇAMBA TÉRMICA, EM VIA COM REVESTIMENTO PRIMÁRIO","SERV","TXKM",50000,{"$f":"VLOOKUP(A29,'CPU-SERV'!A:K,11,0)","v":1.1000000000000001},{"$f":"TRUNC(_xlfn.IFS(F29=\"SERV\",I29*(1+$L$5/100),F29=\"SERV DIF\",I29*(1+$L$6/100),F29=\"FORN\",I29*(1+$L$7/100)),2)","v":1.35},{"$f":"TRUNC(H29*I29,2)","v":55000},{"$f":"TRUNC(H29*J29,2)","v":67500}]
[20,"3.6",5914622,"SICRO","TRANSPORTE COM CAMINHÃO TANQUE DE TRANSPORTE DE MATERIAL ASFÁLTICO DE 30000 L, EM VIA URBANA PAVIMENTADA","SERV","TXKM",120,{"$f":"VLOOKUP(A30,'CPU-SERV'!A:K,11,0)","v":1.74},{"$f":"TRUNC(_xlfn.IFS(F30=\"SERV\",I30*(1+$L$5/100),F30=\"SERV DIF\",I30*(1+$L$6/100),F30=\"FORN\",I30*(1+$L$7/100)),2)","v":2.14},208.8,256.8]
["E",4,null,null,"DRENAGEM E OBRAS COMPLEMENTARES",{"$nulls":5},{"$f":"SUM(K32:K36)","v":330719.30000000005},{"$f":"SUM(L32:L36)","v":407803.60000000003}]
[21,"4.1",94273,"SINAPI","ASSENTAMENTO DE GUIA (MEIO-FIO) PRÉ-MOLDADO DE CONCRETO - 100X15X13X30 CM (COMPRIMENTO X BASE INFERIOR X BASE SUPERIOR X ALTURA) - USO VIÁRIO","SERV","M",4000,{"$f":"VLOOKUP(A32,'CPU-SERV'!A:K,11,0)","v":44.65},{"$f":"TRUNC(_xlfn.IFS(F32=\"SERV\",I32*(1+$L$5/100),F32=\"SERV DIF\",I32*(1+$L$6/100),F32=\"FORN\",I32*(1+$L$7/100)),2)","v":55.06},{"$f":"TRUNC(H32*I32,2)","v":178600},{"$f":"TRUNC(H32*J32,2)","v":220240}]
[23,"4.2","94289a","SINAPI","EXECUÇÃO DE SARJETA EM CONCRETO USINADO, MOLDADO IN LOCO - 50CM DE BASE X 5CM DE ALTURA","SERV","M",4000,{"$f":"VLOOKUP(A33,'CPU-SERV'!A:K,11,0)","v":28.76},{"$f":"TRUNC(_xlfn.IFS(F33=\"SERV\",I33*(1+$L$5/100),F33=\"SERV DIF\",I33*(1+$L$6/100),F33=\"FORN\",I33*(1+$L$7/100)),2)","v":35.46},115040,141840]
[46,"4.3",5213440,"SICRO","PLACA DE REGULAMENTAÇÃO EM AÇO, D=60CM - PELÍCULA RETRORREFLETIVA - FORNECIMENTO E INSTALAÇÃO, INCLUSIVE  SUPORTE","SERV","UN.",15,{"$f":"VLOOKUP(A34,'CPU-SERV'!A:K,11,0)","v":259.45999999999998},{"$f":"TRUNC(_xlfn.IFS(F34=\"SERV\",I34*(1+$L$5/100),F34=\"SERV DIF\",I34*(1+$L$6/100),F34=\"FORN\",I34*(1+$L$7/100)),2)","v":319.95999999999998},3891.9,4799.3999999999996]
[49,"4.4",5213401,"SICRO","PINTURA DE EIXO VIÁRIO SOBRE ASFALTO COM TINTA RETRORREFLETIVA A BASE DE RESINA ACRÍLICA COM MICROESFERAS DE VIDRO, APLICAÇÃO MECÂNICA COM DEMARCADORA AUTOPROPELIDA","SERV","M2",620,{"$f":"VLOOKUP(A35,'CPU-SERV'!A:K,11,0)","v":29.17},{"$f":"TRUNC(_xlfn.IFS(F35=\"SERV\",I35*(1+$L$5/100),F35=\"SERV DIF\",I35*(1+$L$6/100),F35=\"FORN\",I35*(1+$L$7/100)),2)","v":35.97},18085.400000000001,22301.4]
[51,"4.5",5213405,"SICRO","PINTURA DE FAIXA DE PEDESTRE OU ZEBRADA TINTA RETRORREFLETIVA A BASE DE RESINA ACRÍLICA COM MICROESFERAS DE VIDRO, APLICAÇÃO MANUAL","SERV","M2",360,{"$f":"VLOOKUP(A36,'CPU-SERV'!A:K,11,0)","v":41.95},{"$f":"TRUNC(_xlfn.IFS(F36=\"SERV\",I36*(1+$L$5/100),F36=\"SERV DIF\",I36*(1+$L$6/100),F36=\"FORN\",I36*(1+$L$7/100)),2)","v":51.73},15102,18622.8]
["F",5,null,null,"FORNECIMENTOS - MATERIAL ASFÁLTICO (BDI DIFERENCIADO)",{"$nulls":5},{"$f":"SUM(K38:K43)","v":477006.36},{"$f":"SUM(L38:L43)","v":548556.62}]
["F1","5.1","CPU.5","CODEVASF","AQUISIÇÃO DE EMULSÃO ASFÁLTICA PARA IMPRIMAÇÃO (EAI) - EXCLUSIVE TRANSPORTE","FORN","T",20,{"$f":"VLOOKUP(A38,'CPU-FORNEC'!A:J,9,0)","v":2897.45},{"$f":"TRUNC(_xlfn.IFS(F38=\"SERV\",I38*(1+$L$5/100),F38=\"SERV DIF\",I38*(1+$L$6/100),F38=\"FORN\",I38*(1+$L$7/100)),2)","v":3332.06},{"$f":"TRUNC(H38*I38,2)","v":57949},{"$f":"TRUNC(H38*J38,2)","v":66641.2}]
["F2","5.2","CPU.6","CODEVASF","TRANSPORTE DE EMULSÃO ASFÁLTICA PARA IMPRIMAÇÃO (EAI)","SERV DIF","T",20,{"$f":"VLOOKUP(A39,'CPU-FORNEC'!A:J,9,0)","v":580.46},{"$f":"TRUNC(_xlfn.IFS(F39=\"SERV\",I39*(1+$L$5/100),F39=\"SERV DIF\",I39*(1+$L$6/100),F39=\"FORN\",I39*(1+$L$7/100)),2)","v":667.52},11609.2,13350.4]
["F3","5.3","CPU.7","CODEVASF","AQUISIÇÃO DE EMULSAO ASFALTICA CATIONICA RR-1C - EXCLUSIVE TRANSPORTE","FORN","T",6,{"$f":"VLOOKUP(A40,'CPU-FORNEC'!A:J,9,0)","v":3478.58},{"$f":"TRUNC(_xlfn.IFS(F40=\"SERV\",I40*(1+$L$5/100),F40=\"SERV DIF\",I40*(1+$L$6/100),F40=\"FORN\",I40*(1+$L$7/100)),2)","v":4000.36},20871.48,24002.16]
["F4","5.4","CPU.8","CODEVASF","TRANSPORTE DE EMULSÃO ASFÁLTICA CATIONICA RR-1C","SERV DIF","T",6,{"$f":"VLOOKUP(A41,'CPU-FORNEC'!A:J,9,0)","v":594.58000000000004},{"$f":"TRUNC(_xlfn.IFS(F41=\"SERV\",I41*(1+$L$5/100),F41=\"SERV DIF\",I41*(1+$L$6/100),F41=\"FORN\",I41*(1+$L$7/100)),2)","v":683.76},3567.48,4102.5600000000004]
["F5","5.5","CPU.9","CODEVASF","AQUISIÇÃO DE CONCRETO ASFÁLTICO DE PETRÓLEO - CAP 50/70 - EXCLUSIVE TRANSPORTE","FORN","T",70,{"$f":"VLOOKUP(A42,'CPU-FORNEC'!A:J,9,0)","v":4907.8900000000003},{"$f":"TRUNC(_xlfn.IFS(F42=\"SERV\",I42*(1+$L$5/100),F42=\"SERV DIF\",I42*(1+$L$6/100),F42=\"FORN\",I42*(1+$L$7/100)),2)","v":5644.07},343552.3,395084.9]
["F6","5.6","CPU.10","CODEVASF","TRANSPORTE DE CONCRETO ASFÁLTICO DE PETRÓLEO - CAP 50/70","SERV DIF","T",70,{"$f":"VLOOKUP(A43,'CPU-FORNEC'!A:J,9,0)","v":563.66999999999996},{"$f":"TRUNC(_xlfn.IFS(F43=\"SERV\",I43*(1+$L$5/100),F43=\"SERV DIF\",I43*(1+$L$6/100),F43=\"FORN\",I43*(1+$L$7/100)),2)","v":648.22},39456.9,45375.4]
[null,"TOTAL GERAL DA OBRA COM BDI ",{"$nulls":8},{"$f":"SUM(K10,K17,K24,K31,K37)","v":1655945.1600000001},{"$f":"SUM(L10,L17,L24,L31,L37)","v":1999370.0900000003}]

{"sheet":"CPU-SERV","index":1,"n_rows":995,"n_cols":11,"rows_kept":995,"cut":false,"hidden":false,"merged":[[743,5,743,7],[707,0,744,0],[708,2,708,9],[709,1,710,3],[709,4,709,5],[710,4,710,5],[711,2,711,7],[711,8,711,9],[712,1,713,2],[712,3,713,3],[712,4,712,5],[712,6,712,7],[717,7,717,9],[720,3,720,7],[721,3,721,7],[722,3,722,7],[725,7,725,9],[728,3,728,7],[729,7,729,9],[732,3,732,7],[734,8,734,9],[737,3,737,7],[738,1,739,2],[738,3,739,3],[738,4,739,4],[738,5,738,7],[738,9,739,9],[742,3,742,7],[978,3,978,7],[980,8,980,9],[985,3,985,7],[986,1,987,2],[986,3,987,3],[986,4,987,4],[986,5,986,7],[986,9,987,9],[940,3,941,3],[940,4,941,4],[940,5,940,7],[940,9,941,9],[963,3,963,7],[964,3,964,7],[965,3,965,7],[968,7,968,9],[974,3,974,7],[975,7,975,9],[954,8,954,9],[955,1,956,2],[955,3,956,3],[955,4,955,5],[955,6,955,7],[960,7,960,9],[950,0,994,0],[951,2,951,9],[952,1,953,3],[952,4,952,5],[953,4,953,5],[954,2,954,7],[992,3,992,7],[993,5,993,7],[900,3,900,7],[901,5,901,7],[865,0,902,0],[866,2,866,9],[867,1,868,3],[867,4,867,5],[868,4,868,5],[869,2,869,7],[917,3,917,7],[918,3,918,7],[919,3,919,7],[922,7,922,9],[928,3,928,7],[929,7,929,9],[908,8,908,9],[909,1,910,2],[909,3,910,3],[909,4,909,5],[909,6,909,7],[914,7,914,9],[904,0,948,0],[905,2,905,9],[906,1,907,3],[906,4,906,5],[907,4,907,5],[908,2,908,7],[946,3,946,7],[947,5,947,7],[932,3,932,7],[934,8,934,9],[939,3,939,7],[940,1,941,2],[857,3,858,3],[857,4,858,4],[857,5,857,7],[857,9,858,9],[890,3,890,7],[892,8,892,9],[895,3,895,7],[896,1,897,2],[896,3,897,3],[896,4,897,4],[896,5,896,7],[896,9,897,9],[878,3,878,7],[879,3,879,7],[880,3,880,7],[883,7,883,9],[886,3,886,7],[887,7,887,9],[869,8,869,9],[870,1,871,2],[870,3,871,3],[870,4,870,5],[870,6,870,7],[875,7,875,9],[820,3,820,7],[821,5,821,7],[785,0,822,0],[786,2,786,9],[787,1,788,3],[787,4,787,5],[788,4,788,5],[789,2,789,7],[837,3,837,7],[838,3,838,7],[839,3,839,7],[842,7,842,9],[847,3,847,7],[848,7,848,9],[828,8,828,9],[829,1,830,2],[829,3,830,3],[829,4,829,5],[829,6,829,7],[834,7,834,9],[824,0,863,0],[825,2,825,9],[826,1,827,3],[826,4,826,5],[827,4,827,5],[828,2,828,7],[861,3,861,7],[862,5,862,7],[851,3,851,7],[853,8,853,9],[856,3,856,7],[857,1,858,2],[777,3,778,3],[777,4,778,4],[777,5,777,7],[777,9,778,9],[810,3,810,7],[812,8,812,9],[815,3,815,7],[816,1,817,2],[816,3,817,3],[816,4,817,4],[816,5,816,7],[816,9,817,9],[798,3,798,7],[799,3,799,7],[800,3,800,7],[803,7,803,9],[806,3,806,7],[807,7,807,9],[789,8,789,9],[790,1,791,2],[790,3,791,3],[790,4,790,5],[790,6,790,7],[795,7,795,9],[759,3,759,7],[760,3,760,7],[761,3,761,7],[764,7,764,9],[767,3,767,7],[768,7,768,9],[750,8,750,9],[751,1,752,2],[751,3,752,3],[751,4,751,5],[751,6,751,7],[756,7,756,9],[703,3,703,7],[704,5,704,7],[746,0,783,0],[747,2,747,9],[748,1,749,3],[748,4,748,5],[749,4,749,5],[750,2,750,7],[781,3,781,7],[782,5,782,7],[668,0,705,0],[669,2,669,9],[670,1,671,3],[670,4,670,5],[671,4,671,5],[672,2,672,7],[771,3,771,7],[773,8,773,9],[776,3,776,7],[777,1,778,2],[693,3,693,7],[695,8,695,9],[698,3,698,7],[699,1,700,2],[699,3,700,3],[699,4,700,4],[699,5,699,7],[699,9,700,9],[681,3,681,7],[682,3,682,7],[683,3,683,7],[686,7,686,9],[689,3,689,7],[690,7,690,9],[672,8,672,9],[673,1,674,2],[673,3,674,3],[673,4,673,5],[673,6,673,7],[678,7,678,9],[651,7,651,9],[633,8,633,9],[634,1,635,2],[634,3,635,3],[634,4,634,5],[634,6,634,7],[639,7,639,9],[586,3,586,7],[587,5,587,7],[629,0,666,0],[630,2,630,9],[631,1,632,3],[631,4,631,5],[632,4,632,5],[633,2,633,7],[664,3,664,7],[665,5,665,7],[551,0,588,0],[552,2,552,9],[553,1,554,3],[553,4,553,5],[554,4,554,5],[654,3,654,7],[656,8,656,9],[659,3,659,7],[660,1,661,2],[660,3,661,3],[660,4,661,4],[660,5,660,7],[660,9,661,9],[565,3,565,7],[566,3,566,7],[569,7,569,9],[572,3,572,7],[573,7,573,9],[555,8,555,9],[556,1,557,2],[556,3,557,3],[556,4,556,5],[556,6,556,7],[561,7,561,9],[642,3,642,7],[643,3,643,7],[644,3,644,7],[647,7,647,9],[650,3,650,7],[555,2,555,7],[485,8,485,9],[488,3,488,7],[489,1,490,2],[489,3,490,3],[489,4,490,4],[489,5,489,7],[489,9,490,9],[539,1,540,2],[539,3,540,3],[539,4,540,4],[539,5,539,7],[539,9,540,9],[547,3,547,7],[529,3,529,7],[531,8,531,9],[538,3,538,7],[564,3,564,7],[522,7,522,8],[548,5,548,7],[576,3,576,7],[578,8,578,9],[581,3,581,7],[582,1,583,2],[582,3,583,3],[582,4,583,4],[582,5,582,7],[582,9,583,9],[423,6,423,7],[428,7,428,9],[471,3,471,7],[472,3,472,7],[473,3,473,7],[476,7,476,9],[479,3,479,7],[480,7,480,9],[461,8,461,9],[462,1,463,2],[462,3,463,3],[462,4,462,5],[462,6,462,7],[468,7,468,9],[453,3,453,7],[454,5,454,7],[432,3,432,7],[433,3,433,7],[436,7,436,9],[439,3,439,7],[440,7,440,9],[527,7,527,9],[483,3,483,7],[457,0,495,0],[458,2,458,9],[459,1,460,3],[459,4,459,5],[460,4,460,5],[461,2,461,7],[493,3,493,7],[494,5,494,7],[437,7,437,8],[418,0,455,0],[419,2,419,9],[420,1,421,3],[420,4,420,5],[421,4,421,5],[422,2,422,7],[404,3,404,7],[406,8,406,9],[409,3,409,7],[410,1,411,2],[410,3,411,3],[410,4,411,4],[410,5,410,7],[410,9,411,9],[443,3,443,7],[445,8,445,9],[448,3,448,7],[449,1,450,2],[449,3,450,3],[449,4,450,4],[449,5,449,7],[449,9,450,9],[431,3,431,7],[422,8,422,9],[423,1,424,2],[423,3,424,3],[423,4,423,5],[392,3,392,7],[393,3,393,7],[394,3,394,7],[397,7,397,9],[400,3,400,7],[401,7,401,9],[383,8,383,9],[384,1,385,2],[384,3,385,3],[384,4,384,5],[384,6,384,7],[389,7,389,9],[379,0,416,0],[380,2,380,9],[381,1,382,3],[381,4,381,5],[382,4,382,5],[383,2,383,7],[414,3,414,7],[415,5,415,7],[398,7,398,8],[365,3,365,7],[367,8,367,9],[370,3,370,7],[371,1,372,2],[371,3,372,3],[371,4,372,4],[371,5,371,7],[371,9,372,9],[328,5,328,7],[328,9,329,9],[310,3,310,7],[311,3,311,7],[298,6,298,7],[307,7,307,9],[353,3,353,7],[354,3,354,7],[355,3,355,7],[358,7,358,9],[361,3,361,7],[362,7,362,9],[340,8,340,9],[341,1,342,2],[341,3,342,3],[341,4,341,5],[341,6,341,7],[350,7,350,9],[332,3,332,7],[333,5,333,7],[312,3,312,7],[315,7,315,9],[318,3,318,7],[319,7,319,9],[297,8,297,9],[298,1,299,2],[298,3,299,3],[298,4,298,5],[259,6,259,7],[264,7,264,9],[289,3,289,7],[290,5,290,7],[269,3,269,7],[272,7,272,9],[275,3,275,7],[276,7,276,9],[336,0,377,0],[337,2,337,9],[338,1,339,3],[338,4,338,5],[339,4,339,5],[340,2,340,7],[375,3,375,7],[376,5,376,7],[293,0,334,0],[294,2,294,9],[295,1,296,3],[295,4,295,5],[296,4,296,5],[297,2,297,7],[322,3,322,7],[324,8,324,9],[327,3,327,7],[328,1,329,2],[328,3,329,3],[328,4,329,4],[254,0,291,0],[255,2,255,9],[256,1,257,3],[256,4,256,5],[257,4,257,5],[258,2,258,7],[240,3,240,7],[242,8,242,9],[245,3,245,7],[246,1,247,2],[246,3,247,3],[246,4,247,4],[246,5,246,7],[246,9,247,9],[279,3,279,7],[281,8,281,9],[284,3,284,7],[285,1,286,2],[285,3,286,3],[285,4,286,4],[285,5,285,7],[285,9,286,9],[267,3,267,7],[268,3,268,7],[258,8,258,9],[259,1,260,2],[259,3,260,3],[259,4,259,5],[176,7,176,9],[228,3,228,7],[229,3,229,7],[230,3,230,7],[233,7,233,9],[236,3,236,7],[237,7,237,9],[217,8,217,9],[218,1,219,2],[218,3,219,3],[218,4,218,5],[218,6,218,7],[223,7,223,9],[209,3,209,7],[210,5,210,7],[184,7,184,9],[187,3,187,7],[188,7,188,9],[213,0,252,0],[214,2,214,9],[215,1,216,3],[215,4,215,5],[216,4,216,5],[217,2,217,7],[250,3,250,7],[251,5,251,7],[166,0,211,0],[167,2,167,9],[168,1,169,3],[168,4,168,5],[169,4,169,5],[170,2,170,7],[154,8,154,9],[157,3,157,7],[158,1,159,2],[158,3,159,3],[158,4,159,4],[158,5,158,7],[158,9,159,9],[199,3,199,7],[201,8,201,9],[204,3,204,7],[205,1,206,2],[205,3,206,3],[205,4,206,4],[205,5,205,7],[205,9,206,9],[179,3,179,7],[180,3,180,7],[181,3,181,7],[170,8,170,9],[171,1,172,2],[171,3,172,3],[171,4,171,5],[171,6,171,7],[139,3,139,7],[140,3,140,7],[143,7,143,9],[148,3,148,7],[149,7,149,9],[152,3,152,7],[130,1,131,2],[130,3,131,3],[130,4,130,5],[130,6,130,7],[135,7,135,9],[138,3,138,7],[122,5,122,7],[125,0,164,0],[126,2,126,9],[127,1,128,3],[127,4,127,5],[128,4,128,5],[129,2,129,7],[129,8,129,9],[162,3,162,7],[163,5,163,7],[117,1,118,2],[117,3,118,3],[117,4,118,4],[117,5,117,7],[117,9,118,9],[121,3,121,7],[96,7,96,9],[101,3,101,7],[104,7,104,9],[107,3,107,7],[108,7,108,9],[111,3,111,7],[86,0,123,0],[87,2,87,9],[88,1,89,3],[89,4,89,5],[90,2,90,7],[90,8,90,9],[91,1,92,2],[113,8,113,9],[116,3,116,7],[99,3,99,7],[100,3,100,7],[91,3,92,3],[91,4,91,5],[91,6,91,7],[82,3,82,7],[83,5,83,7],[88,4,88,5],[77,3,77,7],[78,1,79,2],[78,3,79,3],[78,4,79,4],[78,5,78,7],[78,9,79,9],[60,3,60,7],[63,7,63,9],[66,3,66,7],[67,7,67,9],[72,3,72,7],[74,8,74,9],[47,3,48,3],[47,4,47,5],[47,6,47,7],[52,7,52,9],[58,3,58,7],[59,3,59,7],[44,1,45,3],[44,4,44,5],[45,4,45,5],[46,2,46,7],[46,8,46,9],[47,1,48,2],[0,0,40,0],[3,4,3,5],[2,4,2,5],[1,2,1,9],[2,1,3,3],[34,3,35,3],[34,4,35,4],[34,5,34,7],[34,9,35,9],[38,3,38,7],[39,5,39,7],[13,7,13,9],[16,3,16,7],[17,3,17,7],[18,3,18,7],[21,7,21,9],[33,3,33,7],[34,1,35,2],[25,7,25,9],[28,3,28,7],[30,8,30,9],[24,3,24,7],[4,2,4,7],[4,8,4,9],[5,1,6,2],[5,3,6,3],[5,4,5,5],[5,6,5,7],[497,0,549,0],[498,2,498,9],[499,1,500,3],[499,4,499,5],[500,4,500,5],[501,2,501,7],[501,8,501,9],[502,1,503,2],[502,3,503,3],[502,4,502,5],[502,6,502,7],[510,7,510,9],[512,3,512,7],[513,3,513,7],[514,3,514,7],[517,7,517,9],[526,3,526,7],[42,0,84,0],[43,2,43,9],[590,0,627,0],[591,2,591,9],[592,1,593,3],[592,4,592,5],[593,4,593,5],[594,2,594,7],[594,8,594,9],[595,1,596,2],[595,3,596,3],[595,4,595,5],[595,6,595,7],[600,7,600,9],[603,3,603,7],[604,3,604,7],[605,3,605,7],[608,7,608,9],[611,3,611,7],[612,7,612,9],[615,3,615,7],[617,8,617,9],[620,3,620,7],[621,1,622,2],[621,3,622,3],[621,4,622,4],[621,5,621,7],[621,9,622,9],[625,3,625,7],[626,5,626,7]]}
[1,"1ª/GRD",{"$nulls":8},{"$f":"J40","v":18086.95}]
[null,"OBRA:"," PAVIMENTAÇÃO ASFÁLTICA EM CBUQ - VIAS URBANAS DIVERSAS (ÁGUAS VERMELHAS / MG)"]
[null,"Custo Unitário de Referência",null,null,"Minas Gerais"]
[{"$nulls":4}," Janeiro/2025 ",null,null,"Produção da equipe ",0.5,{"$f":"VLOOKUP(A1,ORÇAMENTO!$A$10:$L$44,7,1)","v":"GL"}]
[null,"CPU.1","MOBILIZAÇÃO E DESMOBILIZAÇÃO",{"$nulls":5},"Valores em reais (R$)"]
[null,"A - EQUIPAMENTOS",null,"Quantidade","Utilização",null,"Custo Horário",null,null,"Custo"]
[{"$nulls":4},"Operativa","Improdutiva","Produtivo","Improdutivo",null,"Horário Total"]
[null,"E9687","Caminhão carroceria com capacidade de 5 t - 115 kW",8,0.6,0.4,146.88079999999999,57.423099999999998,null,{"$f":"D8*(E8*G8+F8*H8)","v":888.78175999999996}]
[null,"E9571","Caminhão tanque com capacidade de 10.000 l - 188 kW",2,1,0,323.59019999999998,80.173299999999998,null,{"$f":"D9*(E9*G9+F9*H9)","v":647.18039999999996}]
[null,"E9509","Caminhão tanque distribuidor de asfalto com capacidade de 6.000 l - 7 kW/136 kW",2,1,0,261.03050000000002,72.388300000000001,null,522.06100000000004]
[null,"E9514","Distribuidor de agregados sobre pneus autopropelido - 130 kW",2,1,0,292.00130000000001,107.6279,null,584.00260000000003]
[null,"E9575","Caminhão basculante com caçamba estanque com capacidade de 14 m³ - 210 kW",8,1,0,309.83940000000001,90.412199999999999,null,{"$f":"D12*(E12*G12+F12*H12)","v":2478.7152000000001}]
[{"$nulls":7},"Custo horário total de equipamentos",null,{"$f":"SUM(J8:J12)","v":5120.740960000001}]
[null,"B - MÃO DE OBRA",null,"Quantidade","Unidade",null,"Custo Horário","Custo Horário Total"]
[null,"P9824","Servente",8,"h",null,21.3355,null,null,{"$f":"D15*G15","v":170.684}]
[{"$nulls":9},{"$f":"D16*G16","v":0}]
[null,null,null,"Custo horário total de mão de obra",{"$nulls":5},{"$f":"SUM(J15:J16)","v":170.684}]
[null,null,null,"Custo horário total de execução",{"$nulls":5},{"$f":"J13+J17","v":5291.4249600000012}]
[null,null,null,"Custo unitário de execução",{"$nulls":5},{"$f":"J18/I4","v":10582.849920000002}]
[{"$nulls":7},"Custo do FIC",null,0]
[{"$nulls":7},"Custo do FIT",null,0]
[null,"C - MATERIAL",null,"Quantidade","Unidade",null,"Preço Unitário","Custo Unitário"]
[null,"-",0,null,0,null,0,null,null,{"$f":"D23*G23","v":0}]
[null,"-",0,null,0,null,0,null,null,{"$f":"D24*G24","v":0}]
[null,null,null,"Custo unitário total de material",{"$nulls":5},{"$f":"SUM(J23:J24)","v":0}]
[null,"D - ATIVIDADES AUXILIARES",null,"Quantidade","Unidade",null,"Custo Unitário","Custo Unitário"]
[null,5914640,"Transporte com cavalo mecânico com semirreboque com capacidade de 30 t - rodovia pavimentada",13165.1,"tkm",null,0.56999999999999995,null,null,{"$f":"D27*G27","v":7504.107}]
[null,"-",0,0,0,null,0,null,null,{"$f":"D28*G28","v":0}]
[null,null,null,"Custo total de atividades auxiliares",{"$nulls":5},{"$f":"SUM(J27:J28)","v":7504.107}]
[{"$nulls":7},"Subtotal",null,{"$f":"J19+J25+J29+J20+J21","v":18086.956920000004}]
[null,"E - TEMPO FIXO",null,"Código","Quantidade","Unidade",null,"Custo Unitário","Custo Unitário"]
[null,"-",0,"-",null,0,null,0,null,{"$f":"ROUNDDOWN(E32*H32,4)","v":0}]
[null,"-",0,"-",null,0,null,0,null,{"$f":"ROUNDDOWN(E33*H33,4)","v":0}]
[null,null,null,"Custo unitário total de tempo fixo",{"$nulls":5},{"$f":"SUM(J32:J33)","v":0}]
[null,"F - MOMENTO DE TRANSPORTE",null,"Quantidade","Unidade","DMT",null,null,null,"Custo Unitário"]
[{"$nulls":5},"LN","RP","P"]
[null,"-",0,null,"tkm"]
[null,"-",0,null,"tkm"]
[null,null,null,"Custo unitário total de transporte"]
[{"$nulls":5},"Custo unitário direto total",null,null,null,{"$f":"TRUNC(J30+J34,2)","v":18086.95}]
[null,"Obs."]
[]
[{"$f":"A1+1","v":2},"1ª/GRD",{"$nulls":8},{"$f":"J84","v":108051.88}]
[null,"OBRA:"," PAVIMENTAÇÃO ASFÁLTICA EM CBUQ - VIAS URBANAS DIVERSAS (ÁGUAS VERMELHAS / MG)"]
[null,"Custo Unitário de Referência",null,null,"Minas Gerais"]
[{"$nulls":4}," Janeiro/2025 ",null,null,"Produção da equipe ",0.2,{"$f":"VLOOKUP(A43,ORÇAMENTO!$A$10:$L$44,7,1)","v":"GL"}]
[null,"CPU.2","ADMINISTRAÇÃO LOCAL ",{"$nulls":5},"Valores em reais (R$)"]
[null,"A - EQUIPAMENTOS",null,"Quantidade","Utilização",null,"Custo Horário",null,null,"Custo"]
[{"$nulls":4},"Operativa","Improdutiva","Produtivo","Improdutivo",null,"Horário Total"]
[null,"-",0,null,null,null,0,0,null,{"$f":"D50*(E50*G50+F50*H50)","v":0}]
[null,"-",0,null,null,null,0,0,null,{"$f":"D51*(E51*G51+F51*H51)","v":0}]
[{"$nulls":7},"Custo horário total de equipamentos",null,{"$f":"SUM(J50:J51)","v":0}]
[null,"B - MÃO DE OBRA",null,"Quantidade","Unidade",null,"Custo Horário","Custo Horário Total"]
[null,"P9812","Engenheiro",0.15251043865991359,"mês",null,26055.551500000001,null,null,{"$f":"D54*G54","v":3973.7435887909696}]
[null,"P9840","Encarregado geral",1,"mês",null,9988.7388749999991,null,null,{"$f":"D55*G55","v":9988.7388749999991}]
[null,"P9876","Técnico de segurança do trabalho",0.5,"mês",null,5884.1547,null,null,2942.07735]
[null,"P9858","Laboratorista",0.5,"mês",null,4782.9530249999998,null,null,2391.4765124999999]
[null,"P9806","Auxiliar administrativo",0.5,"mês",null,3354.0398249999998,null,null,1677.0199124999999]
[null,null,null,"Custo horário total de mão de obra",{"$nulls":5},{"$f":"SUM(J54:J58)","v":20973.05623879097}]
[null,null,null,"Custo horário total de execução",{"$nulls":5},{"$f":"J52+J59","v":20973.05623879097}]
[null,null,null,"Custo unitário de execução",{"$nulls":5},{"$f":"J60/I46","v":104865.28119395484}]
[{"$nulls":7},"Custo do FIC",null,0]
[{"$nulls":7},"Custo do FIT",null,"-"]
[null,"C - MATERIAL",null,"Quantidade","Unidade",null,"Preço Unitário","Custo Unitário"]
[null,"-",0,0,0,null,0,null,null,{"$f":"D65*G65","v":0}]
[null,"-",0,0,0,null,0,null,null,0]
[null,null,null,"Custo unitário total de material",{"$nulls":5},{"$f":"SUM(J65:J66)","v":0}]
[null,"D - ATIVIDADES AUXILIARES",null,"Quantidade","Unidade",null,"Custo Unitário","Custo Unitário"]
[null,14250,"Energia Elétrica",360,"kwh",null,0.95,null,null,{"$f":"D69*G69","v":342}]
[null,44480,"Tarifa A - Água e Esgoto",24,"m³",null,17.97,null,null,{"$f":"D70*G70","v":431.28}]
[null,5212560,"Placa de advertência para sinalização de obras montada em suporte metálico móvel, lado 1,00 m - utilização de 600 ciclos - fornecimento, 01 implantação e 01 retirada diária",528,"un.dia",null,3.89,null,null,{"$f":"D71*G71","v":2053.92}]
[null,"Cotação","Telefone",6,"mês",null,59.9,null,null,{"$f":"D72*G72","v":359.4}]
[null,null,null,"Custo total de atividades auxiliares",{"$nulls":5},{"$f":"SUM(J69:J72)","v":3186.6}]
[{"$nulls":7},"Subtotal",null,{"$f":"J61+J67+J73","v":108051.88119395485}]
[null,"E - TEMPO FIXO",null,"Código","Quantidade","Unidade",null,"Custo Unitário","Custo Unitário"]
[null,"-",0,"-",0,"t",null,0,null,{"$f":"ROUNDDOWN(E76*H76,4)","v":0}]
[null,"-",0,"-",0,"t",null,0,null,{"$f":"ROUNDDOWN(E77*H77,4)","v":0}]
[null,null,null,"Custo unitário total de tempo fixo",{"$nulls":5},{"$f":"SUM(J76:J77)","v":0}]
[null,"F - MOMENTO DE TRANSPORTE",null,"Quantidade","Unidade","DMT",null,null,null,"Custo Unitário"]
[{"$nulls":5},"LN","RP","P"]
[null,"-",0,null,"tkm"]
[null,"-",0,null,"tkm"]
[null,null,null,"Custo unitário total de transporte"]
[{"$nulls":5},"Custo unitário direto total",null,null,null,{"$f":"TRUNC(J74+J78,2)","v":108051.88}]
[null,"Obs."]
[]
[{"$f":"A43+1","v":3},"1ª/GRD",{"$nulls":8},{"$f":"J123","v":13722.3}]
[null,"OBRA:"," PAVIMENTAÇÃO ASFÁLTICA EM CBUQ - VIAS URBANAS DIVERSAS (ÁGUAS VERMELHAS / MG)"]
[null,"Custo Unitário de Referência",null,null,"Minas Gerais"]
[{"$nulls":4}," Janeiro/2025 ",null,null,"Produção da equipe ",1,{"$f":"VLOOKUP(A87,ORÇAMENTO!$A$10:$L$44,7,1)","v":"GL"}]
[null,"CPU.3","CANTEIRO DE OBRAS ",{"$nulls":5},"Valores em reais (R$)"]
[null,"A - EQUIPAMENTOS",null,"Quantidade","Utilização",null,"Custo Horário",null,null,"Custo"]
[{"$nulls":4},"Operativa","Improdutiva","Produtivo","Improdutivo",null,"Horário Total"]
[null,"-",0,null,null,null,0,0,null,{"$f":"D94*(E94*G94+F94*H94)","v":0}]
[null,"-",0,null,null,null,0,0,null,{"$f":"D95*(E95*G95+F95*H95)","v":0}]
[{"$nulls":7},"Custo horário total de equipamentos",null,{"$f":"SUM(J94:J95)","v":0}]
[null,"B - MÃO DE OBRA",null,"Quantidade","Unidade",null,"Custo Horário","Custo Horário Total"]
[null,"P9824","Servente",8,"h",null,21.3355,null,null,{"$f":"D98*G98","v":170.684}]
[null,"P9808","Carpinteiro",8,"h",null,26.4529,null,null,{"$f":"D99*G99","v":211.6232}]
[null,null,null,"Custo horário total de mão de obra",{"$nulls":5},{"$f":"SUM(J98:J99)","v":382.30719999999997}]
[null,null,null,"Custo horário total de execução",{"$nulls":5},{"$f":"J96+J100","v":382.30719999999997}]
[null,null,null,"Custo unitário de execução",{"$nulls":5},{"$f":"J101/I90","v":382.30719999999997}]
[{"$nulls":7},"Custo do FIC",null,"-"]
[{"$nulls":7},"Custo do FIT",null,"-"]
[null,"C - MATERIAL",null,"Quantidade","Unidade",null,"Preço Unitário","Custo Unitário"]
[null,"M0053","Tela plástica em polipropileno na cor laranja para tapume - L = 1,2 m",100,"m",null,1.7749999999999999,null,null,{"$f":"D106*G106","v":177.5}]
[null,"-",0,0,0,null,0,null,null,{"$f":"D107*G107","v":0}]
[null,null,null,"Custo unitário total de material",{"$nulls":5},{"$f":"SUM(J106:J107)","v":177.5}]
[null,"D - ATIVIDADES AUXILIARES",null,"Quantidade","Unidade",null,"Custo Unitário","Custo Unitário"]
[null,10775,"Locação de container 2,30 X 6,00 m, alt. 2,50 m, com 1 sanitário, para escritório, completo, sem divisórias internas",6,"mês",null,975,null,null,{"$f":"D110*G110","v":5850}]
[null,10779,"Locação de container 2,30 X 4,30 m, alt. 2,50 M, p/ sanitário, c/ 5 bacias, 1 lavatório e 4 mictórios",6,"mês",null,1218.75,null,null,{"$f":"D111*G111","v":7312.5}]
[null,null,null,"Custo total de atividades auxiliares",{"$nulls":5},{"$f":"SUM(J110:J111)","v":13162.5}]
[{"$nulls":7},"Subtotal",null,{"$f":"J102+J108+J112","v":13722.307199999999}]
[null,"E - TEMPO FIXO",null,"Código","Quantidade","Unidade",null,"Custo Unitário","Custo Unitário"]
[null,"-",0,"-",0,"t",null,0,null,{"$f":"ROUNDDOWN(E115*H115,4)","v":0}]
[null,"-",0,"-",0,"t",null,0,null,{"$f":"ROUNDDOWN(E116*H116,4)","v":0}]
[null,null,null,"Custo unitário total de tempo fixo",{"$nulls":5},{"$f":"SUM(J115:J116)","v":0}]
[null,"F - MOMENTO DE TRANSPORTE",null,"Quantidade","Unidade","DMT",null,null,null,"Custo Unitário"]
[{"$nulls":5},"LN","RP","P"]
[null,"-",0,0,"tkm"]
[null,"-",0,0,"tkm"]
[null,null,null,"Custo unitário total de transporte"]
[{"$nulls":5},"Custo unitário direto total",null,null,null,{"$f":"TRUNC(J113+J117,2)","v":13722.3}]
[null,"Obs."]
[]
[{"$f":"A87+1","v":4},"1ª/GRD",{"$nulls":8},{"$f":"J164","v":543.91999999999996}]
[null,"OBRA:"," PAVIMENTAÇÃO ASFÁLTICA EM CBUQ - VIAS URBANAS DIVERSAS (ÁGUAS VERMELHAS / MG)"]
[null,"Custo Unitário de Referência",null,null,"Minas Gerais"]
[{"$nulls":4}," Janeiro/2025 ",null,null,"Produção da equipe ",1,{"$f":"VLOOKUP(A126,ORÇAMENTO!$A$10:$L$44,7,1)","v":"M2"}]
[null,103689,"PLACA DE OBRA EM CHAPA DE AÇO GALVANIZADO",{"$nulls":5},"Valores em reais (R$)"]
[null,"A - EQUIPAMENTOS",null,"Quantidade","Utilização",null,"Custo Horário",null,null,"Custo"]
[{"$nulls":4},"Operativa","Improdutiva","Produtivo","Improdutivo",null,"Horário Total"]
[null,"-",0,null,null,null,0,0,null,{"$f":"D133*(E133*G133+F133*H133)","v":0}]
[null,"-",0,null,null,null,0,0,null,{"$f":"D134*(E134*G134+F134*H134)","v":0}]
[{"$nulls":7},"Custo horário total de equipamentos",null,{"$f":"SUM(J133:J134)","v":0}]
[null,"B - MÃO DE OBRA",null,"Quantidade","Unidade",null,"Custo Horário","Custo Horário Total"]
[null,"P9824","Servente",1.1186,"h",null,21.3355,null,null,{"$f":"D137*G137","v":23.8658903}]
[null,"P9808","Carpinteiro",0.37290000000000001,"h",null,26.4529,null,null,{"$f":"D138*G138","v":9.8642864100000001}]
[null,null,null,"Custo horário total de mão de obra",{"$nulls":5},{"$f":"SUM(J137:J138)","v":33.730176710000002}]
[null,null,null,"Custo horário total de execução",{"$nulls":5},{"$f":"J135+J139","v":33.730176710000002}]
[null,null,null,"Custo unitário de execução",{"$nulls":5},{"$f":"J140/I129","v":33.730176710000002}]
[{"$nulls":7},"Custo do FIC",null,"-"]
[{"$nulls":7},"Custo do FIT",null,"-"]
[null,"C - MATERIAL",null,"Quantidade","Unidade",null,"Preço Unitário","Custo Unitário"]
[null,"M1358","Sarrafo em madeira de terceira - E = 2,5 cm e L = 5 cm",6.4165999999999999,"m",null,1.9665999999999999,null,null,{"$f":"D145*G145","v":12.618885559999999}]
[null,"M1205","Prego de ferro",2.4500000000000001E-2,"kg",null,16.544499999999999,null,null,{"$f":"D146*G146","v":0.40534025000000001}]
[null,"M0998","Madeira estrutural de eucalipto",2.2608E-2,"m³",null,2418.0391,null,null,{"$f":"D147*G147","v":54.6670279728}]
[null,4813,"Placa de obra (para construção civil) em chapa galvanizada *N. 22*, adesivada, de *2,4 X 1,2* m (sem postes para fixação)",1,"m²",null,442.5,"(SINAPI)",null,442.5]
[null,null,null,"Custo unitário total de material",{"$nulls":5},{"$f":"SUM(J145:J148)","v":510.1912537828}]
[null,"D - ATIVIDADES AUXILIARES",null,"Quantidade","Unidade",null,"Custo Unitário","Custo Unitário"]
[null,"-",0,0,0,null,0,null,null,{"$f":"D151*G151","v":0}]
[null,"-",0,0,0,null,0,null,null,{"$f":"D152*G152","v":0}]
[null,null,null,"Custo total de atividades auxiliares",{"$nulls":5},{"$f":"SUM(J151:J152)","v":0}]
[{"$nulls":7},"Subtotal",null,{"$f":"J141+J149+J153","v":543.92143049280003}]
[null,"E - TEMPO FIXO",null,"Código","Quantidade","Unidade",null,"Custo Unitário","Custo Unitário"]
[null,"-",0,"-",0,"t",null,0,null,{"$f":"ROUNDDOWN(E156*H156,4)","v":0}]
[null,"-",0,"-",0,"t",null,0,null,{"$f":"ROUNDDOWN(E157*H157,4)","v":0}]
[null,null,null,"Custo unitário total de tempo fixo",{"$nulls":5},{"$f":"SUM(J156:J157)","v":0}]
[null,"F - MOMENTO DE TRANSPORTE",null,"Quantidade","Unidade","DMT",null,null,null,"Custo Unitário"]
[{"$nulls":5},"LN","RP","P"]
[null,"-",0,0,"tkm"]
[null,"-",0,0,"tkm"]
[null,null,null,"Custo unitário total de transporte"]
[{"$nulls":5},"Custo unitário direto total",null,null,null,{"$f":"TRUNC(J154+J158,2)","v":543.91999999999996}]
[null,"Obs."]
[]
[{"$f":"A126+1","v":5},"1ª/GRD",{"$nulls":8},{"$f":"J211","v":4264.1499999999996}]
[null,"OBRA:"," PAVIMENTAÇÃO ASFÁLTICA EM CBUQ - VIAS URBANAS DIVERSAS (ÁGUAS VERMELHAS / MG)"]
[null,"Custo Unitário de Referência",null,null,"Minas Gerais"]
[{"$nulls":4}," Janeiro/2025 ",null,null,"Produção da equipe ",1,{"$f":"VLOOKUP(A167,ORÇAMENTO!$A$10:$L$44,7,1)","v":"MÊS"}]
[null,"CPU.4","VEÍCULO PARA A FISCALIZAÇÃO, MÁXIMO 02 ANOS DE USO OU 50.000KM, PREFERENCIALMENTE NA COR BRANCA, COM IDENTIFICAÇÃO CONFORME ESPECIFICAÇÕES DA CODEVASF, INCLUSIVE COMBUSTÍVEL, MANUTENÇÃO, SEGURO E IMPOSTOS - CONFORME ESPECIFICAÇÕES",{"$nulls":5},"Valores em reais (R$)"]
[null,"A - EQUIPAMENTOS",null,"Quantidade","Utilização",null,"Custo Horário",null,null,"Custo"]
[{"$nulls":4},"Operativa","Improdutiva","Produtivo","Improdutivo",null,"Horário Total"]
[null,"-",0,null,null,null,0,0,null,{"$f":"D174*(E174*G174+F174*H174)","v":0}]
[null,"-",0,null,null,null,0,0,null,{"$f":"D175*(E175*G175+F175*H175)","v":0}]
[{"$nulls":7},"Custo horário total de equipamentos",null,{"$f":"SUM(J174:J175)","v":0}]
[null,"B - MÃO DE OBRA",null,"Quantidade","Unidade",null,"Custo Horário","Custo Horário Total"]
[null,"-",0,null,0,null,0,null,null,{"$f":"D178*G178","v":0}]
[null,"-",0,null,0,null,0,null,null,{"$f":"D179*G179","v":0}]
[null,null,null,"Custo horário total de mão de obra",{"$nulls":5},{"$f":"SUM(J178:J179)","v":0}]
[null,null,null,"Custo horário total de execução",{"$nulls":5},{"$f":"J176+J180","v":0}]
[null,null,null,"Custo unitário de execução",{"$nulls":5},{"$f":"J181/I170","v":0}]
[{"$nulls":7},"Custo do FIC",null,"-"]
[{"$nulls":7},"Custo do FIT",null,"-"]
[null,"C - MATERIAL",null,"Quantidade","Unidade",null,"Preço Unitário","Custo Unitário"]
[null,"-",0,null,0,null,0,null,null,{"$f":"D186*G186","v":0}]
[null,"-",0,null,0,null,0,null,null,{"$f":"D187*G187","v":0}]
[null,null,null,"Custo unitário total de material",{"$nulls":5},{"$f":"SUM(J186:J187)","v":0}]
[null,"D - ATIVIDADES AUXILIARES",null,"Quantidade","Unidade",null,"Custo Unitário","Custo Unitário"]
[null,"-","Depreciação",1,"vb",null,692.66666666666663,null,null,{"$f":"D190*G190","v":692.66666666666663}]
[null,"-","Oportunidade de Capital",1,"vb",null,510.84,null,null,{"$f":"D191*G191","v":510.84}]
[null,"-","Impostos e Licenciamento",1,"vb",null,346.33,null,null,346.33]
[null,"-","Seguro Total",1,"vb",null,281.58,null,null,281.58]
[null,"-","Combustível",1,"vb",null,1287.8599999999999,null,null,1287.8599999999999]
[null,"-","Manutenções Preventivas",1,"vb",null,254.02,null,null,254.02]
[null,"-","Limpeza",1,"vb",null,100,null,null,100]
[null,"-","Pneus",1,"vb",null,115.18,null,null,115.18]
[null,"-","Peças",1,"vb",null,77.22,null,null,77.22]
[null,"-","Manutenção Corretiva (%)",1,"vb",null,598.46,null,null,598.46]
[null,null,null,"Custo total de atividades auxiliares",{"$nulls":5},{"$f":"SUM(J190:J199)","v":4264.1566666666658}]
[{"$nulls":7},"Subtotal",null,{"$f":"J182+J188+J200","v":4264.1566666666658}]
[null,"E - TEMPO FIXO",null,"Código","Quantidade","Unidade",null,"Custo Unitário","Custo Unitário"]
[null,"-",0,"-",0,"t",null,0,null,{"$f":"ROUNDDOWN(E203*H203,4)","v":0}]
[null,"-",0,"-",0,"t",null,0,null,{"$f":"ROUNDDOWN(E204*H204,4)","v":0}]
[null,null,null,"Custo unitário total de tempo fixo",{"$nulls":5},{"$f":"SUM(J203:J204)","v":0}]
[null,"F - MOMENTO DE TRANSPORTE",null,"Quantidade","Unidade","DMT",null,null,null,"Custo Unitário"]
[{"$nulls":5},"LN","RP","P"]
[null,"-",0]
[null,"-",0]
[null,null,null,"Custo unitário total de transporte"]
[{"$nulls":5},"Custo unitário direto total",null,null,null,{"$f":"TRUNC(J201+J205,2)","v":4264.1499999999996}]
[null,"Obs."]
[]
[{"$f":"A167+1","v":6},"1ª/GRD",{"$nulls":8},{"$f":"J252","v":0.38}]
[null,"OBRA:"," PAVIMENTAÇÃO ASFÁLTICA EM CBUQ - VIAS URBANAS DIVERSAS (ÁGUAS VERMELHAS / MG)"]
[null,"Custo Unitário de Referência",null,null,"Minas Gerais"]
[{"$nulls":4}," Janeiro/2025 ",null,null,"Produção da equipe ",2000,{"$f":"VLOOKUP(A214,ORÇAMENTO!$A$10:$L$44,7,1)","v":"M2"}]
[null,78472,"SERVIÇOS TOPOGRÁFICOS PARA PAVIMENTAÇÃO, INCLUSIVE LEVANTAMENTO PLANIALTIMÉTRICO CADASTRAL, GERAÇÃO DE NOTAS DE SERVIÇO, SEÇÕES TRANSVERSAIS E GREIDE, ESTAQUEAMENTO E ACOMPANHAMENTO EXECUTIVO",{"$nulls":5},"Valores em reais (R$)"]
[null,"A - EQUIPAMENTOS",null,"Quantidade","Utilização",null,"Custo Horário",null,null,"Custo"]
[{"$nulls":4},"Operativa","Improdutiva","Produtivo","Improdutivo",null,"Horário Total"]
[null,92145,"Caminhonete cabine simples com motor 1.6 flex, câmbio manual, potência 101/104 cv, 2 portas",1,0.2,0.8,84.12,36.35,null,{"$f":"D221*(E221*G221+F221*H221)","v":45.904000000000003}]
[null,"-",0,null,null,null,0,0,null,{"$f":"D222*(E222*G222+F222*H222)","v":0}]
[{"$nulls":7},"Custo horário total de equipamentos",null,{"$f":"SUM(J221:J222)","v":45.904000000000003}]
[null,"B - MÃO DE OBRA",null,"Quantidade","Unidade",null,"Custo Horário","Custo Horário Total"]
[null,"P9949","Topógrafo",3.5000000000000003E-2,"mês",null,6816.9715999999999,28.404048333333332,null,{"$f":"D225*G225","v":238.59400600000001}]
[null,"P9950","Auxiliar de topografia",3.5000000000000003E-2,"mês",null,6157.8463000000002,22.806838148148149,null,{"$f":"D226*G226","v":215.52462050000003}]
[null,"P9824","Servente",4,"h",null,21.3355,8.889791666666666E-2,null,{"$f":"D227*G227","v":85.341999999999999}]
[null,"P9848","Desenhista",1.7500000000000002E-2,"mês",null,10307.748600000001,38.17684666666667,null,{"$f":"D228*G228","v":180.38560050000004}]
[null,null,null,"Custo horário total de mão de obra",{"$nulls":5},{"$f":"SUM(J225:J228)","v":719.846227}]
[null,null,null,"Custo horário total de execução",{"$nulls":5},{"$f":"J223+J229","v":765.750227}]
[null,null,null,"Custo unitário de execução",{"$nulls":5},{"$f":"J230/I217","v":0.38287511349999998}]
[{"$nulls":7},"Custo do FIC",null,"-"]
[{"$nulls":7},"Custo do FIT",null,"-"]
[null,"C - MATERIAL",null,"Quantidade","Unidade",null,"Preço Unitário","Custo Unitário"]
[null,"-",0,0,0,null,0,null,null,{"$f":"D235*G235","v":0}]
[null,"-",0,0,0,null,0,null,null,0]
[null,null,null,"Custo unitário total de material",{"$nulls":5},{"$f":"SUM(J235:J236)","v":0}]
[null,"D - ATIVIDADES AUXILIARES",null,"Quantidade","Unidade",null,"Custo Unitário","Custo Unitário"]
[null,"-",0,0,0,null,0,null,null,{"$f":"D239*G239","v":0}]
[null,"-",0,0,0,null,0,null,null,{"$f":"D240*G240","v":0}]
[null,null,null,"Custo total de atividades auxiliares",{"$nulls":5},{"$f":"SUM(J239:J240)","v":0}]
[{"$nulls":7},"Subtotal",null,{"$f":"J231+J237+J241","v":0.38287511349999998}]
[null,"E - TEMPO FIXO",null,"Código","Quantidade","Unidade",null,"Custo Unitário","Custo Unitário"]
[null,"-",0,"-",0,"t",null,0,null,{"$f":"ROUNDDOWN(E244*H244,4)","v":0}]
[null,"-",0,"-",0,"t",null,0,null,{"$f":"ROUNDDOWN(E245*H245,4)","v":0}]
[null,null,null,"Custo unitário total de tempo fixo",{"$nulls":5},{"$f":"SUM(J244:J245)","v":0}]
[null,"F - MOMENTO DE TRANSPORTE",null,"Quantidade","Unidade","DMT",null,null,null,"Custo Unitário"]
[{"$nulls":5},"LN","RP","P"]
[null,"-",0,0,"tkm"]
[null,"-",0,0,"tkm"]
[null,null,null,"Custo unitário total de transporte"]
[{"$nulls":5},"Custo unitário direto total",null,null,null,{"$f":"TRUNC(J242+J246,2)","v":0.38}]
[null,"Obs."]
[]
[{"$f":"A214+1","v":7},"1ª/GRD",{"$nulls":8},{"$f":"J291","v":6.74}]
[null,"OBRA:"," PAVIMENTAÇÃO ASFÁLTICA EM CBUQ - VIAS URBANAS DIVERSAS (ÁGUAS VERMELHAS / MG)"]
[null,"Custo Unitário de Referência",null,null,"Minas Gerais"]
[{"$nulls":4}," Janeiro/2025 ",null,null,"Produção da equipe ",230.19,{"$f":"VLOOKUP(A255,ORÇAMENTO!$A$10:$L$44,7,1)","v":"M3"}]
[null,5502140,"ESCAVAÇÃO, CARGA E TRANSPORTE DE MATERIAL DE 1ª CATEGORIA - DMT 1.000 A 1.200M, CAMINHO DE SERVIÇO EM REVESTIMENTO PRIMÁRIO",{"$nulls":5},"Valores em reais (R$)"]
[null,"A - EQUIPAMENTOS",null,"Quantidade","Utilização",null,"Custo Horário",null,null,"Custo"]
[{"$nulls":4},"Operativa","Improdutiva","Produtivo","Improdutivo",null,"Horário Total"]
[null,"E9667","Caminhão basculante com capacidade de 14 m³ - 210 kW",4,0.97,0.03,309.83940000000001,90.412199999999999,null,{"$f":"D262*(E262*G262+F262*H262)","v":1213.0263359999999}]
[null,"E9515","Escavadeira hidráulica sobre esteiras com caçamba com capacidade de 1,56 m³ - 118 kW",1,1,0,287.62189999999998,129.0472,null,{"$f":"D263*(E263*G263+F263*H263)","v":287.62189999999998}]
[{"$nulls":7},"Custo horário total de equipamentos",null,{"$f":"SUM(J262:J263)","v":1500.648236}]
[null,"B - MÃO DE OBRA",null,"Quantidade","Unidade",null,"Custo Horário","Custo Horário Total"]
[null,"P9824","Servente",1,"h",null,21.3355,null,null,{"$f":"D266*G266","v":21.3355}]
[{"$nulls":9},{"$f":"D267*G267","v":0}]
[null,null,null,"Custo horário total de mão de obra",{"$nulls":5},{"$f":"SUM(J266:J267)","v":21.3355}]
[null,null,null,"Custo horário total de execução",{"$nulls":5},{"$f":"J264+J268","v":1521.9837359999999}]
[null,null,null,"Custo unitário de execução",{"$nulls":5},{"$f":"J269/I258","v":6.6118586211390591}]
[{"$nulls":7},"Custo do FIC",null,0.1313]
[{"$nulls":7},"Custo do FIT",null,0]
[null,"C - MATERIAL",null,"Quantidade","Unidade",null,"Preço Unitário","Custo Unitário"]
[null,"-",0,null,0,null,0,null,null,{"$f":"D274*G274","v":0}]
[null,"-",0,null,0,null,0,null,null,{"$f":"D275*G275","v":0}]
[null,null,null,"Custo unitário total de material",{"$nulls":5},{"$f":"SUM(J274:J275)","v":0}]
[null,"D - ATIVIDADES AUXILIARES",null,"Quantidade","Unidade",null,"Custo Unitário","Custo Unitário"]
[null,"-",0,0,0,null,0,null,null,{"$f":"D278*G278","v":0}]
[null,"-",0,0,0,null,0,null,null,{"$f":"D279*G279","v":0}]
[null,null,null,"Custo total de atividades auxiliares",{"$nulls":5},{"$f":"SUM(J278:J279)","v":0}]
[{"$nulls":7},"Subtotal",null,{"$f":"J270+J276+J280+J271+J272","v":6.7431586211390595}]
[null,"E - TEMPO FIXO",null,"Código","Quantidade","Unidade",null,"Custo Unitário","Custo Unitário"]
[null,"-",0,"-",0,"t",null,0,null,{"$f":"ROUNDDOWN(E283*H283,4)","v":0}]
[null,"-",0,"-",0,"t",null,0,null,{"$f":"ROUNDDOWN(E284*H284,4)","v":0}]
[null,null,null,"Custo unitário total de tempo fixo",{"$nulls":5},{"$f":"SUM(J283:J284)","v":0}]
[null,"F - MOMENTO DE TRANSPORTE",null,"Quantidade","Unidade","DMT",null,null,null,"Custo Unitário"]
[{"$nulls":5},"LN","RP","P"]
[null,"-",0,null,"tkm","5914449","5914464","5914479"]
[null,"-",0,null,"tkm","5914449","5914464","5914479"]
[null,null,null,"Custo unitário total de transporte"]
[{"$nulls":5},"Custo unitário direto total",null,null,null,{"$f":"TRUNC(J281+J285,2)","v":6.74}]
[null,"Obs."]
[]
[9,"1ª/GRD",{"$nulls":8},{"$f":"J334","v":1.1499999999999999}]
[null,"OBRA:"," PAVIMENTAÇÃO ASFÁLTICA EM CBUQ - VIAS URBANAS DIVERSAS (ÁGUAS VERMELHAS / MG)"]
[null,"Custo Unitário de Referência",null,null,"Minas Gerais"]
[{"$nulls":4}," Janeiro/2025 ",null,null,"Produção da equipe ",1121.33,{"$f":"VLOOKUP(A294,ORÇAMENTO!$A$10:$L$44,7,1)","v":"M2"}]
[null,4011209,"REGULARIZAÇÃO E COMPACTAÇÃO DO SUBLEITO ",{"$nulls":5},"Valores em reais (R$)"]
[null,"A - EQUIPAMENTOS",null,"Quantidade","Utilização",null,"Custo Horário",null,null,"Custo"]
[{"$nulls":4},"Operativa","Improdutiva","Produtivo","Improdutivo",null,"Horário Total"]
[null,"E9571","Caminhão tanque com capacidade de 10.000 l - 188 kW",2,0.51,0.49,323.59019999999998,80.173299999999998,null,{"$f":"D301*(E301*G301+F301*H301)","v":408.63183800000002}]
[null,"E9518","Grade de 24 discos rebocável de D = 60 cm (24\")",1,0.69,0.31,4.9436,3.4426000000000001,null,{"$f":"D302*(E302*G302+F302*H302)","v":4.4782899999999994}]
[null,"E9524","Motoniveladora - 93 kW",1,0.71,0.28999999999999998,288.51479999999998,125.7629,null,241.31674899999996]
[null,"E9762","Rolo compactador de pneus autopropelido de 27 t - 85 kW",1,0.96,0.04,255.65049999999999,124.5621,null,250.40696399999999]
[null,"E9685","Rolo compactador pé de carneiro vibratório autopropelido por pneus de 11,6 t - 82 kW",1,1,0,225.9264,101.55289999999999,null,225.9264]
[null,"E9577","Trator agrícola sobre pneus - 77 kW",1,0.69,0.31,152.69229999999999,55.394399999999997,null,122.52995099999998]
[{"$nulls":7},"Custo horário total de equipamentos",null,{"$f":"SUM(J301:J306)","v":1253.2901919999999}]
[null,"B - MÃO DE OBRA",null,"Quantidade","Unidade",null,"Custo Horário","Custo Horário Total"]
[null,"P9824","Servente",1,"h",null,21.3355,null,null,{"$f":"D309*G309","v":21.3355}]
[null,"-",null,0,0,null,0,null,null,{"$f":"D310*G310","v":0}]
[null,null,null,"Custo horário total de mão de obra",{"$nulls":5},{"$f":"SUM(J309:J310)","v":21.3355}]
[null,null,null,"Custo horário total de execução",{"$nulls":5},{"$f":"J307+J311","v":1274.6256919999998}]
[null,null,null,"Custo unitário de execução",{"$nulls":5},{"$f":"J312/I297","v":1.1367088118573478}]
[{"$nulls":7},"Custo do FIC",null,2.2700000000000001E-2]
[{"$nulls":7},"Custo do FIT",null,0]
[null,"C - MATERIAL",null,"Quantidade","Unidade",null,"Preço Unitário","Custo Unitário"]
[null,"-",0,null,0,null,0,null,null,{"$f":"D317*G317","v":0}]
[null,"-",0,null,0,null,0,null,null,{"$f":"D318*G318","v":0}]
[null,null,null,"Custo unitário total de material",{"$nulls":5},{"$f":"SUM(J317:J318)","v":0}]
[null,"D - ATIVIDADES AUXILIARES",null,"Quantidade","Unidade",null,"Custo Unitário","Custo Unitário"]
[null,"-",0,0,0,null,0,null,null,{"$f":"D321*G321","v":0}]
[null,"-",0,0,0,null,0,null,null,{"$f":"D322*G322","v":0}]
[null,null,null,"Custo total de atividades auxiliares",{"$nulls":5},{"$f":"SUM(J321:J322)","v":0}]
[{"$nulls":7},"Subtotal",null,{"$f":"J313+J319+J323+J314+J315","v":1.1594088118573478}]
[null,"E - TEMPO FIXO",null,"Código","Quantidade","Unidade",null,"Custo Unitário","Custo Unitário"]
[null,"-",0,"-",0,"t",null,0,null,{"$f":"ROUNDDOWN(E326*H326,4)","v":0}]
[null,"-",0,"-",0,"t",null,0,null,{"$f":"ROUNDDOWN(E327*H327,4)","v":0}]
[null,null,null,"Custo unitário total de tempo fixo",{"$nulls":5},{"$f":"SUM(J326:J327)","v":0}]
[null,"F - MOMENTO DE TRANSPORTE",null,"Quantidade","Unidade","DMT",null,null,null,"Custo Unitário"]
[{"$nulls":5},"LN","RP","P"]
[null,"-",0,null,"tkm","5914449","5914464","5914479"]
[null,"-",0,null,"tkm","5914449","5914464","5914479"]
[null,null,null,"Custo unitário total de transporte"]
[{"$nulls":5},"Custo unitário direto total",null,null,null,{"$f":"TRUNC(J324+J328,2)","v":1.1499999999999999}]
[null,"Obs."]
[]
[{"$f":"A294+1","v":10},"1ª/GRD",{"$nulls":8},{"$f":"J377","v":14.78}]
[null,"OBRA:"," PAVIMENTAÇÃO ASFÁLTICA EM CBUQ - VIAS URBANAS DIVERSAS (ÁGUAS VERMELHAS / MG)"]
[null,"Custo Unitário de Referência",null,null,"Minas Gerais"]
[{"$nulls":4}," Janeiro/2025 ",null,null,"Produção da equipe ",112.13,{"$f":"VLOOKUP(A337,ORÇAMENTO!$A$10:$L$44,7,1)","v":"M3"}]
[null,4011219,"EXECUÇÃO E COMPACTAÇÃO DE BASE E OU SUB BASE PARA PAVIMENTAÇÃO COM SOLO ESTABILIZADO GRANULOMETRICAMENTE SEM MISTURA, COM MATERIAL DE JAZIDA - EXCLUSIVE TRANSPORTE",{"$nulls":5},"Valores em reais (R$)"]
[null,"A - EQUIPAMENTOS",null,"Quantidade","Utilização",null,"Custo Horário",null,null,"Custo"]
[{"$nulls":4},"Operativa","Improdutiva","Produtivo","Improdutivo",null,"Horário Total"]
[null,"E9571","Caminhão tanque com capacidade de 10.000 l - 188 kW",1,0.62,0.38,323.59019999999998,80.173299999999998,null,{"$f":"D344*(E344*G344+F344*H344)","v":231.09177800000001}]
[null,"E9518","Grade de 24 discos rebocável de D = 60 cm (24\")",1,0.34,0.65999999999999992,4.9436,3.4426000000000001,null,{"$f":"D345*(E345*G345+F345*H345)","v":3.9529399999999999}]
[null,"E9524","Motoniveladora - 93 kW",1,0.5,0.5,288.51479999999998,125.7629,null,207.13884999999999]
[null,"E9762","Rolo compactador de pneus autopropelido de 27 t - 85 kW",1,0.96,4.0000000000000036E-2,255.65049999999999,124.5621,null,250.40696399999999]
[null,"E9685","Rolo compactador pé de carneiro vibratório autopropelido por pneus de 11,6 t - 82 kW",1,1,0,225.9264,101.55289999999999,null,225.9264]
[null,"E9577","Trator agrícola sobre pneus - 77 kW",1,0.34,0.65999999999999992,152.69229999999999,55.394399999999997,null,{"$f":"D349*(E349*G349+F349*H349)","v":88.475685999999996}]
[{"$nulls":7},"Custo horário total de equipamentos",null,{"$f":"SUM(J344:J349)","v":1006.992618}]
[null,"B - MÃO DE OBRA",null,"Quantidade","Unidade",null,"Custo Horário","Custo Horário Total"]
[null,"P9824","Servente",1,"h",null,21.3355,null,null,{"$f":"D352*G352","v":21.3355}]
[null,"-",0,0,0,null,0,null,null,{"$f":"D353*G353","v":0}]
[null,null,null,"Custo horário total de mão de obra",{"$nulls":5},{"$f":"SUM(J352:J353)","v":21.3355}]
[null,null,null,"Custo horário total de execução",{"$nulls":5},{"$f":"J350+J354","v":1028.3281179999999}]
[null,null,null,"Custo unitário de execução",{"$nulls":5},{"$f":"J355/I340","v":9.1708563096405946}]
[{"$nulls":7},"Custo do FIC",null,0.18740000000000001]
[{"$nulls":7},"Custo do FIT",null,0]
[null,"C - MATERIAL",null,"Quantidade","Unidade",null,"Preço Unitário","Custo Unitário"]
[null,"-",0,null,0,null,0,null,null,{"$f":"D360*G360","v":0}]
[null,"-",0,null,0,null,0,null,null,{"$f":"D361*G361","v":0}]
[null,null,null,"Custo unitário total de material",{"$nulls":5},{"$f":"SUM(J360:J361)","v":0}]
[null,"D - ATIVIDADES AUXILIARES",null,"Quantidade","Unidade",null,"Custo Unitário","Custo Unitário"]
[null,4016096,"Escavação e carga de material de jazida com escavadeira hidráulica de 1,56 m³",1.1002700000000001,"m³",null,1.37,null,null,{"$f":"D364*G364","v":1.5073699000000003}]
[null,"-",0,0,0,null,0,null,null,{"$f":"D365*G365","v":0}]
[null,null,null,"Custo total de atividades auxiliares",{"$nulls":5},{"$f":"SUM(J364:J365)","v":1.5073699000000003}]
[{"$nulls":7},"Subtotal",null,{"$f":"J356+J362+J366+J357+J358","v":10.865626209640595}]
[null,"E - TEMPO FIXO",null,"Código","Quantidade","Unidade",null,"Custo Unitário","Custo Unitário"]
[null,4016096,"Escavação e carga de material de jazida com escavadeira hidráulica de 1,56 m³",5914354,2.0630099999999998,"t",null,1.9,null,{"$f":"ROUNDDOWN(E369*H369,4)","v":3.9197000000000002}]
[null,"-",0,"-",null,"t",null,0,null,{"$f":"ROUNDDOWN(E370*H370,4)","v":0}]
[null,null,null,"Custo unitário total de tempo fixo",{"$nulls":5},{"$f":"SUM(J369:J370)","v":3.9197000000000002}]
[null,"F - MOMENTO DE TRANSPORTE",null,"Quantidade","Unidade","DMT",null,null,null,"Custo Unitário"]
[{"$nulls":5},"LN","RP","P"]
[null,4016096,"Escavação e carga de material de jazida com escavadeira hidráulica de 1,56 m³",2.0630099999999998,"tkm","5914359","5914374","5914389"]
[null,"-",0,0,"tkm"]
[null,null,null,"Custo unitário total de transporte"]
[{"$nulls":5},"Custo unitário direto total",null,null,null,{"$f":"TRUNC(J367+J371,2)","v":14.78}]
[null,"Obs."]
[]
[12,"1ª/GRD",{"$nulls":8},{"$f":"J416","v":0.4}]
[null,"OBRA:"," PAVIMENTAÇÃO ASFÁLTICA EM CBUQ - VIAS URBANAS DIVERSAS (ÁGUAS VERMELHAS / MG)"]
[null,"Custo Unitário de Referência",null,null,"Minas Gerais"]
[{"$nulls":4}," Janeiro/2025 ",null,null,"Produção da equipe ",1038.46,{"$f":"VLOOKUP(A380,ORÇAMENTO!$A$10:$L$44,7,1)","v":"M2"}]
[null,4011352,"IMPRIMAÇÃO COM EMULSÃO ASFÁLTICA (EAI)",{"$nulls":5},"Valores em reais (R$)"]
[null,"A - EQUIPAMENTOS",null,"Quantidade","Utilização",null,"Custo Horário",null,null,"Custo"]
[{"$nulls":4},"Operativa","Improdutiva","Produtivo","Improdutivo",null,"Horário Total"]
[null,"E9509","Caminhão tanque distribuidor de asfalto com capacidade de 6.000 l - 7 kW/136 kW",1,1,0,261.03050000000002,72.388300000000001,null,{"$f":"D387*(E387*G387+F387*H387)","v":261.03050000000002}]
[null,"E9558","Tanque de estocagem de asfalto com capacidade de 30.000 l",2,1,0,56.138500000000001,38.346699999999998,null,{"$f":"D388*(E388*G388+F388*H388)","v":112.277}]
[{"$nulls":7},"Custo horário total de equipamentos",null,{"$f":"SUM(J387:J388)","v":373.3075}]
[null,"B - MÃO DE OBRA",null,"Quantidade","Unidade",null,"Custo Horário","Custo Horário Total"]
[null,"P9824","Servente",2,"h",null,21.3355,null,null,{"$f":"D391*G391","v":42.670999999999999}]
[null,"-",{"$nulls":7},{"$f":"D392*G392","v":0}]
[null,null,null,"Custo horário total de mão de obra",{"$nulls":5},{"$f":"SUM(J391:J392)","v":42.670999999999999}]
[null,null,null,"Custo horário total de execução",{"$nulls":5},{"$f":"J389+J393","v":415.9785}]
[null,null,null,"Custo unitário de execução",{"$nulls":5},{"$f":"J394/I383","v":0.40057248232960341}]
[{"$nulls":7},"Custo do FIC",null,1.4E-3]
[{"$nulls":7},"Custo do FIT",null,0]
[null,"C - MATERIAL",null,"Quantidade","Unidade",null,"Preço Unitário","Custo Unitário"]
[null,"M2092","Emulsão asfáltica para imprimação",1.2999999999999999E-3,"t",null,0,"FORNECIMENTO COM BDI DIFERENCIADO",null,{"$f":"D399*G399","v":0}]
[null,"-",0,89.28,0,null,0,null,null,{"$f":"D400*G400","v":0}]
[null,null,null,"Custo unitário total de material",{"$nulls":5},{"$f":"SUM(J399:J400)","v":0}]
[null,"D - ATIVIDADES AUXILIARES",null,"Quantidade","Unidade",null,"Custo Unitário","Custo Unitário"]
[null,"-",0,0,0,null,0,null,null,{"$f":"D403*G403","v":0}]
[null,"-",0,0,0,null,0,null,null,{"$f":"D404*G404","v":0}]
[null,null,null,"Custo total de atividades auxiliares",{"$nulls":5},{"$f":"SUM(J403:J404)","v":0}]
[{"$nulls":7},"Subtotal",null,{"$f":"J395+J401+J405+J396+J397","v":0.40197248232960342}]
[null,"E - TEMPO FIXO",null,"Código","Quantidade","Unidade",null,"Custo Unitário","Custo Unitário"]
[null,"-",0,"-",0,"t",null,0,null,{"$f":"ROUNDDOWN(E408*H408,4)","v":0}]
[null,"-",0,"-",0,"t",null,0,null,{"$f":"ROUNDDOWN(E409*H409,4)","v":0}]
[null,null,null,"Custo unitário total de tempo fixo",{"$nulls":5},{"$f":"SUM(J408:J409)","v":0}]
[null,"F - MOMENTO DE TRANSPORTE",null,"Quantidade","Unidade","DMT",null,null,null,"Custo Unitário"]
[{"$nulls":5},"LN","RP","P"]
[null,"-",0,null,"tkm"]
[null,"-",0,null,"tkm"]
[null,null,null,"Custo unitário total de transporte"]
[{"$nulls":5},"Custo unitário direto total",null,null,null,{"$f":"TRUNC(J406+J410,2)","v":0.4}]
[null,"Obs."]
[]
[{"$f":"A380+1","v":13},"1ª/GRD",{"$nulls":8},{"$f":"J455","v":0.27}]
[null,"OBRA:"," PAVIMENTAÇÃO ASFÁLTICA EM CBUQ - VIAS URBANAS DIVERSAS (ÁGUAS VERMELHAS / MG)"]
[null,"Custo Unitário de Referência",null,null,"Minas Gerais"]
[{"$nulls":4}," Janeiro/2025 ",null,null,"Produção da equipe ",1500,{"$f":"VLOOKUP(A419,ORÇAMENTO!$A$10:$L$44,7,1)","v":"M2"}]
[null,4011353,"PINTURA DE LIGAÇÃO COM EMULSÃO ASFÁLTICA RR-1C",{"$nulls":5},"Valores em reais (R$)"]
[null,"A - EQUIPAMENTOS",null,"Quantidade","Utilização",null,"Custo Horário",null,null,"Custo"]
[{"$nulls":4},"Operativa","Improdutiva","Produtivo","Improdutivo",null,"Horário Total"]
[null,"E9509","Caminhão tanque distribuidor de asfalto com capacidade de 6.000 l - 7 kW/136 kW",1,1,0,261.03050000000002,72.388300000000001,null,{"$f":"D426*(E426*G426+F426*H426)","v":261.03050000000002}]
[null,"E9558","Tanque de estocagem de asfalto com capacidade de 30.000 l",2,1,0,56.138500000000001,38.346699999999998,null,{"$f":"D427*(E427*G427+F427*H427)","v":112.277}]
[{"$nulls":7},"Custo horário total de equipamentos",null,{"$f":"SUM(J426:J427)","v":373.3075}]
[null,"B - MÃO DE OBRA",null,"Quantidade","Unidade",null,"Custo Horário","Custo Horário Total"]
[null,"P9824","Servente",2,"h",null,21.3355,null,null,{"$f":"D430*G430","v":42.670999999999999}]
[null,"-",{"$nulls":7},{"$f":"D431*G431","v":0}]
[null,null,null,"Custo horário total de mão de obra",{"$nulls":5},{"$f":"SUM(J430:J431)","v":42.670999999999999}]
[null,null,null,"Custo horário total de execução",{"$nulls":5},{"$f":"J428+J432","v":415.9785}]
[null,null,null,"Custo unitário de execução",{"$nulls":5},{"$f":"J433/I422","v":0.27731899999999998}]
[{"$nulls":7},"Custo do FIC",null,8.9999999999999998E-4]
[{"$nulls":7},"Custo do FIT",null,0]
[null,"C - MATERIAL",null,"Quantidade","Unidade",null,"Preço Unitário","Custo Unitário"]
[null,"M1946","Emulsão asfáltica - RR-1C",4.4999999999999999E-4,"t",null,0,"FORNECIMENTO COM BDI DIFERENCIADO",null,{"$f":"D438*G438","v":0}]
[null,"-",0,null,0,null,0,null,null,{"$f":"D439*G439","v":0}]
[null,null,null,"Custo unitário total de material",{"$nulls":5},{"$f":"SUM(J438:J439)","v":0}]
[null,"D - ATIVIDADES AUXILIARES",null,"Quantidade","Unidade",null,"Custo Unitário","Custo Unitário"]
[null,"-",0,0,0,null,0,null,null,{"$f":"D442*G442","v":0}]
[null,"-",0,0,0,null,0,null,null,{"$f":"D443*G443","v":0}]
[null,null,null,"Custo total de atividades auxiliares",{"$nulls":5},{"$f":"SUM(J442:J443)","v":0}]
[{"$nulls":7},"Subtotal",null,{"$f":"J434+J440+J444+J435+J436","v":0.27821899999999999}]
[null,"E - TEMPO FIXO",null,"Código","Quantidade","Unidade",null,"Custo Unitário","Custo Unitário"]
[null,"-",0,"-",0,"t",null,0,null,{"$f":"ROUNDDOWN(E447*H447,4)","v":0}]
[null,"-",0,"-",0,"t",null,0,null,{"$f":"ROUNDDOWN(E448*H448,4)","v":0}]
[null,null,null,"Custo unitário total de tempo fixo",{"$nulls":5},{"$f":"SUM(J447:J448)","v":0}]
[null,"F - MOMENTO DE TRANSPORTE",null,"Quantidade","Unidade","DMT",null,null,null,"Custo Unitário"]
[{"$nulls":5},"LN","RP","P"]
[null,"-",0,null,"tkm"]
[null,"-",0,null,"tkm"]
[null,null,null,"Custo unitário total de transporte"]
[{"$nulls":5},"Custo unitário direto total",null,null,null,{"$f":"TRUNC(J445+J449,2)","v":0.27}]
[null,"Obs."]
[]
[{"$f":"A419+1","v":14},"1ª/GRD",{"$nulls":8},{"$f":"J495","v":151.16999999999999}]
[null,"OBRA:"," PAVIMENTAÇÃO ASFÁLTICA EM CBUQ - VIAS URBANAS DIVERSAS (ÁGUAS VERMELHAS / MG)"]
[null,"Custo Unitário de Referência",null,null,"Minas Gerais"]
[{"$nulls":4}," Janeiro/2025 ",null,null,"Produção da equipe ",99.6,{"$f":"VLOOKUP(A458,ORÇAMENTO!$A$10:$L$44,7,1)","v":"T"}]
[null,4011463,"EXECUÇÃO DE PAVIMENTO COM APLICAÇÃO DE CONCRETO ASFÁLTICO USINADO A QUENTE (CBUQ), CAMADA DE ROLAMENTO - EXCLUSIVE TRANSPORTE",{"$nulls":5},"Valores em reais (R$)"]
[null,"A - EQUIPAMENTOS",null,"Quantidade","Utilização",null,"Custo Horário",null,null,"Custo"]
[{"$nulls":4},"Operativa","Improdutiva","Produtivo","Improdutivo",null,"Horário Total"]
[null,"E9762","Rolo compactador de pneus autopropelido de 27 t - 85 kW",1,0.71,0.28999999999999998,255.65049999999999,124.5621,null,{"$f":"D465*(E465*G465+F465*H465)","v":217.63486399999999}]
[null,"E9681","Rolo compactador liso tandem vibratório autopropelido de 10,4 t - 82 kW",1,0.82,0.18,296.77460000000002,113.3899,null,{"$f":"D466*(E466*G466+F466*H466)","v":263.765354}]
[null,"E9545","Vibroacabadora de asfalto sobre esteiras - 97 kW",1,1,0,359.27379999999999,154.22659999999999,null,{"$f":"D467*(E467*G467+F467*H467)","v":359.27379999999999}]
[{"$nulls":7},"Custo horário total de equipamentos",null,{"$f":"SUM(J465:J467)","v":840.67401799999993}]
[null,"B - MÃO DE OBRA",null,"Quantidade","Unidade",null,"Custo Horário","Custo Horário Total"]
[null,"P9824","Servente",8,"h",null,21.3355,null,null,{"$f":"D470*G470","v":170.684}]
[null,"-",0,null,0,null,0,null,null,{"$f":"D471*G471","v":0}]
[null,null,null,"Custo horário total de mão de obra",{"$nulls":5},{"$f":"SUM(J470:J471)","v":170.684}]
[null,null,null,"Custo horário total de execução",{"$nulls":5},{"$f":"J468+J472","v":1011.3580179999999}]
[null,null,null,"Custo unitário de execução",{"$nulls":5},{"$f":"J473/I461","v":10.154196967871485}]
[{"$nulls":7},"Custo do FIC",null,3.4500000000000003E-2]
[{"$nulls":7},"Custo do FIT",null,0]
[null,"C - MATERIAL",null,"Quantidade","Unidade",null,"Preço Unitário","Custo Unitário"]
[null,"-",0,null,0,null,0,null,null,{"$f":"D478*G478","v":0}]
[null,"-",0,null,0,null,0,null,null,{"$f":"D479*G479","v":0}]
[null,null,null,"Custo unitário total de material",{"$nulls":5},{"$f":"SUM(J478:J479)","v":0}]
[null,"D - ATIVIDADES AUXILIARES",null,"Quantidade","Unidade",null,"Custo Unitário","Custo Unitário"]
[null,6416078,"Usinagem de concreto asfáltico - faixa C-12,5 - areia e brita comerciais",1,"t",null,132.93533409076304,null,null,{"$f":"D482*G482","v":132.93533409076304}]
[null,"-",0,0,0,null,0,null,null,{"$f":"D483*G483","v":0}]
[null,null,null,"Custo total de atividades auxiliares",{"$nulls":5},{"$f":"SUM(J482:J483)","v":132.93533409076304}]
[{"$nulls":7},"Subtotal",null,{"$f":"J474+J480+J484+J475+J476","v":143.12403105863453}]
[null,"E - TEMPO FIXO",null,"Código","Quantidade","Unidade",null,"Custo Unitário","Custo Unitário"]
[null,6416078,"Usinagem de concreto asfáltico - faixa C-12,5 - areia e brita comerciais",5914649,1,"t",null,8.0500000000000007,null,{"$f":"ROUNDDOWN(E487*H487,4)","v":8.0500000000000007}]
[null,"-",0,"-",0,"t",null,0,null,{"$f":"ROUNDDOWN(E488*H488,4)","v":0}]
[null,null,null,"Custo unitário total de tempo fixo",{"$nulls":5},{"$f":"SUM(J487:J488)","v":8.0500000000000007}]
[null,"F - MOMENTO DE TRANSPORTE",null,"Quantidade","Unidade","DMT",null,null,null,"Custo Unitário"]
[{"$nulls":5},"LN","RP","P"]
[null,6416078,"Usinagem de concreto asfáltico - faixa C-12,5 - areia e brita comerciais",1,"tkm"]
[null,"-",0,0,"tkm"]
[null,null,null,"Custo unitário total de transporte"]
[{"$nulls":5},"Custo unitário direto total",null,null,null,{"$f":"TRUNC(J485+J489,2)","v":151.16999999999999}]
[null,"Obs."]
[]
[null,"1ª/GRD",{"$nulls":8},{"$f":"J549","v":132.93533409076304}]
[null,"OBRA:"," PAVIMENTAÇÃO ASFÁLTICA EM CBUQ - VIAS URBANAS DIVERSAS (ÁGUAS VERMELHAS / MG)"]
[null,"Custo Unitário de Referência - Auxiliar",null,null,"Minas Gerais"]
[{"$nulls":4}," Janeiro/2025 ",null,null,"Produção da equipe ",99.6,"t"]
[null,6416078,"Usinagem de concreto asfáltico - faixa C - areia e brita comerciais",{"$nulls":5},"Valores em reais (R$)"]
[null,"A - EQUIPAMENTOS",null,"Quantidade","Utilização",null,"Custo Horário",null,null,"Custo"]
[{"$nulls":4},"Operativa","Improdutiva","Produtivo","Improdutivo",null,"Horário Total"]
[null,"E9559","Aquecedor de fluido térmico - 12 kW",1,1,0,70.491399999999999,40.1297,null,{"$f":"D505*(E505*G505+F505*H505)","v":70.491399999999999}]
[null,"E9584","Carregadeira de pneus com capacidade de 1,72 m³ - 113 kW",1,0.86,0.14000000000000001,207.59360000000001,103.7398,null,{"$f":"D506*(E506*G506+F506*H506)","v":193.054068}]
[null,"E9021","Grupo gerador - 456 kVA",1,1,0,415.94510000000002,22.186399999999999,null,415.94510000000002]
[null,"E9558","Tanque de estocagem de asfalto com capacidade de 30.000 l",2,1,0,56.138500000000001,38.346699999999998,null,112.277]
[null,"E9689","Usina de asfalto a quente gravimétrica com capacidade de 100/140 t/h - 260 kW",1,1,0,1239.9634000000001,657.78120000000001,null,{"$f":"D509*(E509*G509+F509*H509)","v":1239.9634000000001}]
[{"$nulls":7},"Custo horário total de equipamentos",null,{"$f":"SUM(J505:J509)","v":2031.7309680000003}]
[null,"B - MÃO DE OBRA",null,"Quantidade","Unidade",null,"Custo Horário","Custo Horário Total"]
[null,"P9824","Servente",4,"h",null,21.3355,null,null,{"$f":"D512*G512","v":85.341999999999999}]
[null,null,null,"Custo horário total de mão de obra",{"$nulls":5},{"$f":"SUM(J512:J512)","v":85.341999999999999}]
[null,null,null,"Custo horário total de execução",{"$nulls":5},{"$f":"J510+J513","v":2117.0729680000004}]
[null,null,null,"Custo unitário de execução",{"$nulls":5},{"$f":"J514/I501","v":21.255752690763057}]
[{"$nulls":7},"Custo do FIC",null,0]
[{"$nulls":7},"Custo do FIT",null,0]
[null,"C - MATERIAL",null,"Quantidade","Unidade",null,"Preço Unitário","Custo Unitário"]
[null,"M0028","Areia média",2.7009999999999999E-2,"m³",null,84,null,null,{"$f":"D519*G519","v":2.26884}]
[null,"M0005","Brita 0",9.0029999999999999E-2,"m³",null,120,null,null,{"$f":"D520*G520","v":10.803599999999999}]
[null,"M0191","Brita 1",3.2149999999999998E-2,"m³",null,114,null,null,3.6650999999999998]
[null,"M0344","Cal hidratada - a granel",14.4636,"kg",null,0.61650000000000005,null,null,8.9168094]
[null,"M1943","Cimento asfáltico de petróleo - CAP 50/70",5.5449999999999999E-2,"t",null,0,"FORNECIMENTO COM BDI DIFERENCIADO",null,0]
[null,"M1941","Óleo tipo A1",8,"l",null,6.3849,null,null,51.0792]
[null,"M1103","Pedrisco",0.1479,"m³",null,70,null,null,10.353]
[null,"M1135","Pó de pedra",0.33631,"m³",null,67.2,null,null,22.600032000000002]
[null,null,null,"Custo unitário total de material",{"$nulls":5},{"$f":"SUM(J519:J526)","v":109.68658139999999}]
[null,"D - ATIVIDADES AUXILIARES",null,"Quantidade","Unidade",null,"Custo Unitário","Custo Unitário"]
[null,"-",0,0,0,null,0,null,null,{"$f":"D529*G529","v":0}]
[null,null,null,"Custo total de atividades auxiliares",{"$nulls":5},{"$f":"SUM(J529:J529)","v":0}]
[{"$nulls":7},"Subtotal",null,{"$f":"J515+J527+J530+J516+J517","v":130.94233409076304}]
[null,"E - TEMPO FIXO",null,"Código","Quantidade","Unidade",null,"Custo Unitário","Custo Unitário"]
[null,"M0028","Areia média",5914647,4.052E-2,"t",null,1.83,null,{"$f":"ROUNDDOWN(E533*H533,4)","v":7.4099999999999999E-2}]
[null,"M0005","Brita 0",5914647,0.13505,"t",null,1.83,null,0.24709999999999999]
[null,"M0191","Brita 1",5914647,4.8230000000000002E-2,"t",null,1.83,null,8.8200000000000001E-2]
[null,"M0344","Cal hidratada - a granel",5914363,1.4460000000000001E-2,"t",null,17.61,null,0.25459999999999999]
[null,"M1103","Pedrisco",5914647,0.22184999999999999,"t",null,1.83,null,{"$f":"ROUNDDOWN(E537*H537,4)","v":0.40589999999999998}]
[null,"M1135","Pó de pedra",5914647,0.50446999999999997,"t",null,1.83,null,{"$f":"ROUNDDOWN(E538*H538,4)","v":0.92310000000000003}]
[null,null,null,"Custo unitário total de tempo fixo",{"$nulls":5},{"$f":"SUM(J533:J538)","v":1.9929999999999999}]
[null,"F - MOMENTO DE TRANSPORTE",null,"Quantidade","Unidade","DMT",null,null,null,"Custo Unitário"]
[{"$nulls":5},"LN","RP","P"]
[null,"M0028","Areia média",4.052E-2,"tkm"]
[null,"M0005","Brita 0",0.13505,"tkm"]
[null,"M0191","Brita 1",4.8230000000000002E-2,"tkm"]
[null,"M0344","Cal hidratada - a granel",1.4460000000000001E-2,"tkm"]
[null,"M1103","Pedrisco",0.22184999999999999,"tkm"]
[null,"M1135","Pó de pedra",0.50446999999999997,"tkm"]
[null,null,null,"Custo unitário total de transporte"]
[{"$nulls":5},"Custo unitário direto total",null,null,null,{"$f":"J531+J539","v":132.93533409076304}]
[null,"Obs."]
[]
[{"$f":"A458+1","v":15},"1ª/GRD",{"$nulls":8},{"$f":"J588","v":0.65}]
[null,"OBRA:"," PAVIMENTAÇÃO ASFÁLTICA EM CBUQ - VIAS URBANAS DIVERSAS (ÁGUAS VERMELHAS / MG)"]
[null,"Custo Unitário de Referência",null,null,"Minas Gerais"]
[{"$nulls":4}," Janeiro/2025 ",null,null,"Produção da equipe ",470.61,{"$f":"VLOOKUP(A552,ORÇAMENTO!$A$10:$L$44,7,1)","v":"TXKM"}]
[null,5915321,"TRANSPORTE COM CAMINHÃO BASCULANTE, EM RODOVIA PAVIMENTADA",{"$nulls":5},"Valores em reais (R$)"]
[null,"A - EQUIPAMENTOS",null,"Quantidade","Utilização",null,"Custo Horário",null,null,"Custo"]
[{"$nulls":4},"Operativa","Improdutiva","Produtivo","Improdutivo",null,"Horário Total"]
[null,"E9667","Caminhão basculante com capacidade de 14 m³ - 210 kW",1,1,0,309.83940000000001,90.412199999999999,null,{"$f":"D559*(E559*G559+F559*H559)","v":309.83940000000001}]
[null,"-",0,null,null,null,0,0,null,{"$f":"D560*(E560*G560+F560*H560)","v":0}]
[{"$nulls":7},"Custo horário total de equipamentos",null,{"$f":"SUM(J559:J560)","v":309.83940000000001}]
[null,"B - MÃO DE OBRA",null,"Quantidade","Unidade",null,"Custo Horário","Custo Horário Total"]
[null,"-",0,null,0,null,0,null,null,{"$f":"D563*G563","v":0}]
[null,"-",0,null,0,null,0,null,null,{"$f":"D564*G564","v":0}]
[null,null,null,"Custo horário total de mão de obra",{"$nulls":5},{"$f":"SUM(J563:J564)","v":0}]
[null,null,null,"Custo horário total de execução",{"$nulls":5},{"$f":"J561+J565","v":309.83940000000001}]
[null,null,null,"Custo unitário de execução",{"$nulls":5},{"$f":"J566/I555","v":0.65837827500478108}]
[{"$nulls":7},"Custo do FIC",null,0]
[{"$nulls":7},"Custo do FIT",null,0]
[null,"C - MATERIAL",null,"Quantidade","Unidade",null,"Preço Unitário","Custo Unitário"]
[null,"-",0,0,0,null,0,null,null,{"$f":"D571*G571","v":0}]
[null,"-",0,0,0,null,0,null,null,{"$f":"D572*G572","v":0}]
[null,null,null,"Custo unitário total de material",{"$nulls":5},{"$f":"SUM(J571:J572)","v":0}]
[null,"D - ATIVIDADES AUXILIARES",null,"Quantidade","Unidade",null,"Custo Unitário","Custo Unitário"]
[null,"-",0,0,0,null,0,null,null,{"$f":"D575*G575","v":0}]
[null,"-",0,0,0,null,0,null,null,{"$f":"D576*G576","v":0}]
[null,null,null,"Custo total de atividades auxiliares",{"$nulls":5},{"$f":"SUM(J575:J576)","v":0}]
[{"$nulls":7},"Subtotal",null,{"$f":"J567+J573+J577+J568+J569","v":0.65837827500478108}]
[null,"E - TEMPO FIXO",null,"Código","Quantidade","Unidade",null,"Custo Unitário","Custo Unitário"]
[null,"-",0,"-",0,"t",null,0,null,{"$f":"ROUNDDOWN(E580*H580,4)","v":0}]
[null,"-",0,"-",0,"t",null,0,null,{"$f":"ROUNDDOWN(E581*H581,4)","v":0}]
[null,null,null,"Custo unitário total de tempo fixo",{"$nulls":5},{"$f":"SUM(J580:J581)","v":0}]
[null,"F - MOMENTO DE TRANSPORTE",null,"Quantidade","Unidade","DMT",null,null,null,"Custo Unitário"]
[{"$nulls":5},"LN","RP","P"]
[null,"-",0,0,"tkm"]
[null,"-",0,0,"tkm"]
[null,null,null,"Custo unitário total de transporte"]
[{"$nulls":5},"Custo unitário direto total",null,null,null,{"$f":"TRUNC(J578+J582,2)","v":0.65}]
[null,"Obs."]
[]
[16,"1ª/GRD",{"$nulls":8},{"$f":"J627","v":0.72}]
[null,"OBRA:"," PAVIMENTAÇÃO ASFÁLTICA EM CBUQ - VIAS URBANAS DIVERSAS (ÁGUAS VERMELHAS / MG)"]
[null,"Custo Unitário de Referência",null,null,"Minas Gerais"]
[{"$nulls":4}," Janeiro/2025 ",null,null,"Produção da equipe ",435.75,{"$f":"VLOOKUP(A591,ORÇAMENTO!$A$10:$L$44,7,1)","v":"TXKM"}]
[null,5915320,"TRANSPORTE COM CAMINHÃO BASCULANTE, RODOVIA EM REVESTIMENTO PRIMÁRIO",{"$nulls":5},"Valores em reais (R$)"]
[null,"A - EQUIPAMENTOS",null,"Quantidade","Utilização",null,"Custo Horário",null,null,"Custo"]
[{"$nulls":4},"Operativa","Improdutiva","Produtivo","Improdutivo",null,"Horário Total"]
[null,"E9667","Caminhão basculante com capacidade de 14 m³ - 210 kW",1,1,0,309.83940000000001,90.412199999999999,null,{"$f":"D598*(E598*G598+F598*H598)","v":309.83940000000001}]
[null,"-",0,null,null,null,0,0,null,{"$f":"D599*(E599*G599+F599*H599)","v":0}]
[{"$nulls":7},"Custo horário total de equipamentos",null,{"$f":"SUM(J598:J599)","v":309.83940000000001}]
[null,"B - MÃO DE OBRA",null,"Quantidade","Unidade",null,"Custo Horário","Custo Horário Total"]
[null,"-",0,null,0,null,0,null,null,{"$f":"D602*G602","v":0}]
[null,"-",0,null,0,null,0,null,null,{"$f":"D603*G603","v":0}]
[null,null,null,"Custo horário total de mão de obra",{"$nulls":5},{"$f":"SUM(J602:J603)","v":0}]
[null,null,null,"Custo horário total de execução",{"$nulls":5},{"$f":"J600+J604","v":309.83940000000001}]
[null,null,null,"Custo unitário de execução",{"$nulls":5},{"$f":"J605/I594","v":0.71104853700516357}]
[{"$nulls":7},"Custo do FIC",null,1.4E-2]
[{"$nulls":7},"Custo do FIT",null,0]
[null,"C - MATERIAL",null,"Quantidade","Unidade",null,"Preço Unitário","Custo Unitário"]
[null,"-",0,0,0,null,0,null,null,{"$f":"D610*G610","v":0}]
[null,"-",0,0,0,null,0,null,null,{"$f":"D611*G611","v":0}]
[null,null,null,"Custo unitário total de material",{"$nulls":5},{"$f":"SUM(J610:J611)","v":0}]
[null,"D - ATIVIDADES AUXILIARES",null,"Quantidade","Unidade",null,"Custo Unitário","Custo Unitário"]
[null,"-",0,0,0,null,0,null,null,{"$f":"D614*G614","v":0}]
[null,"-",0,0,0,null,0,null,null,{"$f":"D615*G615","v":0}]
[null,null,null,"Custo total de atividades auxiliares",{"$nulls":5},{"$f":"SUM(J614:J615)","v":0}]
[{"$nulls":7},"Subtotal",null,{"$f":"J606+J612+J616+J607+J608","v":0.72504853700516358}]
[null,"E - TEMPO FIXO",null,"Código","Quantidade","Unidade",null,"Custo Unitário","Custo Unitário"]
[null,"-",0,"-",0,"t",null,0,null,{"$f":"ROUNDDOWN(E619*H619,4)","v":0}]
[null,"-",0,"-",0,"t",null,0,null,{"$f":"ROUNDDOWN(E620*H620,4)","v":0}]
[null,null,null,"Custo unitário total de tempo fixo",{"$nulls":5},{"$f":"SUM(J619:J620)","v":0}]
[null,"F - MOMENTO DE TRANSPORTE",null,"Quantidade","Unidade","DMT",null,null,null,"Custo Unitário"]
[{"$nulls":5},"LN","RP","P"]
[null,"-",0,0,"tkm"]
[null,"-",0,0,"tkm"]
[null,null,null,"Custo unitário total de transporte"]
[{"$nulls":5},"Custo unitário direto total",null,null,null,{"$f":"TRUNC(J617+J621,2)","v":0.72}]
[null,"Obs."]
[]
[{"$f":"A591+1","v":17},"1ª/GRD",{"$nulls":8},{"$f":"J666","v":0.74}]
[null,"OBRA:"," PAVIMENTAÇÃO ASFÁLTICA EM CBUQ - VIAS URBANAS DIVERSAS (ÁGUAS VERMELHAS / MG)"]
[null,"Custo Unitário de Referência",null,null,"Minas Gerais"]
[{"$nulls":4}," Janeiro/2025 ",null,null,"Produção da equipe ",241.03,{"$f":"VLOOKUP(A630,ORÇAMENTO!$A$10:$L$44,7,1)","v":"TXKM"}]
[null,5914434,"TRANSPORTE COM CAMINHÃO CARROCERIA 9T, EM VIA URBANA PAVIMENTADA",{"$nulls":5},"Valores em reais (R$)"]
[null,"A - EQUIPAMENTOS",null,"Quantidade","Utilização",null,"Custo Horário",null,null,"Custo"]
[{"$nulls":4},"Operativa","Improdutiva","Produtivo","Improdutivo",null,"Horário Total"]
[null,"E9508","Caminhão carroceria com capacidade de 9 t - 136 kW",1,1,0,178.82759999999999,67.927099999999996,null,{"$f":"D637*(E637*G637+F637*H637)","v":178.82759999999999}]
[null,"-",0,null,null,null,0,0,null,{"$f":"D638*(E638*G638+F638*H638)","v":0}]
[{"$nulls":7},"Custo horário total de equipamentos",null,{"$f":"SUM(J637:J638)","v":178.82759999999999}]
[null,"B - MÃO DE OBRA",null,"Quantidade","Unidade",null,"Custo Horário","Custo Horário Total"]
[null,"-",0,0,0,null,0,null,null,{"$f":"D641*G641","v":0}]
[null,"-",0,0,0,null,0,null,null,{"$f":"D642*G642","v":0}]
[null,null,null,"Custo horário total de mão de obra",{"$nulls":5},{"$f":"SUM(J641:J642)","v":0}]
[null,null,null,"Custo horário total de execução",{"$nulls":5},{"$f":"J639+J643","v":178.82759999999999}]
[null,null,null,"Custo unitário de execução",{"$nulls":5},{"$f":"J644/I633","v":0.7419308799734472}]
[{"$nulls":7},"Custo do FIC",null,0]
[{"$nulls":7},"Custo do FIT",null,0]
[null,"C - MATERIAL",null,"Quantidade","Unidade",null,"Preço Unitário","Custo Unitário"]
[null,"-",0,0,0,null,0,null,null,{"$f":"D649*G649","v":0}]
[null,"-",0,0,0,null,0,null,null,{"$f":"D650*G650","v":0}]
[null,null,null,"Custo unitário total de material",{"$nulls":5},{"$f":"SUM(J649:J650)","v":0}]
[null,"D - ATIVIDADES AUXILIARES",null,"Quantidade","Unidade",null,"Custo Unitário","Custo Unitário"]
[null,"-",0,0,0,null,0,null,null,{"$f":"D653*G653","v":0}]
[null,"-",0,0,0,null,0,null,null,{"$f":"D654*G654","v":0}]
[null,null,null,"Custo total de atividades auxiliares",{"$nulls":5},{"$f":"SUM(J653:J654)","v":0}]
[{"$nulls":7},"Subtotal",null,{"$f":"J645+J651+J655+J646+J647","v":0.7419308799734472}]
[null,"E - TEMPO FIXO",null,"Código","Quantidade","Unidade",null,"Custo Unitário","Custo Unitário"]
[null,"-",0,"-",0,"t",null,0,null,{"$f":"ROUNDDOWN(E658*H658,4)","v":0}]
[null,"-",0,"-",0,"t",null,0,null,{"$f":"ROUNDDOWN(E659*H659,4)","v":0}]
[null,null,null,"Custo unitário total de tempo fixo",{"$nulls":5},{"$f":"SUM(J658:J659)","v":0}]
[null,"F - MOMENTO DE TRANSPORTE",null,"Quantidade","Unidade","DMT",null,null,null,"Custo Unitário"]
[{"$nulls":5},"LN","RP","P"]
[null,"-",0,0,"tkm"]
[null,"-",0,0,"tkm"]
[null,null,null,"Custo unitário total de transporte"]
[{"$nulls":5},"Custo unitário direto total",null,null,null,{"$f":"TRUNC(J656+J660,2)","v":0.74}]
[null,"Obs."]
[]
[{"$f":"A630+1","v":18},"1ª/GRD",{"$nulls":8},{"$f":"J705","v":0.93}]
[null,"OBRA:"," PAVIMENTAÇÃO ASFÁLTICA EM CBUQ - VIAS URBANAS DIVERSAS (ÁGUAS VERMELHAS / MG)"]
[null,"Custo Unitário de Referência",null,null,"Minas Gerais"]
[{"$nulls":4}," Janeiro/2025 ",null,null,"Produção da equipe ",284.10000000000002,{"$f":"VLOOKUP(A669,ORÇAMENTO!$A$10:$L$44,7,1)","v":"TXKM"}]
[null,5914612,"TRANSPORTE DE MASSA ASFÁLTICA COM CAMINHÃO BASCULANTE COM CAÇAMBA TÉRMICA, EM VIA URBANA PAVIMENTADA",{"$nulls":5},"Valores em reais (R$)"]
[null,"A - EQUIPAMENTOS",null,"Quantidade","Utilização",null,"Custo Horário",null,null,"Custo"]
[{"$nulls":4},"Operativa","Improdutiva","Produtivo","Improdutivo",null,"Horário Total"]
[null,"E9520","Caminhão com caçamba térmica com capacidade de 6 m³ - 188 kW",1,1,0,265.74349999999998,76.6511,null,{"$f":"D676*(E676*G676+F676*H676)","v":265.74349999999998}]
[null,"-",0,null,null,null,0,0,null,{"$f":"D677*(E677*G677+F677*H677)","v":0}]
[{"$nulls":7},"Custo horário total de equipamentos",null,{"$f":"SUM(J676:J677)","v":265.74349999999998}]
[null,"B - MÃO DE OBRA",null,"Quantidade","Unidade",null,"Custo Horário","Custo Horário Total"]
[null,"-",0,0,0,null,0,null,null,{"$f":"D680*G680","v":0}]
[null,"-",0,0,0,null,0,null,null,{"$f":"D681*G681","v":0}]
[null,null,null,"Custo horário total de mão de obra",{"$nulls":5},{"$f":"SUM(J680:J681)","v":0}]
[null,null,null,"Custo horário total de execução",{"$nulls":5},{"$f":"J678+J682","v":265.74349999999998}]
[null,null,null,"Custo unitário de execução",{"$nulls":5},{"$f":"J683/I672","v":0.9353871876099964}]
[{"$nulls":7},"Custo do FIC",null,0]
[{"$nulls":7},"Custo do FIT",null,0]
[null,"C - MATERIAL",null,"Quantidade","Unidade",null,"Preço Unitário","Custo Unitário"]
[null,"-",0,0,0,null,0,null,null,{"$f":"D688*G688","v":0}]
[null,"-",0,0,0,null,0,null,null,{"$f":"D689*G689","v":0}]
[null,null,null,"Custo unitário total de material",{"$nulls":5},{"$f":"SUM(J688:J689)","v":0}]
[null,"D - ATIVIDADES AUXILIARES",null,"Quantidade","Unidade",null,"Custo Unitário","Custo Unitário"]
[null,"-",0,0,0,null,0,null,null,{"$f":"D692*G692","v":0}]
[null,"-",0,0,0,null,0,null,null,{"$f":"D693*G693","v":0}]
[null,null,null,"Custo total de atividades auxiliares",{"$nulls":5},{"$f":"SUM(J692:J693)","v":0}]
[{"$nulls":7},"Subtotal",null,{"$f":"J684+J690+J694+J685+J686","v":0.9353871876099964}]
[null,"E - TEMPO FIXO",null,"Código","Quantidade","Unidade",null,"Custo Unitário","Custo Unitário"]
[null,"-",0,"-",0,"t",null,0,null,{"$f":"ROUNDDOWN(E697*H697,4)","v":0}]
[null,"-",0,"-",0,"t",null,0,null,{"$f":"ROUNDDOWN(E698*H698,4)","v":0}]
[null,null,null,"Custo unitário total de tempo fixo",{"$nulls":5},{"$f":"SUM(J697:J698)","v":0}]
[null,"F - MOMENTO DE TRANSPORTE",null,"Quantidade","Unidade","DMT",null,null,null,"Custo Unitário"]
[{"$nulls":5},"LN","RP","P"]
[null,"-",0,0,"tkm"]
[null,"-",0,0,"tkm"]
[null,null,null,"Custo unitário total de transporte"]
[{"$nulls":5},"Custo unitário direto total",null,null,null,{"$f":"TRUNC(J695+J699,2)","v":0.93}]
[null,"Obs."]
[]
[{"$f":"A669+1","v":19},"1ª/GRD",{"$nulls":8},{"$f":"J744","v":1.1000000000000001}]
[null,"OBRA:"," PAVIMENTAÇÃO ASFÁLTICA EM CBUQ - VIAS URBANAS DIVERSAS (ÁGUAS VERMELHAS / MG)"]
[null,"Custo Unitário de Referência",null,null,"Minas Gerais"]
[{"$nulls":4}," Janeiro/2025 ",null,null,"Produção da equipe ",246.75,{"$f":"VLOOKUP(A708,ORÇAMENTO!$A$10:$L$44,7,1)","v":"TXKM"}]
[null,5914613,"TRANSPORTE DE MASSA ASFÁLTICA COM CAMINHÃO BASCULANTE COM CAÇAMBA TÉRMICA, EM VIA COM REVESTIMENTO PRIMÁRIO",{"$nulls":5},"Valores em reais (R$)"]
[null,"A - EQUIPAMENTOS",null,"Quantidade","Utilização",null,"Custo Horário",null,null,"Custo"]
[{"$nulls":4},"Operativa","Improdutiva","Produtivo","Improdutivo",null,"Horário Total"]
[null,"E9520","Caminhão com caçamba térmica com capacidade de 6 m³ - 188 kW",1,1,0,265.74349999999998,76.6511,null,{"$f":"D715*(E715*G715+F715*H715)","v":265.74349999999998}]
[null,"-",0,null,null,null,0,0,null,{"$f":"D716*(E716*G716+F716*H716)","v":0}]
[{"$nulls":7},"Custo horário total de equipamentos",null,{"$f":"SUM(J715:J716)","v":265.74349999999998}]
[null,"B - MÃO DE OBRA",null,"Quantidade","Unidade",null,"Custo Horário","Custo Horário Total"]
[null,"-",0,0,0,null,0,null,null,{"$f":"D719*G719","v":0}]
[null,"-",0,0,0,null,0,null,null,{"$f":"D720*G720","v":0}]
[null,null,null,"Custo horário total de mão de obra",{"$nulls":5},{"$f":"SUM(J719:J720)","v":0}]
[null,null,null,"Custo horário total de execução",{"$nulls":5},{"$f":"J717+J721","v":265.74349999999998}]
[null,null,null,"Custo unitário de execução",{"$nulls":5},{"$f":"J722/I711","v":1.0769746707193515}]
[{"$nulls":7},"Custo do FIC",null,2.9100000000000001E-2]
[{"$nulls":7},"Custo do FIT",null,0]
[null,"C - MATERIAL",null,"Quantidade","Unidade",null,"Preço Unitário","Custo Unitário"]
[null,"-",0,0,0,null,0,null,null,{"$f":"D727*G727","v":0}]
[null,"-",0,0,0,null,0,null,null,{"$f":"D728*G728","v":0}]
[null,null,null,"Custo unitário total de material",{"$nulls":5},{"$f":"SUM(J727:J728)","v":0}]
[null,"D - ATIVIDADES AUXILIARES",null,"Quantidade","Unidade",null,"Custo Unitário","Custo Unitário"]
[null,"-",0,0,0,null,0,null,null,{"$f":"D731*G731","v":0}]
[null,"-",0,0,0,null,0,null,null,{"$f":"D732*G732","v":0}]
[null,null,null,"Custo total de atividades auxiliares",{"$nulls":5},{"$f":"SUM(J731:J732)","v":0}]
[{"$nulls":7},"Subtotal",null,{"$f":"J723+J729+J733+J724+J725","v":1.1060746707193514}]
[null,"E - TEMPO FIXO",null,"Código","Quantidade","Unidade",null,"Custo Unitário","Custo Unitário"]
[null,"-",0,"-",0,"t",null,0,null,{"$f":"ROUNDDOWN(E736*H736,4)","v":0}]
[null,"-",0,"-",0,"t",null,0,null,{"$f":"ROUNDDOWN(E737*H737,4)","v":0}]
[null,null,null,"Custo unitário total de tempo fixo",{"$nulls":5},{"$f":"SUM(J736:J737)","v":0}]
[null,"F - MOMENTO DE TRANSPORTE",null,"Quantidade","Unidade","DMT",null,null,null,"Custo Unitário"]
[{"$nulls":5},"LN","RP","P"]
[null,"-",0,0,"tkm"]
[null,"-",0,0,"tkm"]
[null,null,null,"Custo unitário total de transporte"]
[{"$nulls":5},"Custo unitário direto total",null,null,null,{"$f":"TRUNC(J734+J738,2)","v":1.1000000000000001}]
[null,"Obs."]
[]
[20,"1ª/GRD",{"$nulls":8},{"$f":"J783","v":1.74}]
[null,"OBRA:"," PAVIMENTAÇÃO ASFÁLTICA EM CBUQ - VIAS URBANAS DIVERSAS (ÁGUAS VERMELHAS / MG)"]
[null,"Custo Unitário de Referência",null,null,"Minas Gerais"]
[{"$nulls":4}," Janeiro/2025 ",null,null,"Produção da equipe ",149.4,{"$f":"VLOOKUP(A747,ORÇAMENTO!$A$10:$L$44,7,1)","v":"TXKM"}]
[null,5914622,"TRANSPORTE COM CAMINHÃO TANQUE DE TRANSPORTE DE MATERIAL ASFÁLTICO DE 30000 L, EM VIA URBANA PAVIMENTADA",{"$nulls":5},"Valores em reais (R$)"]
[null,"A - EQUIPAMENTOS",null,"Quantidade","Utilização",null,"Custo Horário",null,null,"Custo"]
[{"$nulls":4},"Operativa","Improdutiva","Produtivo","Improdutivo",null,"Horário Total"]
[null,"E9509","Caminhão tanque distribuidor de asfalto com capacidade de 6.000 l - 7 kW/136 kW",1,1,0,261.03050000000002,72.388300000000001,null,{"$f":"D754*(E754*G754+F754*H754)","v":261.03050000000002}]
[null,"-",0,null,null,null,0,0,null,{"$f":"D755*(E755*G755+F755*H755)","v":0}]
[{"$nulls":7},"Custo horário total de equipamentos",null,{"$f":"SUM(J754:J755)","v":261.03050000000002}]
[null,"B - MÃO DE OBRA",null,"Quantidade","Unidade",null,"Custo Horário","Custo Horário Total"]
[null,"-",0,0,0,null,0,null,null,{"$f":"D758*G758","v":0}]
[null,"-",0,0,0,null,0,null,null,{"$f":"D759*G759","v":0}]
[null,null,null,"Custo horário total de mão de obra",{"$nulls":5},{"$f":"SUM(J758:J759)","v":0}]
[null,null,null,"Custo horário total de execução",{"$nulls":5},{"$f":"J756+J760","v":261.03050000000002}]
[null,null,null,"Custo unitário de execução",{"$nulls":5},{"$f":"J761/I750","v":1.7471921017402945}]
[{"$nulls":7},"Custo do FIC",null,0]
[{"$nulls":7},"Custo do FIT",null,0]
[null,"C - MATERIAL",null,"Quantidade","Unidade",null,"Preço Unitário","Custo Unitário"]
[null,"-",0,996,0,null,0,null,null,{"$f":"D766*G766","v":0}]
[null,"-",0,89.28,0,null,0,null,null,{"$f":"D767*G767","v":0}]
[null,null,null,"Custo unitário total de material",{"$nulls":5},{"$f":"SUM(J766:J767)","v":0}]
[null,"D - ATIVIDADES AUXILIARES",null,"Quantidade","Unidade",null,"Custo Unitário","Custo Unitário"]
[null,"-",0,0,0,null,0,null,null,{"$f":"D770*G770","v":0}]
[null,"-",0,0,0,null,0,null,null,{"$f":"D771*G771","v":0}]
[null,null,null,"Custo total de atividades auxiliares",{"$nulls":5},{"$f":"SUM(J770:J771)","v":0}]
[{"$nulls":7},"Subtotal",null,{"$f":"J762+J768+J772+J763+J764","v":1.7471921017402945}]
[null,"E - TEMPO FIXO",null,"Código","Quantidade","Unidade",null,"Custo Unitário","Custo Unitário"]
[null,"-",0,"-",0,"t",null,0,null,{"$f":"ROUNDDOWN(E775*H775,4)","v":0}]
[null,"-",0,"-",0,"t",null,0,null,{"$f":"ROUNDDOWN(E776*H776,4)","v":0}]
[null,null,null,"Custo unitário total de tempo fixo",{"$nulls":5},{"$f":"SUM(J775:J776)","v":0}]
[null,"F - MOMENTO DE TRANSPORTE",null,"Quantidade","Unidade","DMT",null,null,null,"Custo Unitário"]
[{"$nulls":5},"LN","RP","P"]
[null,"-",0,0,"tkm"]
[null,"-",0,0,"tkm"]
[null,null,null,"Custo unitário total de transporte"]
[{"$nulls":5},"Custo unitário direto total",null,null,null,{"$f":"TRUNC(J773+J777,2)","v":1.74}]
[null,"Obs."]
[]
[{"$f":"A747+1","v":21},"1ª/GRD",{"$nulls":8},{"$f":"J822","v":44.65}]
[null,"OBRA:"," PAVIMENTAÇÃO ASFÁLTICA EM CBUQ - VIAS URBANAS DIVERSAS (ÁGUAS VERMELHAS / MG)"]
[null,"Custo Unitário de Referência",null,null,"Minas Gerais"]
[{"$nulls":4}," Janeiro/2025 ",null,null,"Produção da equipe ",1,{"$f":"VLOOKUP(A786,ORÇAMENTO!$A$10:$L$44,7,1)","v":"M"}]
[null,94273,"ASSENTAMENTO DE GUIA (MEIO-FIO) PRÉ-MOLDADO DE CONCRETO - 100X15X13X30 CM (COMPRIMENTO X BASE INFERIOR X BASE SUPERIOR X ALTURA) - USO VIÁRIO",{"$nulls":5},"Valores em reais (R$)"]
[null,"A - EQUIPAMENTOS",null,"Quantidade","Utilização",null,"Custo Horário",null,null,"Custo"]
[{"$nulls":4},"Operativa","Improdutiva","Produtivo","Improdutivo",null,"Horário Total"]
[null,"-",0,null,null,null,0,0,null,{"$f":"D793*(E793*G793+F793*H793)","v":0}]
[null,"-",0,null,null,null,0,0,null,{"$f":"D794*(E794*G794+F794*H794)","v":0}]
[{"$nulls":7},"Custo horário total de equipamentos",null,{"$f":"SUM(J793:J794)","v":0}]
[null,"B - MÃO DE OBRA",null,"Quantidade","Unidade",null,"Custo Horário","Custo Horário Total"]
[null,"P9824","Servente",0.2296,"h",null,21.3355,null,null,{"$f":"D797*G797","v":4.8986308000000003}]
[null,"P9821","Pedreiro",0.2296,"h",null,26.6785,null,null,{"$f":"D798*G798","v":6.1253836000000002}]
[null,null,null,"Custo horário total de mão de obra",{"$nulls":5},{"$f":"SUM(J797:J798)","v":11.0240144}]
[null,null,null,"Custo horário total de execução",{"$nulls":5},{"$f":"J795+J799","v":11.0240144}]
[null,null,null,"Custo unitário de execução",{"$nulls":5},{"$f":"J800/I789","v":11.0240144}]
[{"$nulls":7},"Custo do FIC",null,0]
[{"$nulls":7},"Custo do FIT",null,0]
[null,"C - MATERIAL",null,"Quantidade","Unidade",null,"Preço Unitário","Custo Unitário"]
[null,"M0082","Areia média lavada",6.6E-3,"m³",null,84,null,null,{"$f":"D805*G805","v":0.5544}]
[null,4059,"Meio-fio ou guia de concreto, pré-moldado, comp.1,0m x 30 x 12/15 cm (H X L1/L2)",1.0049999999999999,"m",null,32,"SALINAS PRÉ-MOLDADOS",null,32.159999999999997]
[null,null,null,"Custo unitário total de material",{"$nulls":5},{"$f":"SUM(J805:J806)","v":32.714399999999998}]
[null,"D - ATIVIDADES AUXILIARES",null,"Quantidade","Unidade",null,"Custo Unitário","Custo Unitário"]
[null,1109669,"Argamassa de cimento e areia 1:3 - confecção em betoneira e lançamento manual - areia comercial",1.8E-3,"m³",null,507.26,null,null,{"$f":"D809*G809","v":0.91306799999999999}]
[null,"-",0,0,0,null,0,null,null,{"$f":"D810*G810","v":0}]
[null,null,null,"Custo total de atividades auxiliares",{"$nulls":5},{"$f":"SUM(J809:J810)","v":0.91306799999999999}]
[{"$nulls":7},"Subtotal",null,{"$f":"J801+J807+J811+J802+J803","v":44.651482399999999}]
[null,"E - TEMPO FIXO",null,"Código","Quantidade","Unidade",null,"Custo Unitário","Custo Unitário"]
[null,"-",0,"-",0,"t",null,0,null,{"$f":"ROUNDDOWN(E814*H814,4)","v":0}]
[null,"-",0,"-",0,"t",null,0,null,{"$f":"ROUNDDOWN(E815*H815,4)","v":0}]
[null,null,null,"Custo unitário total de tempo fixo",{"$nulls":5},{"$f":"SUM(J814:J815)","v":0}]
[null,"F - MOMENTO DE TRANSPORTE",null,"Quantidade","Unidade","DMT",null,null,null,"Custo Unitário"]
[{"$nulls":5},"LN","RP","P"]
[null,"-",0,0,"tkm","5914449","5914464","5914479"]
[null,"-",0,0,"tkm","5914449","5914464","5914479"]
[null,null,null,"Custo unitário total de transporte"]
[{"$nulls":5},"Custo unitário direto total",null,null,null,{"$f":"TRUNC(J812+J816,2)","v":44.65}]
[null,"Obs."]
[]
[23,"1ª/GRD",{"$nulls":8},{"$f":"J863","v":28.76}]
[null,"OBRA:"," PAVIMENTAÇÃO ASFÁLTICA EM CBUQ - VIAS URBANAS DIVERSAS (ÁGUAS VERMELHAS / MG)"]
[null,"Custo Unitário de Referência",null,null,"Minas Gerais"]
[{"$nulls":4}," Janeiro/2025 ",null,null,"Produção da equipe ",4.2016806722689077,{"$f":"VLOOKUP(A825,ORÇAMENTO!$A$10:$L$44,7,1)","v":"M"}]
[null,"94289a","EXECUÇÃO DE SARJETA EM CONCRETO USINADO, MOLDADO IN LOCO - 50CM DE BASE X 5CM DE ALTURA",{"$nulls":5},"Valores em reais (R$)"]
[null,"A - EQUIPAMENTOS",null,"Quantidade","Utilização",null,"Custo Horário",null,null,"Custo"]
[{"$nulls":4},"Operativa","Improdutiva","Produtivo","Improdutivo",null,"Horário Total"]
[null,"-",0,null,null,null,0,0,null,{"$f":"D832*(E832*G832+F832*H832)","v":0}]
[null,"-",0,null,null,null,0,0,null,{"$f":"D833*(E833*G833+F833*H833)","v":0}]
[{"$nulls":7},"Custo horário total de equipamentos",null,{"$f":"SUM(J832:J833)","v":0}]
[null,"B - MÃO DE OBRA",null,"Quantidade","Unidade",null,"Custo Horário","Custo Horário Total"]
[null,"P9821","Pedreiro",1,"h",null,26.6785,null,null,{"$f":"D836*G836","v":26.6785}]
[null,"P9824","Servente",1,"h",null,21.3355,null,null,{"$f":"D837*G837","v":21.3355}]
[null,null,null,"Custo horário total de mão de obra",{"$nulls":5},{"$f":"SUM(J836:J837)","v":48.013999999999996}]
[null,null,null,"Custo horário total de execução",{"$nulls":5},{"$f":"J834+J838","v":48.013999999999996}]
[null,null,null,"Custo unitário de execução",{"$nulls":5},{"$f":"J839/I828","v":11.427331999999998}]
[{"$nulls":7},"Custo do FIC",null,0]
[{"$nulls":7},"Custo do FIT",null,0]
[null,"C - MATERIAL",null,"Quantidade","Unidade",null,"Preço Unitário","Custo Unitário"]
[null,"M0082","Areia média lavada",8.277777777777778E-3,"m³",null,84,null,null,{"$f":"D844*G844","v":0.69533333333333336}]
[null,"M0286","Tábua - E = 2,5 cm e L = 30 cm",8.3299999999999999E-2,"m",null,15.537800000000001,null,null,{"$f":"D845*G845","v":1.2942987400000001}]
[null,"M0451","Concreto usinado - fck = 20 MPa (comercial)",2.7500000000000004E-2,"m³",null,550,"SINAPI - 34492",null,15.125000000000002]
[null,"M1358","Sarrafo em madeira de terceira - E = 2,5 cm e L = 5 cm",0.11111111111111112,"m",null,1.9665999999999999,null,null,0.21851111111111113]
[null,null,null,"Custo unitário total de material",{"$nulls":5},{"$f":"SUM(J844:J847)","v":17.333143184444449}]
[null,"D - ATIVIDADES AUXILIARES",null,"Quantidade","Unidade",null,"Custo Unitário","Custo Unitário"]
[null,"-",0,null,0,null,0,null,null,{"$f":"D850*G850","v":0}]
[null,"-",0,null,0,null,0,null,null,{"$f":"D851*G851","v":0}]
[null,null,null,"Custo total de atividades auxiliares",{"$nulls":5},{"$f":"SUM(J850:J851)","v":0}]
[{"$nulls":7},"Subtotal",null,{"$f":"J840+J848+J852+J841+J842","v":28.760475184444445}]
[null,"E - TEMPO FIXO",null,"Código","Quantidade","Unidade",null,"Custo Unitário","Custo Unitário"]
[null,"-",0,"-",0,"t",null,0,null,{"$f":"ROUNDDOWN(E855*H855,4)","v":0}]
[null,"-",0,"-",0,"t",null,0,null,{"$f":"ROUNDDOWN(E856*H856,4)","v":0}]
[null,null,null,"Custo unitário total de tempo fixo",{"$nulls":5},{"$f":"SUM(J855:J856)","v":0}]
[null,"F - MOMENTO DE TRANSPORTE",null,"Quantidade","Unidade","DMT",null,null,null,"Custo Unitário"]
[{"$nulls":5},"LN","RP","P"]
[null,"-",0,0,"tkm"]
[null,"-",0,0,"tkm"]
[null,null,null,"Custo unitário total de transporte"]
[{"$nulls":5},"Custo unitário direto total",null,null,null,{"$f":"TRUNC(J853+J857,2)","v":28.76}]
[null,"Obs."]
[]
[46,"1ª/GRD",{"$nulls":8},{"$f":"J902","v":259.45999999999998}]
[null,"OBRA:"," PAVIMENTAÇÃO ASFÁLTICA EM CBUQ - VIAS URBANAS DIVERSAS (ÁGUAS VERMELHAS / MG)"]
[null,"Custo Unitário de Referência",null,null,"Minas Gerais"]
[{"$nulls":4}," Janeiro/2025 ",null,null,"Produção da equipe ",3,{"$f":"VLOOKUP(A866,ORÇAMENTO!$A$10:$L$44,7,1)","v":"UN."}]
[null,5213440,"PLACA DE REGULAMENTAÇÃO EM AÇO, D=60CM - PELÍCULA RETRORREFLETIVA - FORNECIMENTO E INSTALAÇÃO, INCLUSIVE  SUPORTE",{"$nulls":5},"Valores em reais (R$)"]
[null,"A - EQUIPAMENTOS",null,"Quantidade","Utilização",null,"Custo Horário",null,null,"Custo"]
[{"$nulls":4},"Operativa","Improdutiva","Produtivo","Improdutivo",null,"Horário Total"]
[null,"E9687","Caminhão carroceria com capacidade de 5 t - 115 kW",1,0.3,0.7,146.88079999999999,57.423099999999998,null,{"$f":"D873*(E873*G873+F873*H873)","v":84.260409999999993}]
[null,"-",0,null,null,null,0,0,null,{"$f":"D874*(E874*G874+F874*H874)","v":0}]
[{"$nulls":7},"Custo horário total de equipamentos",null,{"$f":"SUM(J873:J874)","v":84.260409999999993}]
[null,"B - MÃO DE OBRA",null,"Quantidade","Unidade",null,"Custo Horário","Custo Horário Total"]
[null,"P9830","Montador",1,"h",null,36.409500000000001,null,null,{"$f":"D877*G877","v":36.409500000000001}]
[null,"P9824","Servente",2,"h",null,21.3355,null,null,{"$f":"D878*G878","v":42.670999999999999}]
[null,null,null,"Custo horário total de mão de obra",{"$nulls":5},{"$f":"SUM(J877:J878)","v":79.080500000000001}]
[null,null,null,"Custo horário total de execução",{"$nulls":5},{"$f":"J875+J879","v":163.34091000000001}]
[null,null,null,"Custo unitário de execução",{"$nulls":5},{"$f":"J880/I869","v":54.44697}]
[{"$nulls":7},"Custo do FIC",null,0]
[{"$nulls":7},"Custo do FIT",null,0]
[null,"C - MATERIAL",null,"Quantidade","Unidade",null,"Preço Unitário","Custo Unitário"]
[null,"-",0,null,0,null,0,null,null,{"$f":"D885*G885","v":0}]
[null,"-",0,null,0,null,0,null,null,{"$f":"D886*G886","v":0}]
[null,null,null,"Custo unitário total de material",{"$nulls":5},{"$f":"SUM(J885:J886)","v":0}]
[null,"D - ATIVIDADES AUXILIARES",null,"Quantidade","Unidade",null,"Custo Unitário","Custo Unitário"]
[null,5213414,"Placa em aço nº 16 galvanizado com película retrorrefletiva tipo I + SI - confecção",0.35993999999999998,"m²",null,569.58000000000004,null,null,{"$f":"D889*G889","v":205.01462520000001}]
[null,"-",0,null,0,null,0,null,null,{"$f":"D890*G890","v":0}]
[null,null,null,"Custo total de atividades auxiliares",{"$nulls":5},{"$f":"SUM(J889:J890)","v":205.01462520000001}]
[{"$nulls":7},"Subtotal",null,{"$f":"J881+J887+J891+J882+J883","v":259.46159520000003}]
[null,"E - TEMPO FIXO",null,"Código","Quantidade","Unidade",null,"Custo Unitário","Custo Unitário"]
[null,"-",0,"-",null,"t",null,0,null,{"$f":"ROUNDDOWN(E894*H894,4)","v":0}]
[null,"-",0,"-",null,"t",null,0,null,{"$f":"ROUNDDOWN(E895*H895,4)","v":0}]
[null,null,null,"Custo unitário total de tempo fixo",{"$nulls":5},{"$f":"SUM(J894:J895)","v":0}]
[null,"F - MOMENTO DE TRANSPORTE",null,"Quantidade","Unidade","DMT",null,null,null,"Custo Unitário"]
[{"$nulls":5},"LN","RP","P"]
[null,"-",0,null,"tkm"]
[null,"-",0,null,"tkm"]
[null,null,null,"Custo unitário total de transporte"]
[{"$nulls":5},"Custo unitário direto total",null,null,null,{"$f":"TRUNC(J892+J896,2)","v":259.45999999999998}]
[null,"Obs."]
[]
[49,"1ª/GRD",{"$nulls":8},{"$f":"J948","v":29.17}]
[null,"OBRA:"," PAVIMENTAÇÃO ASFÁLTICA EM CBUQ - VIAS URBANAS DIVERSAS (ÁGUAS VERMELHAS / MG)"]
[null,"Custo Unitário de Referência",null,null,"Minas Gerais"]
[{"$nulls":4}," Janeiro/2025 ",null,null,"Produção da equipe ",149.4,{"$f":"VLOOKUP(A905,ORÇAMENTO!$A$10:$L$44,7,1)","v":"M2"}]
[null,5213401,"PINTURA DE EIXO VIÁRIO SOBRE ASFALTO COM TINTA RETRORREFLETIVA A BASE DE RESINA ACRÍLICA COM MICROESFERAS DE VIDRO, APLICAÇÃO MECÂNICA COM DEMARCADORA AUTOPROPELIDA",{"$nulls":5},"Valores em reais (R$)"]
[null,"A - EQUIPAMENTOS",null,"Quantidade","Utilização",null,"Custo Horário",null,null,"Custo"]
[{"$nulls":4},"Operativa","Improdutiva","Produtivo","Improdutivo",null,"Horário Total"]
[null,"E9644","Caminhão demarcador de faixas com sistema de pintura a frio - 28 kW/115 kW",1,1,0,374.84390000000002,155.3843,null,{"$f":"D912*(E912*G912+F912*H912)","v":374.84390000000002}]
[null,"-",0,null,null,null,0,0,null,{"$f":"D913*(E913*G913+F913*H913)","v":0}]
[{"$nulls":7},"Custo horário total de equipamentos",null,{"$f":"SUM(J912:J913)","v":374.84390000000002}]
[null,"B - MÃO DE OBRA",null,"Quantidade","Unidade",null,"Custo Horário","Custo Horário Total"]
[null,"P9853","Pré-marcador",1,"h",null,22.8993,null,null,{"$f":"D916*G916","v":22.8993}]
[null,"P9824","Servente",4,"h",null,21.3355,null,null,{"$f":"D917*G917","v":85.341999999999999}]
[null,null,null,"Custo horário total de mão de obra",{"$nulls":5},{"$f":"SUM(J916:J917)","v":108.2413}]
[null,null,null,"Custo horário total de execução",{"$nulls":5},{"$f":"J914+J918","v":483.08519999999999}]
[null,null,null,"Custo unitário de execução",{"$nulls":5},{"$f":"J919/I908","v":3.2335020080321284}]
[{"$nulls":7},"Custo do FIC",null,0]
[{"$nulls":7},"Custo do FIT",null,0]
[null,"C - MATERIAL",null,"Quantidade","Unidade",null,"Preço Unitário","Custo Unitário"]
[null,"M2037","Microesferas refletivas de vidro tipo I-B",0.12,"kg",null,8.7245000000000008,null,null,{"$f":"D924*G924","v":1.04694}]
[null,"M2038","Microesferas refletivas de vidro tipo II-A",0.35,"kg",null,8.9086999999999996,null,null,{"$f":"D925*G925","v":3.1180449999999995}]
[null,"M2034","Solvente para tinta à base de resina acrílica",0.03,"l",null,16.8491,null,null,0.50547299999999995]
[null,"M2044","Tinta à base de resina acrílica emulsionada em água para pré-marcação viária",9.7000000000000005E-4,"l",null,21.025400000000001,null,null,2.0394638000000003E-2]
[null,"M2027","Tinta à base de resina acrílica estirenada para demarcação viária",0.6,"l",null,35.350499999999997,null,null,21.210299999999997]
[null,null,null,"Custo unitário total de material",{"$nulls":5},{"$f":"SUM(J924:J928)","v":25.901152637999996}]
[null,"D - ATIVIDADES AUXILIARES",null,"Quantidade","Unidade",null,"Custo Unitário","Custo Unitário"]
[null,"-",0,null,0,null,0,null,null,{"$f":"D931*G931","v":0}]
[null,"-",0,null,0,null,0,null,null,{"$f":"D932*G932","v":0}]
[null,null,null,"Custo total de atividades auxiliares",{"$nulls":5},{"$f":"SUM(J931:J932)","v":0}]
[{"$nulls":7},"Subtotal",null,{"$f":"J920+J929+J933+J921+J922","v":29.134654646032125}]
[null,"E - TEMPO FIXO",null,"Código","Quantidade","Unidade",null,"Custo Unitário","Custo Unitário"]
[null,"M2037","Microesferas refletivas de vidro tipo I-B",5914655,1.2E-4,"t",null,32.520000000000003,null,{"$f":"ROUNDDOWN(E936*H936,4)","v":3.8999999999999998E-3}]
[null,"M2038","Microesferas refletivas de vidro tipo II-A",5914655,3.5E-4,"t",null,32.520000000000003,null,{"$f":"ROUNDDOWN(E937*H937,4)","v":1.1299999999999999E-2}]
[null,"M2034","Solvente para tinta à base de resina acrílica",5914655,3.0000000000000001E-5,"t",null,32.520000000000003,null,8.9999999999999998E-4]
[null,"M2027","Tinta à base de resina acrílica estirenada para demarcação viária",5914655,8.3000000000000001E-4,"t",null,32.520000000000003,null,2.69E-2]
[null,null,null,"Custo unitário total de tempo fixo",{"$nulls":5},{"$f":"SUM(J936:J939)","v":4.2999999999999997E-2}]
[null,"F - MOMENTO DE TRANSPORTE",null,"Quantidade","Unidade","DMT",null,null,null,"Custo Unitário"]
[{"$nulls":5},"LN","RP","P"]
[null,"M2037","Microesferas refletivas de vidro tipo I-B",1.2E-4,"tkm"]
[null,"M2038","Microesferas refletivas de vidro tipo II-A",3.5E-4,"tkm"]
[null,"M2034","Solvente para tinta à base de resina acrílica",3.0000000000000001E-5,"tkm"]
[null,"M2027","Tinta à base de resina acrílica estirenada para demarcação viária",8.3000000000000001E-4,"tkm"]
[null,null,null,"Custo unitário total de transporte"]
[{"$nulls":5},"Custo unitário direto total",null,null,null,{"$f":"TRUNC(J934+J940,2)","v":29.17}]
[null,"Obs."]
[]
[51,"1ª/GRD",{"$nulls":8},{"$f":"J994","v":41.95}]
[null,"OBRA:"," PAVIMENTAÇÃO ASFÁLTICA EM CBUQ - VIAS URBANAS DIVERSAS (ÁGUAS VERMELHAS / MG)"]
[null,"Custo Unitário de Referência",null,null,"Minas Gerais"]
[{"$nulls":4}," Janeiro/2025 ",null,null,"Produção da equipe ",30.18,{"$f":"VLOOKUP(A951,ORÇAMENTO!$A$10:$L$44,7,1)","v":"M2"}]
[null,5213405,"PINTURA DE FAIXA DE PEDESTRE OU ZEBRADA TINTA RETRORREFLETIVA A BASE DE RESINA ACRÍLICA COM MICROESFERAS DE VIDRO, APLICAÇÃO MANUAL",{"$nulls":5},"Valores em reais (R$)"]
[null,"A - EQUIPAMENTOS",null,"Quantidade","Utilização",null,"Custo Horário",null,null,"Custo"]
[{"$nulls":4},"Operativa","Improdutiva","Produtivo","Improdutivo",null,"Horário Total"]
[null,"E9644","Caminhão demarcador de faixas com sistema de pintura a frio - 28 kW/115 kW",1,1,0,374.84390000000002,155.3843,null,{"$f":"D958*(E958*G958+F958*H958)","v":374.84390000000002}]
[null,"-",0,null,null,null,0,0,null,{"$f":"D959*(E959*G959+F959*H959)","v":0}]
[{"$nulls":7},"Custo horário total de equipamentos",null,{"$f":"SUM(J958:J959)","v":374.84390000000002}]
[null,"B - MÃO DE OBRA",null,"Quantidade","Unidade",null,"Custo Horário","Custo Horário Total"]
[null,"P9853","Pré-marcador",1,"h",null,22.8993,null,null,{"$f":"D962*G962","v":22.8993}]
[null,"P9824","Servente",4,"h",null,21.3355,null,null,{"$f":"D963*G963","v":85.341999999999999}]
[null,null,null,"Custo horário total de mão de obra",{"$nulls":5},{"$f":"SUM(J962:J963)","v":108.2413}]
[null,null,null,"Custo horário total de execução",{"$nulls":5},{"$f":"J960+J964","v":483.08519999999999}]
[null,null,null,"Custo unitário de execução",{"$nulls":5},{"$f":"J965/I954","v":16.006799204771372}]
[{"$nulls":7},"Custo do FIC",null,0]
[{"$nulls":7},"Custo do FIT",null,0]
[null,"C - MATERIAL",null,"Quantidade","Unidade",null,"Preço Unitário","Custo Unitário"]
[null,"M2037","Microesferas refletivas de vidro tipo I-B",0.12,"kg",null,8.7245000000000008,null,null,{"$f":"D970*G970","v":1.04694}]
[null,"M2038","Microesferas refletivas de vidro tipo II-A",0.35,"kg",null,8.9086999999999996,null,null,{"$f":"D971*G971","v":3.1180449999999995}]
[null,"M2034","Solvente para tinta à base de resina acrílica",0.03,"l",null,16.8491,null,null,0.50547299999999995]
[null,"M2044","Tinta à base de resina acrílica emulsionada em água para pré-marcação viária",9.7000000000000005E-4,"l",null,21.025400000000001,null,null,2.0394638000000003E-2]
[null,"M2027","Tinta à base de resina acrílica estirenada para demarcação viária",0.6,"l",null,35.350499999999997,null,null,21.210299999999997]
[null,null,null,"Custo unitário total de material",{"$nulls":5},{"$f":"SUM(J970:J974)","v":25.901152637999996}]
[null,"D - ATIVIDADES AUXILIARES",null,"Quantidade","Unidade",null,"Custo Unitário","Custo Unitário"]
[null,"-",0,null,0,null,0,null,null,{"$f":"D977*G977","v":0}]
[null,"-",0,null,0,null,0,null,null,{"$f":"D978*G978","v":0}]
[null,null,null,"Custo total de atividades auxiliares",{"$nulls":5},{"$f":"SUM(J977:J978)","v":0}]
[{"$nulls":7},"Subtotal",null,{"$f":"J966+J975+J979+J967+J968","v":41.907951842771368}]
[null,"E - TEMPO FIXO",null,"Código","Quantidade","Unidade",null,"Custo Unitário","Custo Unitário"]
[null,"M2037","Microesferas refletivas de vidro tipo I-B",5914655,1.2E-4,"t",null,32.520000000000003,null,{"$f":"ROUNDDOWN(E982*H982,4)","v":3.8999999999999998E-3}]
[null,"M2038","Microesferas refletivas de vidro tipo II-A",5914655,3.5E-4,"t",null,32.520000000000003,null,{"$f":"ROUNDDOWN(E983*H983,4)","v":1.1299999999999999E-2}]
[null,"M2034","Solvente para tinta à base de resina acrílica",5914655,3.0000000000000001E-5,"t",null,32.520000000000003,null,8.9999999999999998E-4]
[null,"M2027","Tinta à base de resina acrílica estirenada para demarcação viária",5914655,8.3000000000000001E-4,"t",null,32.520000000000003,null,2.69E-2]
[null,null,null,"Custo unitário total de tempo fixo",{"$nulls":5},{"$f":"SUM(J982:J985)","v":4.2999999999999997E-2}]
[null,"F - MOMENTO DE TRANSPORTE",null,"Quantidade","Unidade","DMT",null,null,null,"Custo Unitário"]
[{"$nulls":5},"LN","RP","P"]
[null,"M2037","Microesferas refletivas de vidro tipo I-B",1.2E-4,"tkm"]
[null,"M2038","Microesferas refletivas de vidro tipo II-A",3.5E-4,"tkm"]
[null,"M2034","Solvente para tinta à base de resina acrílica",3.0000000000000001E-5,"tkm"]
[null,"M2027","Tinta à base de resina acrílica estirenada para demarcação viária",8.3000000000000001E-4,"tkm"]
[null,null,null,"Custo unitário total de transporte"]
[{"$nulls":5},"Custo unitário direto total",null,null,null,{"$f":"TRUNC(J980+J986,2)","v":41.95}]
[null,"Obs."]

{"sheet":"AUX-VEIC.","index":2,"n_rows":31,"n_cols":6,"rows_kept":31,"cut":false,"hidden":false,"merged":[[26,2,26,3],[27,2,27,3],[28,2,28,3],[29,1,30,1],[29,2,29,3],[30,2,30,3],[20,2,20,3],[21,2,21,3],[22,2,22,3],[23,2,23,3],[24,2,24,3],[25,2,25,3],[1,1,1,4],[2,1,2,2],[3,1,3,4],[17,1,17,4],[18,2,18,3],[19,2,19,3]]}
[]
[null,"CÁLCULO DO CUSTO POR MÊS DE VEÍCULOS"]
[null,"Veículo: Polo TSI, Onix Turbo, Argo 1.3, HB-20 Turbo",null,"Data:","2025-05-28"]
[null,"DADOS ELEMENTARES DO VEÍCULO"]
[null,"Dados Básicos","Preço (R$)","Quantidade","Vida Útil"]
[null,"Quilometragem média mensal",null,3000]
[null,"Valor de Aquisição (VA)",103900]
[null,"Taxa de Juros (i)%",null,14.75]
[null,"IPVA e Seguro Obrigatório (4%)",{"$f":"0.04*C7","v":4156}]
[null,"Lavagem",50,2]
[null,"Pneus",479.9,4,50000]
[null,"Combustível",6.01,14]
[null,"Óleo Lubrificante + Filtros (revisão)",{"$f":"4*(188.59+213.69+186.16+283.83+186.16)/5","v":846.74400000000003},1,10000]
[null,"Seguro Total Anual",3378.94]
[null,"Jogo de Amortecedores",1287,null,50000]
[null,"Coeficiente de Manutenção",null,4.7999999999999998E-6]
[null,"Motorista",{"$f":"5284.47/1.7393","v":3038.2740182832176},1]
[null,"CÁLCULO DO CUSTO POR MÊS"]
[null,"DEPRECIAÇÃO","D = (VA-0,60xVA) / 12 x 5",null,{"$f":"(C7-(0.6*C7))/60","v":692.66666666666663},{"$f":"E19/E$30","v":0.16243931000033615}]
[null,"JUROS","J = (VA-0,60xVA) x i / 12",null,{"$f":"ROUND(((C7-0.6*C7)*D8/100)/12,2)","v":510.84},0.11979860027031529]
[null,"LICENCIAMENTO","L = (IPVA=SEG.OBRIG.)/12",null,{"$f":"ROUND(C9/12,2)","v":346.33},8.121887329030282E-2]
[null,"SEGURO TOTAL","ST = SEGURO ANUAL/12",null,{"$f":"ROUND(C14/12,2)","v":281.58},6.6034159157691993E-2]
[null,"COMBUSTÍVEL","OD = (Comb./Consu)x Km.mês",null,{"$f":"ROUND(C12/D12*D6,2)","v":1287.8599999999999},0.30201986012083676]
[null,"ÓLEO LUBRIFICANTE","OL = ((Ol. X Quant)/Vida Útil)xKm.mês)",null,{"$f":"ROUND(((C13*D13)/E13)*D6,2)","v":254.02},5.9570981991749851E-2]
[null,"LAVAGEM","LL = Preço Lavagem x Quantidade",null,{"$f":"ROUND(C10*D10,2)","v":100},2.3451295957700121E-2]
[null,"PNEUS","P = ((P. PneusxQuant)/Vida Útil)xkm.mês)",null,{"$f":"ROUND(((C11*D11)/E11)*D6,2)","v":115.18},2.7011202684079E-2]
[null,"AMORTECEDORES","AM = (P. Amort/Vida Útil)xkm.mês",null,{"$f":"ROUND(C15/E15*D6,2)","v":77.22},1.8109090738536032E-2]
[null,"MANUTENÇÃO","M = (VA-VPxK)xkm.mês",null,{"$f":"ROUND((C7-0.6*C7)*D16*D6,2)","v":598.46},0.14034662578845214]
[null,"MOTORISTA","MOT = SALÁRIO+LEIS SOCIAIS",null,{"$f":"ROUND((C17+C17*0.7368),2)","v":5276.87}]
[null,"CUSTO POR MÊS","SEM MOTORISTA",null,{"$f":"SUM(E19:E28)","v":4264.1566666666658},{"$f":"E30-E23","v":2976.2966666666662}]
[null,null,"COM MOTORISTA",null,{"$f":"E30+E29","v":9541.0266666666648}]

{"sheet":"CPU-FORNEC","index":3,"n_rows":92,"n_cols":14,"rows_kept":92,"cut":false,"hidden":false,"merged":[[81,1,81,7],[82,0,91,0],[82,1,82,3],[82,4,82,7],[83,2,83,5],[84,2,84,3],[85,1,85,7],[88,1,88,3],[88,5,88,6],[89,1,89,6],[90,1,90,6],[91,1,91,6],[60,0,69,0],[60,1,60,3],[60,4,60,7],[61,2,61,5],[62,2,62,3],[63,1,63,7],[66,1,66,3],[66,5,66,6],[67,1,67,6],[68,1,68,6],[69,1,69,6],[38,0,47,0],[38,1,38,3],[38,4,38,7],[39,2,39,5],[40,2,40,3],[41,1,41,7],[44,1,44,3],[44,5,44,6],[45,1,45,6],[46,1,46,6],[47,1,47,6],[22,5,22,6],[23,1,23,6],[24,1,24,6],[25,1,25,6],[5,1,5,7],[9,1,9,7],[13,1,13,7],[17,1,17,7],[0,10,0,11],[1,2,1,5],[1,10,1,11],[2,2,2,3],[3,1,3,7],[27,4,27,7],[28,2,28,5],[27,0,36,0],[29,2,29,3],[30,1,30,7],[33,1,33,3],[33,5,33,6],[34,1,34,6],[35,1,35,6],[36,1,36,6],[0,0,26,0],[0,1,0,3],[0,4,0,7],[22,1,22,3],[49,0,58,0],[49,1,49,3],[49,4,49,7],[50,2,50,5],[51,2,51,3],[52,1,52,7],[55,1,55,3],[55,5,55,6],[56,1,56,6],[57,1,57,6],[58,1,58,6],[27,1,27,3],[71,0,80,0],[71,1,71,3],[71,4,71,7],[72,2,72,5],[73,2,73,3],[74,1,74,7],[77,1,77,3],[77,5,77,6],[78,1,78,6],[79,1,79,6],[80,1,80,6]]}
[1,"CODEVASF",null,null," COMPOSIÇÃO DE PREÇO UNITÁRIO",null,null,null,{"$f":"H24","v":0},{"$f":"H26","v":0},"BDI CALCULADO:",null,{"$f":"ORÇAMENTO!L6","v":15}]
[null,"OBRA:  "," PAVIMENTAÇÃO ASFÁLTICA EM CBUQ - VIAS URBANAS DIVERSAS (ÁGUAS VERMELHAS / MG)",null,null,null,"DATA: ",{"$f":"ORÇAMENTO!C6","v":" JUNHO / 2025"},null,null,"BDI DIFERENCIADO:",null,{"$f":"'BDI FORN'!D31/100","v":0.15}]
[null,"SERVIÇO:  ","CPU.1",null,"Referência:","CODEVASF","UNIDADE: ",{"$f":"VLOOKUP(A1,ORÇAMENTO!A11:L32,5)","v":"MOBILIZAÇÃO E DESMOBILIZAÇÃO"}]
[]
[null,"TIPO ITEM","CODIGO ITEM","DESCRIÇÃO ITEM","UNIDADE ITEM","COEFICIENTE","PRECO UNITARIO","CUSTO TOTAL",null,"distancia =",90,"B.DESPACHO"]
[null,"EQUIPAMENTOS",{"$nulls":7},"Pá carregadeira ",null,null,10.1," ton"]
[null,null,"E9001","E9001","E9001",null,"E9001"]
[]
[]
[null,"MÃO DE OBRA"]
[]
[]
[]
[null,"MATERIAIS"]
[]
[]
[{"$nulls":7},{"$f":"ROUNDDOWN(F17*G17,2)","v":0},null,"Motoniveladora ",null,null,12.47," ton"]
[null,"ATIVIDADES AUXILIARES",{"$nulls":7},"Trator de pneus",null,null,2.8," ton"]
[{"$nulls":7},{"$f":"ROUNDDOWN(F19*G19,2)","v":0}]
[{"$nulls":7},0]
[{"$nulls":7},0]
[{"$nulls":7},{"$f":"ROUNDDOWN(F22*G22,2)","v":0},null,"Rolo Compactador ",null,null,15.33," ton"]
[null,"PRODUÇÃO DA EQUIPE",null,null,1,"CUSTO ",null,{"$f":"SUM(H6:H22)","v":0},null,"Grade de disco",null,null,1," ton"]
[null,"TOTAL",{"$nulls":5},{"$f":"H23/E23","v":0},"OK","RETROESCAVADEIRA",null,null,6.67," ton"]
[null,"BDI                %",{"$nulls":5},{"$f":"1+$M$1","v":16}]
[null,"TOTAL DO SERVIÇO - R$",{"$nulls":5},{"$f":"ROUND(H24*H25,2)","v":0}]
[]
["F1","CODEVASF",null,null," COMPOSIÇÃO DE PREÇO UNITÁRIO",null,null,null,{"$f":"H35","v":2897.45},{"$f":"H37","v":3332.07}]
[null,"OBRA:  "," PAVIMENTAÇÃO ASFÁLTICA EM CBUQ - VIAS URBANAS DIVERSAS (ÁGUAS VERMELHAS / MG)",null,null,null,"DATA: ",{"$f":"$H$2","v":" JUNHO / 2025"}]
[null,"SERVIÇO:  ","AQUISIÇÃO DE EMULSÃO ASFÁLTICA PARA IMPRIMAÇÃO (EAI) - EXCLUSIVE TRANSPORTE",null,"Referência:","CPU.5","UNIDADE: ",{"$f":"VLOOKUP(A28,ORÇAMENTO!$A$11:$L$51,7)","v":"T"}]
[]
[null,"TIPO ITEM","CODIGO ITEM","DESCRIÇÃO ITEM","UNIDADE ITEM","COEFICIENTE","PRECO UNITARIO","CUSTO TOTAL"]
[null,"INSUMO","ANP","EMULSÃO ASFÁLTICA PARA SERVIÇO DE IMPRIMAÇÃO (MEMÓRIA EM ANEXO)","T",1,2897.4504988532117,{"$f":"ROUNDDOWN(F33*G33,2)","v":2897.45}]
[null,"PRODUÇÃO DA EQUIPE",null,null,1,"CUSTO ",null,{"$f":"SUM(H33:H33)","v":2897.45}]
[null,"TOTAL",{"$nulls":5},{"$f":"H34/E34","v":2897.45}]
[null,"BDI                %",{"$nulls":5},{"$f":"1+$M$2","v":1.1499999999999999}]
[null,"TOTAL DO SERVIÇO - R$",{"$nulls":5},{"$f":"ROUND(H35*H36,2)","v":3332.07},"OK"]
[]
["F2","CODEVASF",null,null," COMPOSIÇÃO DE PREÇO UNITÁRIO",null,null,null,{"$f":"H46","v":580.46},{"$f":"H48","v":667.53}]
[null,"OBRA:  "," PAVIMENTAÇÃO ASFÁLTICA EM CBUQ - VIAS URBANAS DIVERSAS (ÁGUAS VERMELHAS / MG)",null,null,null,"DATA: ",{"$f":"$H$2","v":" JUNHO / 2025"}]
[null,"SERVIÇO:  ","TRANSPORTE DE EMULSÃO ASFÁLTICA PARA IMPRIMAÇÃO (EAI)",null,"Referência:","CPU.6","UNIDADE: ",{"$f":"VLOOKUP(A39,ORÇAMENTO!$A$11:$L$51,7)","v":"T"}]
[]
[null,"TIPO ITEM","CODIGO ITEM","DESCRIÇÃO ITEM","UNIDADE ITEM","COEFICIENTE","PRECO UNITARIO","CUSTO TOTAL"]
[null,"INSUMO"," - ","TRANSPORTE DE EMULSÃO ASFÁLTICA PARA IMPRIMAÇÃO (EAI), INCLUINDO CUSTO TOTAL DO TRANSPORTE (COMBUSTÍVEL, PEDÁGIOS, ETC.) E ICMS - MEMÓRIA ANEXA","T",1,580.46,{"$f":"ROUNDDOWN(F44*G44,2)","v":580.46}]
[null,"PRODUÇÃO DA EQUIPE",null,null,1,"CUSTO ",null,{"$f":"SUM(H44:H44)","v":580.46}]
[null,"TOTAL",{"$nulls":5},{"$f":"H45/E45","v":580.46}]
[null,"BDI                %",{"$nulls":5},{"$f":"1+$M$2","v":1.1499999999999999}]
[null,"TOTAL DO SERVIÇO - R$",{"$nulls":5},{"$f":"ROUND(H46*H47,2)","v":667.53},"OK"]
[]
["F3","CODEVASF",null,null," COMPOSIÇÃO DE PREÇO UNITÁRIO",null,null,null,{"$f":"H57","v":3478.58},{"$f":"H59","v":4000.37}]
[null,"OBRA:  "," PAVIMENTAÇÃO ASFÁLTICA EM CBUQ - VIAS URBANAS DIVERSAS (ÁGUAS VERMELHAS / MG)",null,null,null,"DATA: ",{"$f":"$H$2","v":" JUNHO / 2025"}]
[null,"SERVIÇO:  ","AQUISIÇÃO DE EMULSAO ASFALTICA CATIONICA RR-1C - EXCLUSIVE TRANSPORTE",null,"Referência:","CPU.7","UNIDADE: ",{"$f":"VLOOKUP(A50,ORÇAMENTO!$A$11:$L$51,7)","v":"T"}]
[]
[null,"TIPO ITEM","CODIGO ITEM","DESCRIÇÃO ITEM","UNIDADE ITEM","COEFICIENTE","PRECO UNITARIO","CUSTO TOTAL"]
[null,"INSUMO","ANP","EMULSÃO ASFÁLTICA CATIÔNICA RR-1C(MEMÓRIA EM ANEXO)","T",1,3478.5822490699657,{"$f":"ROUNDDOWN(F55*G55,2)","v":3478.58}]
[null,"PRODUÇÃO DA EQUIPE",null,null,1,"CUSTO ",null,{"$f":"SUM(H55:H55)","v":3478.58}]
[null,"TOTAL",{"$nulls":5},{"$f":"H56/E56","v":3478.58},"OK"]
[null,"BDI                %",{"$nulls":5},{"$f":"1+$M$2","v":1.1499999999999999}]
[null,"TOTAL DO SERVIÇO - R$",{"$nulls":5},{"$f":"ROUND(H57*H58,2)","v":4000.37}]
[]
["F4","CODEVASF",null,null," COMPOSIÇÃO DE PREÇO UNITÁRIO",null,null,null,{"$f":"H68","v":594.58000000000004},{"$f":"H70","v":683.77}]
[null,"OBRA:  "," PAVIMENTAÇÃO ASFÁLTICA EM CBUQ - VIAS URBANAS DIVERSAS (ÁGUAS VERMELHAS / MG)",null,null,null,"DATA: ",{"$f":"$H$2","v":" JUNHO / 2025"}]
[null,"SERVIÇO:  ","TRANSPORTE DE EMULSÃO ASFÁLTICA CATIONICA RR-1C",null,"Referência:","CPU.8","UNIDADE: ",{"$f":"VLOOKUP(A61,ORÇAMENTO!$A$11:$L$51,7)","v":"T"}]
[]
[null,"TIPO ITEM","CODIGO ITEM","DESCRIÇÃO ITEM","UNIDADE ITEM","COEFICIENTE","PRECO UNITARIO","CUSTO TOTAL"]
[null,"INSUMO"," - ","TRANSPORTE DE EMULSÃO ASFÁLTICA CATIONICA TIPO RR-1C, INCLUINDO CUSTO TOTAL DO TRANSPORTE (COMBUSTÍVEL, PEDÁGIOS, ETC.) E ICMS - MEMÓRIA ANEXA","T",1,594.57999999999993,{"$f":"ROUNDDOWN(F66*G66,2)","v":594.58000000000004}]
[null,"PRODUÇÃO DA EQUIPE",null,null,1,"CUSTO ",null,{"$f":"SUM(H66:H66)","v":594.58000000000004}]
[null,"TOTAL",{"$nulls":5},{"$f":"H67/E67","v":594.58000000000004},"OK"]
[null,"BDI                %",{"$nulls":5},{"$f":"1+$M$2","v":1.1499999999999999}]
[null,"TOTAL DO SERVIÇO - R$",{"$nulls":5},{"$f":"ROUND(H68*H69,2)","v":683.77}]
[]
["F5","CODEVASF",null,null," COMPOSIÇÃO DE PREÇO UNITÁRIO",null,null,null,{"$f":"H79","v":4907.8900000000003},{"$f":"H81","v":5644.07}]
[null,"OBRA:  "," PAVIMENTAÇÃO ASFÁLTICA EM CBUQ - VIAS URBANAS DIVERSAS (ÁGUAS VERMELHAS / MG)",null,null,null,"DATA: ",{"$f":"$H$2","v":" JUNHO / 2025"}]
[null,"SERVIÇO:  ","AQUISIÇÃO DE CONCRETO ASFÁLTICO DE PETRÓLEO - CAP 50/70 - EXCLUSIVE TRANSPORTE",null,"Referência:","CPU.9","UNIDADE: ",{"$f":"VLOOKUP(A72,ORÇAMENTO!$A$11:$L$51,7)","v":"T"}]
[]
[null,"TIPO ITEM","CODIGO ITEM","DESCRIÇÃO ITEM","UNIDADE ITEM","COEFICIENTE","PRECO UNITARIO","CUSTO TOTAL"]
[null,"INSUMO",1518,"CIMENTOS ASFÁLTICO DE PETRÓLEO TIPO CAP 50/70 (MEMÓRIA EM ANEXO)","T",1,4907.8960084521495,{"$f":"ROUNDDOWN(F77*G77,2)","v":4907.8900000000003}]
[null,"PRODUÇÃO DA EQUIPE",null,null,1,"CUSTO ",null,{"$f":"SUM(H77:H77)","v":4907.8900000000003}]
[null,"TOTAL",{"$nulls":5},{"$f":"H78/E78","v":4907.8900000000003}]
[null,"BDI                %",{"$nulls":5},{"$f":"1+$M$2","v":1.1499999999999999}]
[null,"TOTAL DO SERVIÇO - R$",{"$nulls":5},{"$f":"ROUND(H79*H80,2)","v":5644.07}]
[]
["F6","CODEVASF",null,null," COMPOSIÇÃO DE PREÇO UNITÁRIO",null,null,null,{"$f":"H90","v":563.66999999999996},{"$f":"H92","v":648.22}]
[null,"OBRA:  "," PAVIMENTAÇÃO ASFÁLTICA EM CBUQ - VIAS URBANAS DIVERSAS (ÁGUAS VERMELHAS / MG)",null,null,null,"DATA: ",{"$f":"$H$2","v":" JUNHO / 2025"}]
[null,"SERVIÇO:  ","TRANSPORTE DE CONCRETO ASFÁLTICO DE PETRÓLEO - CAP 50/70",null,"Referência:","CPU.10","UNIDADE: ",{"$f":"VLOOKUP(A83,ORÇAMENTO!$A$11:$L$51,7)","v":"T"}]
[]
[null,"TIPO ITEM","CODIGO ITEM","DESCRIÇÃO ITEM","UNIDADE ITEM","COEFICIENTE","PRECO UNITARIO","CUSTO TOTAL"]
[null,"INSUMO"," - ","TRANSPORTE DE CIMENTO ASFÁLTICO DE PETRÓLEO TIPO CAP 50-70, INCLUINDO CUSTO TOTAL DO TRANSPORTE (COMBUSTÍVEL, PEDÁGIOS, ETC.) E ICMS - MEMÓRIA ANEXA","T",1,563.67857142857133,{"$f":"ROUNDDOWN(F88*G88,2)","v":563.66999999999996}]
[null,"PRODUÇÃO DA EQUIPE",null,null,1,"CUSTO ",null,{"$f":"SUM(H88:H88)","v":563.66999999999996}]
[null,"TOTAL",{"$nulls":5},{"$f":"H89/E89","v":563.66999999999996}]
[null,"BDI                %",{"$nulls":5},{"$f":"1+$M$2","v":1.1499999999999999}]
[null,"TOTAL DO SERVIÇO - R$",{"$nulls":5},{"$f":"ROUND(H90*H91,2)","v":648.22}]

{"sheet":"BDI SERV","index":4,"n_rows":60,"n_cols":5,"rows_kept":60,"cut":false,"hidden":false,"merged":[[35,0,35,5],[36,0,36,5],[38,1,38,4],[39,2,39,3],[0,1,2,4],[25,1,25,3],[26,1,26,2],[26,3,26,4],[27,3,27,4]]}
[null,"DETALHAMENTO DO BDI - SERVIÇOS"]
[]
[]
[null,"Item","Descrição dos Serviços","% - PV","% - CD"]
[]
[null,1,"ADMINISTRAÇÃO CENTRAL"," ",{"$f":"SUM(E7:E9)","v":4.01}]
[null,"1.1","ESCRITÓRIO CENTRAL",null,4.01]
[null,"1.2","VIAGENS"]
[null,"1.3","OUTROS"]
[null," "," "," "," "]
[null,2,"IMPOSTOS E TAXAS",{"$f":"SUM(D12:D15)","v":7.65},{"$f":"SUM(E12:E15)","v":0}]
[null,"2.1","ISS - Proposta",{"$f":"D34*100","v":4}]
[null,"2.2","PIS",0.65]
[null,"2.3","Cofins",3]
[null,"2.4","Contribuição Previdenciaria (CPRB)"]
[]
[null,3,"TAXA DE RISCO",null,{"$f":"SUM(E18:E20)","v":0.96}]
[null,"3.1","SEGURO",null,0.2]
[null,"3.2","RISCO",null,0.56000000000000005]
[null,"3.3","GARANTIA",null,0.2]
[]
[null,4,"DESPESAS FINANCEIRAS",null,1.1100000000000001]
[]
[null,5,"LUCRO",null,7.3]
[]
[null,"BDI APRESENTADO:",null,null,{"$f":"IF($D$41=$C$43,$D$43,IF($D$41=$C$44,$D$44,IF($D$41=$C$44,$D$44,IF($D$41=$C$45,$D$45,0))))","v":23.32}]
[]
[null,null,"Legislação Municipal:"," Lei Complementar nº 862/2009"]
[null,null,"Município:","Águas Vermelhas"]
[null,null,"Alíquota ISSQN:",0.05,"Município"]
[null,null,"Base de Cálculo:","Dedução - Material"]
[null,null,"Valor Serviço:",1178938.8]
[null,null,"Dedução - Material (estimado):",{"$f":"0.2*D32","v":235787.76},{"$f":"D33/D32","v":0.2}]
[null,null,"ISSQN BDI:",{"$f":"IF(D32=\"\",0,ROUND(IF(D31=D49,((1-(D33/D32))*D30),D30*D31),4))","v":0.04},"(*)"]
[]
["Acórdão nº 2.622/2013 - TCU Plenário"]
["BDI = ARRED((((((1+(AC+TR)/100)*(1+DF/100)*(1+L/100))/(1-IMP/100))-1)*100);2)"]
[]
[null,"(*) É obrigação da licitante a verificação da Legislação Tributária vigente no município, bem como o cálculo dos valores totais de serviços e materiais estimados, para apresentação de sua proposta."]
[]
[null,null,"Forma de Cálculo do BDI:","BDI - Acórdão nº 2.622/2013 - TCU"]
[]
[null,null,"BDI - Digitado",{"$f":"ROUND(E6+E11+E17+E22+E24,2)","v":13.38}]
[null,null,"BDI - Calculado",{"$f":"ROUND((((1+(E6/100+E22/100+E17/100))/(1-(D11/100+E24/100)))-1)*100,2)","v":24.73}]
[null,null,"BDI - Acórdão nº 2.622/2013 - TCU",{"$f":"ROUND((((((1+(E6+E17)/100)*(1+E22/100)*(1+E24/100))/(1-D11/100))-1)*100),2)","v":23.32}]
[]
[]
[]
[null,null,null,"Dedução - Material","Município"]
[null,null,null,0.1,"Simples Nacional"]
[null,null,null,0.2,"Municípios Indefinidos"]
[null,null,null,0.3]
[null,null,null,0.4]
[null,null,null,0.5]
[null,null,null,0.6]
[null,null,null,0.7]
[null,null,null,0.8]
[null,null,null,0.9]
[null,null,null,1]
[null,null,null,{"$f":"E31","v":0}]

{"sheet":"BDI FORN","index":5,"n_rows":37,"n_cols":5,"rows_kept":37,"cut":false,"hidden":false,"merged":[[31,1,31,2],[32,0,34,5],[36,0,36,5],[0,1,2,4],[3,1,4,1],[3,2,4,2],[28,0,28,5],[30,1,30,2]]}
[null,"DETALHAMENTO DO BDI - FORNECIMENTO \n(MATERIAL ASFÁLTICO)"]
[]
[]
[null,"Item","Descrição dos Serviços","%","%"]
[null,null,null,"PV","CD"]
[]
[null,1,"ADMINISTRAÇÃO CENTRAL"," ",3.45]
[null,"1.1","ESCRITÓRIO CENTRAL"," "," "]
[null,"1.2","VIAGENS"," "," "]
[null,"1.3","OUTROS"," "," "]
[null," "," "," "," "]
[null,2,"IMPOSTOS E TAXAS",{"$f":"SUM(D13:D16)","v":3.65},{"$f":"SUM(E13:E16)","v":4.5600000000000005}]
[null,"2.1","ISS (*)",null,{"$f":"ROUND(D13*1.2515,2)","v":0}]
[null,"2.2","PIS",0.65,{"$f":"ROUND(D14*1.2515,2)","v":0.81}]
[null,"2.3","Cofins",3,{"$f":"ROUND(D15*1.2515,2)","v":3.75}]
[null,"2.4","CONTRIBUIÇÃO PREVIDENCIÁRIA SOBRE A RENDA BRUTA",0,{"$f":"ROUND(D16*1.2515,2)","v":0}]
[]
[null,3,"TAXA DE RISCO"," ",{"$f":"SUM(E19:E22)","v":1.08}]
[null,"3.1","SEGURO",null,0.24]
[null,"3.2","RISCO",null,0.6]
[null,"3.3","GARANTIA",null,0.24]
[]
[null,4,"DESPESAS FINANCEIRAS"," ",0.85]
[]
[null,5,"LUCRO",null,5.1100000000000003]
[]
[null," ","BDI - CALCULADO"," ",{"$f":"ROUND((((1+(E7+E18)/100)*(1+E23/100)*(1+E25/100)/(1-D12/100)-1)*100),2)","v":15}]
[]
["BDI = ((1+((AC+S+R+G)/100))x(1+DF/100)x(1+L/100)/(1-I/100)-1)*100"]
[]
[null,"BDI (CALCULADO):",null,{"$f":"ROUND((((1+((E7+E18)/100))*(1+E23/100)*(1+E25/100))/(1-D12/100)-1)*100,2)","v":15},"%"]
[null," "]
[]
[]
[]
[]
["BDI EM CONFORMIDADE COM OS ACÓRDÃOS Nº 2369/2011 e ACÓRDÃO Nº 2.622/2013 - TCU - PLENÁRIO"]

{"sheet":"CRONOGRAMA","index":6,"n_rows":19,"n_cols":12,"rows_kept":19,"cut":false,"hidden":false,"merged":[[0,1,0,11],[1,1,2,1],[1,2,2,4],[1,6,1,11],[2,6,2,11],[9,0,10,0],[9,1,10,1],[9,2,10,2],[3,1,3,10],[5,0,6,0],[5,1,6,1],[5,2,6,2],[7,0,8,0],[7,1,8,1],[7,2,8,2],[15,1,16,2],[18,1,22,11],[11,0,12,0],[11,1,12,1],[11,2,12,2],[13,0,14,0],[13,1,14,1],[13,2,14,2]]}
[null,"CRONOGRAMA FÍSICO-FINANCEIRO"]
[null,"OBRA: ",{"$f":"ORÇAMENTO!C5","v":" PAVIMENTAÇÃO ASFÁLTICA EM CBUQ - VIAS URBANAS DIVERSAS (ÁGUAS VERMELHAS / MG)"},null,null,"VALOR:",{"$f":"ORÇAMENTO!L44","v":1999370.0900000003}]
[{"$nulls":5},"PRAZO: ","180 DIAS "]
[]
[null,"ITEM","ETAPAS/DESCRIÇAO","FISICO/  FINANCEIRO","TOTAL    ETAPAS","MÊS 1","MÊS 2","MÊS 3","MÊS 4","MÊS 5","MÊS 6","TOTAL"]
["A",{"$f":"VLOOKUP(A6,ORÇAMENTO!$A$10:$L$44,2)","v":1},{"$f":"VLOOKUP(A6,ORÇAMENTO!$A$10:$L$44,5)","v":"SERVIÇOS PRELIMINARES "},"FISICO ",{"$f":"ROUND(E7/$G$2,4)","v":0.1101},0.25,0.15,0.15,0.15,0.15,0.15,{"$f":"SUM(F6:K6)","v":1}]
[null,null,null,"FINANCEIRO",{"$f":"ORÇAMENTO!L10","v":220211.07},{"$f":"ROUND($E$7*F6,2)","v":55052.77},{"$f":"ROUND($E$7*G6,2)","v":33031.660000000003},{"$f":"ROUND($E$7*H6,2)","v":33031.660000000003},{"$f":"ROUND($E$7*I6,2)","v":33031.660000000003},33031.660000000003,33031.660000000003,{"$f":"SUM(F7:K7)","v":220211.07}]
["B",{"$f":"VLOOKUP(A8,ORÇAMENTO!$A$10:$L$44,2)","v":2},{"$f":"VLOOKUP(A8,ORÇAMENTO!$A$10:$L$44,5)","v":"TERRAPLANAGEM E PAVIMENTAÇÃO"},"FISICO ",{"$f":"ROUND(E9/$G$2,4)","v":0.19739999999999999},0.1,0.2,0.2,0.2,0.2,0.1,{"$f":"SUM(F8:K8)","v":0.99999999999999989}]
[null,null,null,"FINANCEIRO",{"$f":"ORÇAMENTO!L17","v":394632},{"$f":"ROUND($E$9*F8,2)","v":39463.199999999997},{"$f":"ROUND($E$9*G8,2)","v":78926.399999999994},{"$f":"ROUND($E$9*H8,2)","v":78926.399999999994},{"$f":"ROUND($E$9*I8,2)","v":78926.399999999994},78926.399999999994,39463.199999999997,{"$f":"SUM(F9:K9)","v":394632.00000000006}]
["C",{"$f":"VLOOKUP(A10,ORÇAMENTO!$A$10:$L$44,2)","v":3},{"$f":"VLOOKUP(A10,ORÇAMENTO!$A$10:$L$44,5)","v":"TRANSPORTE DE MATERIAIS"},"FISICO ",{"$f":"ROUND(E11/$G$2,4)","v":0.2142},0.25,0.5,0.25,null,null,null,{"$f":"SUM(F10:K10)","v":1}]
[null,null,null,"FINANCEIRO",{"$f":"ORÇAMENTO!L24","v":428166.8},{"$f":"ROUND($E$11*F10,2)","v":107041.7},{"$f":"ROUND($E$11*G10,2)","v":214083.4},{"$f":"ROUND($E$11*H10,2)","v":107041.7},{"$f":"ROUND($E$11*I10,2)","v":0},0,0,{"$f":"SUM(F11:K11)-0.04","v":428166.76}]
["E",{"$f":"VLOOKUP(A12,ORÇAMENTO!$A$10:$L$44,2)","v":4},{"$f":"VLOOKUP(A12,ORÇAMENTO!$A$10:$L$44,5)","v":"DRENAGEM E OBRAS COMPLEMENTARES"},"FISICO ",{"$f":"ROUND(E13/$G$2,4)","v":0.20399999999999999},0.1,0.2,0.2,0.2,0.2,0.1,{"$f":"SUM(F12:K12)","v":0.99999999999999989}]
[null,null,null,"FINANCEIRO",{"$f":"ORÇAMENTO!L31","v":407803.60000000003},{"$f":"ROUND($E$13*F12,2)","v":40780.36},{"$f":"ROUND($E$13*G12,2)","v":81560.72},{"$f":"ROUND($E$13*H12,2)","v":81560.72},{"$f":"ROUND($E$13*I12,2)","v":81560.72},81560.72,40780.36,{"$f":"SUM(F13:K13)-0.02","v":407803.57999999996}]
["F",{"$f":"VLOOKUP(A14,ORÇAMENTO!$A$10:$L$44,2)","v":5},{"$f":"VLOOKUP(A14,ORÇAMENTO!$A$10:$L$44,5)","v":"FORNECIMENTOS - MATERIAL ASFÁLTICO (BDI DIFERENCIADO)"},"FISICO ",{"$f":"ROUND(E15/$G$2,4)","v":0.27439999999999998},null,0.2,0.2,0.2,0.2,0.2,{"$f":"SUM(F14:K14)","v":1}]
[null,null,null,"FINANCEIRO",{"$f":"ORÇAMENTO!L37","v":548556.62},{"$f":"ROUND($E$15*F14,2)","v":0},109711.32,109711.32,109711.32,109711.32,109711.32,{"$f":"SUM(F15:K15)-0.02","v":548556.58000000007}]
[null,"TOTAL",null,"FISICO ",{"$f":"SUM(F16:K16)","v":0.99999998999684914},{"$f":"F17/$E$17","v":0.12120718981046671},{"$f":"G17/$E$17","v":0.25873824090266345},{"$f":"H17/$E$17","v":0.20520052893258989},{"$f":"I17/$E$17","v":0.15166281696251641},0.15166281696251641,0.11152839642609635,{"$f":"SUM(F16:K16)","v":0.99999998999684914}]
[null,null,null,"FINANCEIRO",{"$f":"E11+E9+E7+E15+E13","v":1999370.0900000003},{"$f":"F11+F9+F7+F15+F13","v":242338.02999999997},{"$f":"G11+G9+G7+G15+G13","v":517313.5},410271.79999999993,303230.09999999998,303230.09999999998,222986.53999999998,{"$f":"SUM(F17:K17)+0.02","v":1999370.0900000003}]
[]
[null,"OBSERVAÇÕES:"]