{"text_format":"2","workbook":"xlsx","n_sheets":6,"sheets":["ORÇAMENTO","CPU-SERV","CPU-FORNEC","BDI SERV","BDI FORN","CRONOGRAMA"],"not_rendered":{"charts":0,"images":4,"macros":0,"external_links":1,"defined_names":8,"comments":2,"pivot_tables":0},"unopened":[],"bounds":{"document_bytes":16777216,"sheet_cells":100000,"run_cost":"one","rows_first":2000,"rows_last":500,"rows_between":2000,"halvings":0,"cell_chars":16384,"cell_head_chars":4096},"cells_cut":0,"cells_raw":0,"read":"whole","date_system":"1900"}

{"sheet":"ORÇAMENTO","index":0,"n_rows":42,"n_cols":12,"rows_kept":42,"cut":false,"hidden":false,"merged":[[4,2,4,7],[5,2,5,7],[7,1,7,11],[6,14,8,15],[41,1,41,4],[0,0,8,0],[0,4,0,11],[1,4,1,11],[2,4,2,11],[6,1,6,4],[9,14,9,15],[41,14,41,15],[4,8,4,10],[5,8,5,10],[6,8,6,10]]}
["<---- NUMERAR SERVIÇOS PARA CPU",null,null,null,"Ministério do Desenvolvimento Regional"]
[{"$nulls":4},"Companhia de Desenvolvimento dos Vales do São Francisco e do Parnaíba"]
[{"$nulls":4},"1ª Superintendência Regional"]
[]
[null,"OBRA: "," PAVIMENTAÇÃO ASFÁLTICA EM CBUQ - VIAS URBANAS DIVERSAS - DISTRITO  DE CONCEIÇÃO DE TEIXEIRAS (AUGUSTO DE LIMA / MG)",{"$nulls":5},"BDI Serviços (%):",null,null,{"$f":"'BDI SERV'!E26","v":24.67}]
[null,"DATA:"," ABRIL / 2025",{"$nulls":5},"BDI Diferenciado Serviços (%):",null,null,{"$f":"'BDI FORN'!D31","v":15}]
[null,"PRAZO DE EXECUÇÃO:     180 DIAS",{"$nulls":6},"BDI Fornecimentos (%):",null,null,{"$f":"'BDI FORN'!D31","v":15}]
[null,"PLANILHA DE ORÇAMENTAÇÃO"]
[null,"ITEM","CÓDIGO","FONTE","DISCRIMINAÇÃO","TIPO","UNID.","QUANT.","VR.UNIT.S/BDI","PR. UNIT.C/BDI","C. TOT.S/BDI","P. TOT.C/BDI"]
["A",1,null,null,"SERVIÇOS PRELIMINARES ",{"$nulls":5},{"$f":"SUM(K11:K15)","v":148843.63999999998},{"$f":"SUM(L11:L15)","v":185550.09000000003}]
{"$rows_left_out":33}
{"sheet":"CPU-SERV","index":1,"n_rows":1721,"n_cols":11,"rows_kept":1721,"cut":false,"hidden":false,"merged":[[1519,2,1519,9],[1485,7,1485,9],[1491,3,1491,7],[1492,7,1492,9],[1520,1,1521,3],[1520,4,1520,5],[1521,4,1521,5],[1522,2,1522,7],[1496,3,1496,7],[1498,8,1498,9],[1505,3,1505,7],[1506,1,1507,2],[1506,3,1507,3],[1506,4,1507,4],[1506,5,1506,7],[1506,9,1507,9],[1565,3,1565,7],[1566,5,1566,7],[1547,3,1547,7],[1549,8,1549,9],[1556,3,1556,7],[1557,1,1558,2],[1557,3,1558,3],[1557,4,1558,4],[1557,5,1557,7],[1557,9,1558,9],[1542,3,1542,7],[1543,7,1543,9],[1471,2,1471,7],[1514,3,1514,7],[1515,5,1515,7],[1518,0,1567,0],[1440,3,1440,7],[1441,7,1441,9],[1531,3,1531,7],[1532,3,1532,7],[1533,3,1533,7],[1536,7,1536,9],[1528,7,1528,9],[1426,7,1426,9],[1480,3,1480,7],[1481,3,1481,7],[1482,3,1482,7],[1365,0,1414,0],[1467,0,1516,0],[1471,8,1471,9],[1472,1,1473,2],[1472,3,1473,3],[1472,4,1472,5],[1472,6,1472,7],[1477,7,1477,9],[1463,3,1463,7],[1464,5,1464,7],[1522,8,1522,9],[1523,1,1524,2],[1523,3,1524,3],[1523,4,1523,5],[1523,6,1523,7],[1469,4,1469,5],[1470,4,1470,5],[1366,2,1366,9],[1367,1,1368,3],[1367,4,1367,5],[1368,4,1368,5],[1369,2,1369,7],[1412,3,1412,7],[1413,5,1413,7],[1416,0,1465,0],[1417,2,1417,9],[1418,1,1419,3],[1418,4,1418,5],[1419,4,1419,5],[1420,2,1420,7],[1394,3,1394,7],[1396,8,1396,9],[1403,3,1403,7],[1404,1,1405,2],[1404,3,1405,3],[1421,1,1422,2],[1421,3,1422,3],[1421,4,1421,5],[1421,6,1421,7],[1455,5,1455,7],[1455,9,1456,9],[1429,3,1429,7],[1430,3,1430,7],[1431,3,1431,7],[1434,7,1434,9],[1468,2,1468,9],[1469,1,1470,3],[1404,4,1405,4],[1404,5,1404,7],[1404,9,1405,9],[1445,3,1445,7],[1447,8,1447,9],[1454,3,1454,7],[1455,1,1456,2],[1455,3,1456,3],[1455,4,1456,4],[1420,8,1420,9],[1319,3,1320,3],[1319,4,1319,5],[1319,6,1319,7],[1324,7,1324,9],[1378,3,1378,7],[1379,3,1379,7],[1380,3,1380,7],[1383,7,1383,9],[1389,3,1389,7],[1390,7,1390,9],[1369,8,1369,9],[1370,1,1371,2],[1370,3,1371,3],[1370,4,1370,5],[1370,6,1370,7],[1375,7,1375,9],[1361,3,1361,7],[1362,5,1362,7],[1314,0,1363,0],[1315,2,1315,9],[1316,1,1317,3],[1316,4,1316,5],[1317,4,1317,5],[1318,2,1318,7],[1292,3,1292,7],[1294,8,1294,9],[1301,3,1301,7],[1302,1,1303,2],[1302,3,1303,3],[1302,4,1303,4],[1302,5,1302,7],[1302,9,1303,9],[1343,3,1343,7],[1345,8,1345,9],[1352,3,1352,7],[1353,1,1354,2],[1353,3,1354,3],[1353,4,1354,4],[1353,5,1353,7],[1353,9,1354,9],[1327,3,1327,7],[1328,3,1328,7],[1329,3,1329,7],[1332,7,1332,9],[1338,3,1338,7],[1339,7,1339,9],[1318,8,1318,9],[1319,1,1320,2],[1281,7,1281,9],[1287,3,1287,7],[1288,7,1288,9],[1267,8,1267,9],[1268,1,1269,2],[1268,3,1269,3],[1268,4,1268,5],[1268,6,1268,7],[1273,7,1273,9],[1259,3,1259,7],[1260,5,1260,7],[1263,0,1312,0],[1264,2,1264,9],[1265,1,1266,3],[1265,4,1265,5],[1266,4,1266,5],[1267,2,1267,7],[1310,3,1310,7],[1311,5,1311,7],[1276,3,1276,7],[1277,3,1277,7],[1278,3,1278,7],[1251,5,1251,7],[1251,9,1252,9],[1225,3,1225,7],[1226,3,1226,7],[1227,3,1227,7],[1230,7,1230,9],[1236,3,1236,7],[1237,7,1237,9],[1216,8,1216,9],[1217,1,1218,2],[1217,3,1218,3],[1217,4,1217,5],[1217,6,1217,7],[1222,7,1222,9],[1115,3,1116,3],[1115,4,1115,5],[1115,6,1115,7],[1120,7,1120,9],[1174,3,1174,7],[1175,3,1175,7],[1176,3,1176,7],[1179,7,1179,9],[1185,3,1185,7],[1186,7,1186,9],[1165,8,1165,9],[1166,1,1167,2],[1166,3,1167,3],[1166,4,1166,5],[1166,6,1166,7],[1171,7,1171,9],[1157,3,1157,7],[1158,5,1158,7],[1161,0,1210,0],[1162,2,1162,9],[1163,1,1164,3],[1163,4,1163,5],[1164,4,1164,5],[1165,2,1165,7],[1208,3,1208,7],[1209,5,1209,7],[1212,0,1261,0],[1213,2,1213,9],[1214,1,1215,3],[1214,4,1214,5],[1215,4,1215,5],[1216,2,1216,7],[1190,3,1190,7],[1192,8,1192,9],[1199,3,1199,7],[1200,1,1201,2],[1200,3,1201,3],[1200,4,1201,4],[1200,5,1200,7],[1200,9,1201,9],[1241,3,1241,7],[1243,8,1243,9],[1250,3,1250,7],[1251,1,1252,2],[1251,3,1252,3],[1251,4,1252,4],[1110,0,1159,0],[1111,2,1111,9],[1112,1,1113,3],[1112,4,1112,5],[1113,4,1113,5],[1114,2,1114,7],[1088,3,1088,7],[1090,8,1090,9],[1097,3,1097,7],[1098,1,1099,2],[1098,3,1099,3],[1098,4,1099,4],[1098,5,1098,7],[1098,9,1099,9],[1139,3,1139,7],[1141,8,1141,9],[1148,3,1148,7],[1149,1,1150,2],[1149,3,1150,3],[1149,4,1150,4],[1149,5,1149,7],[1149,9,1150,9],[1123,3,1123,7],[1124,3,1124,7],[1061,4,1061,5],[1062,4,1062,5],[1063,2,1063,7],[1106,3,1106,7],[1107,5,1107,7],[1047,5,1047,7],[1047,9,1048,9],[1021,3,1021,7],[1022,3,1022,7],[1023,3,1023,7],[1026,7,1026,9],[1032,3,1032,7],[1033,7,1033,9],[1125,3,1125,7],[1128,7,1128,9],[1134,3,1134,7],[1135,7,1135,9],[1114,8,1114,9],[1115,1,1116,2],[1077,7,1077,9],[1083,3,1083,7],[1084,7,1084,9],[1063,8,1063,9],[1064,1,1065,2],[1064,3,1065,3],[1064,4,1064,5],[1064,6,1064,7],[1069,7,1069,9],[1055,3,1055,7],[1056,5,1056,7],[1018,7,1018,9],[1072,3,1072,7],[1073,3,1073,7],[1074,3,1074,7],[957,0,1006,0],[958,2,958,9],[959,1,960,3],[959,4,959,5],[960,4,960,5],[961,2,961,7],[1004,3,1004,7],[1005,5,1005,7],[1008,0,1057,0],[1009,2,1009,9],[1010,1,1011,3],[1010,4,1010,5],[1011,4,1011,5],[1012,2,1012,7],[986,3,986,7],[988,8,988,9],[995,3,995,7],[996,1,997,2],[996,3,997,3],[1059,0,1108,0],[1060,2,1060,9],[1061,1,1062,3],[996,4,997,4],[996,5,996,7],[996,9,997,9],[1037,3,1037,7],[1039,8,1039,9],[1046,3,1046,7],[1047,1,1048,2],[1047,3,1048,3],[1047,4,1048,4],[911,3,912,3],[911,4,911,5],[911,6,911,7],[916,7,916,9],[970,3,970,7],[971,3,971,7],[972,3,972,7],[975,7,975,9],[981,3,981,7],[982,7,982,9],[961,8,961,9],[962,1,963,2],[962,3,963,3],[962,4,962,5],[962,6,962,7],[967,7,967,9],[953,3,953,7],[954,5,954,7],[1012,8,1012,9],[1013,1,1014,2],[1013,3,1014,3],[1013,4,1013,5],[1013,6,1013,7],[906,0,955,0],[907,2,907,9],[908,1,909,3],[908,4,908,5],[909,4,909,5],[910,2,910,7],[888,3,888,7],[890,8,890,9],[895,3,895,7],[896,1,897,2],[896,3,897,3],[896,4,897,4],[896,5,896,7],[896,9,897,9],[935,3,935,7],[937,8,937,9],[944,3,944,7],[945,1,946,2],[945,3,946,3],[945,4,946,4],[945,5,945,7],[945,9,946,9],[919,3,919,7],[920,3,920,7],[921,3,921,7],[924,7,924,9],[930,3,930,7],[931,7,931,9],[910,8,910,9],[911,1,912,2],[850,3,851,3],[850,4,851,4],[850,5,850,7],[850,9,851,9],[873,3,873,7],[874,3,874,7],[875,3,875,7],[878,7,878,9],[884,3,884,7],[885,7,885,9],[864,8,864,9],[865,1,866,2],[865,3,866,3],[865,4,865,5],[865,6,865,7],[870,7,870,9],[860,0,904,0],[861,2,861,9],[862,1,863,3],[862,4,862,5],[863,4,863,5],[864,2,864,7],[902,3,902,7],[903,5,903,7],[810,3,810,7],[811,5,811,7],[775,0,812,0],[776,2,776,9],[777,1,778,3],[777,4,777,5],[778,4,778,5],[779,2,779,7],[827,3,827,7],[828,3,828,7],[829,3,829,7],[832,7,832,9],[838,3,838,7],[839,7,839,9],[818,8,818,9],[819,1,820,2],[819,3,820,3],[819,4,819,5],[819,6,819,7],[824,7,824,9],[814,0,858,0],[815,2,815,9],[816,1,817,3],[816,4,816,5],[817,4,817,5],[818,2,818,7],[856,3,856,7],[857,5,857,7],[842,3,842,7],[844,8,844,9],[849,3,849,7],[850,1,851,2],[767,3,768,3],[767,4,768,4],[767,5,767,7],[767,9,768,9],[800,3,800,7],[802,8,802,9],[805,3,805,7],[806,1,807,2],[806,3,807,3],[806,4,807,4],[806,5,806,7],[806,9,807,9],[788,3,788,7],[789,3,789,7],[790,3,790,7],[793,7,793,9],[796,3,796,7],[797,7,797,9],[779,8,779,9],[780,1,781,2],[780,3,781,3],[780,4,780,5],[780,6,780,7],[785,7,785,9],[730,3,730,7],[731,5,731,7],[695,0,732,0],[696,2,696,9],[697,1,698,3],[697,4,697,5],[698,4,698,5],[699,2,699,7],[747,3,747,7],[748,3,748,7],[749,3,749,7],[752,7,752,9],[757,3,757,7],[758,7,758,9],[738,8,738,9],[739,1,740,2],[739,3,740,3],[739,4,739,5],[739,6,739,7],[744,7,744,9],[734,0,773,0],[735,2,735,9],[736,1,737,3],[736,4,736,5],[737,4,737,5],[738,2,738,7],[771,3,771,7],[772,5,772,7],[761,3,761,7],[763,8,763,9],[766,3,766,7],[767,1,768,2],[687,3,688,3],[687,4,688,4],[687,5,687,7],[687,9,688,9],[720,3,720,7],[722,8,722,9],[725,3,725,7],[726,1,727,2],[726,3,727,3],[726,4,727,4],[726,5,726,7],[726,9,727,9],[708,3,708,7],[709,3,709,7],[710,3,710,7],[713,7,713,9],[716,3,716,7],[717,7,717,9],[699,8,699,9],[700,1,701,2],[700,3,701,3],[700,4,700,5],[700,6,700,7],[705,7,705,9],[669,3,669,7],[670,3,670,7],[671,3,671,7],[674,7,674,9],[677,3,677,7],[678,7,678,9],[660,8,660,9],[661,1,662,2],[661,3,662,3],[661,4,661,5],[661,6,661,7],[666,7,666,9],[652,3,652,7],[653,5,653,7],[656,0,693,0],[657,2,657,9],[658,1,659,3],[658,4,658,5],[659,4,659,5],[660,2,660,7],[691,3,691,7],[692,5,692,7],[617,0,654,0],[618,2,618,9],[619,1,620,3],[619,4,619,5],[620,4,620,5],[621,2,621,7],[681,3,681,7],[683,8,683,9],[686,3,686,7],[687,1,688,2],[642,3,642,7],[644,8,644,9],[647,3,647,7],[648,1,649,2],[648,3,649,3],[648,4,649,4],[648,5,648,7],[648,9,649,9],[630,3,630,7],[631,3,631,7],[632,3,632,7],[635,7,635,9],[638,3,638,7],[639,7,639,9],[621,8,621,9],[622,1,623,2],[622,3,623,3],[622,4,622,5],[622,6,622,7],[627,7,627,9],[600,7,600,9],[582,8,582,9],[583,1,584,2],[583,3,584,3],[583,4,583,5],[583,6,583,7],[588,7,588,9],[535,3,535,7],[536,5,536,7],[578,0,615,0],[579,2,579,9],[580,1,581,3],[580,4,580,5],[581,4,581,5],[582,2,582,7],[613,3,613,7],[614,5,614,7],[500,0,537,0],[501,2,501,9],[502,1,503,3],[502,4,502,5],[503,4,503,5],[603,3,603,7],[605,8,605,9],[608,3,608,7],[609,1,610,2],[609,3,610,3],[609,4,610,4],[609,5,609,7],[609,9,610,9],[514,3,514,7],[515,3,515,7],[518,7,518,9],[521,3,521,7],[522,7,522,9],[504,8,504,9],[505,1,506,2],[505,3,506,3],[505,4,505,5],[505,6,505,7],[510,7,510,9],[591,3,591,7],[592,3,592,7],[593,3,593,7],[596,7,596,9],[599,3,599,7],[504,2,504,7],[434,8,434,9],[437,3,437,7],[438,1,439,2],[438,3,439,3],[438,4,439,4],[438,5,438,7],[438,9,439,9],[488,1,489,2],[488,3,489,3],[488,4,489,4],[488,5,488,7],[488,9,489,9],[496,3,496,7],[478,3,478,7],[480,8,480,9],[487,3,487,7],[513,3,513,7],[471,7,471,8],[497,5,497,7],[525,3,525,7],[527,8,527,9],[530,3,530,7],[531,1,532,2],[531,3,532,3],[531,4,532,4],[531,5,531,7],[531,9,532,9],[373,6,373,7],[378,7,378,9],[420,3,420,7],[421,3,421,7],[422,3,422,7],[425,7,425,9],[428,3,428,7],[429,7,429,9],[411,8,411,9],[412,1,413,2],[412,3,413,3],[412,4,412,5],[412,6,412,7],[418,7,418,9],[403,3,403,7],[404,5,404,7],[382,3,382,7],[383,3,383,7],[386,7,386,9],[389,3,389,7],[390,7,390,9],[476,7,476,9],[432,3,432,7],[407,0,444,0],[408,2,408,9],[409,1,410,3],[409,4,409,5],[410,4,410,5],[411,2,411,7],[442,3,442,7],[443,5,443,7],[387,7,387,8],[368,0,405,0],[369,2,369,9],[370,1,371,3],[370,4,370,5],[371,4,371,5],[372,2,372,7],[354,3,354,7],[356,8,356,9],[359,3,359,7],[360,1,361,2],[360,3,361,3],[360,4,361,4],[360,5,360,7],[360,9,361,9],[393,3,393,7],[395,8,395,9],[398,3,398,7],[399,1,400,2],[399,3,400,3],[399,4,400,4],[399,5,399,7],[399,9,400,9],[381,3,381,7],[372,8,372,9],[373,1,374,2],[373,3,374,3],[373,4,373,5],[342,3,342,7],[343,3,343,7],[344,3,344,7],[347,7,347,9],[350,3,350,7],[351,7,351,9],[333,8,333,9],[334,1,335,2],[334,3,335,3],[334,4,334,5],[334,6,334,7],[339,7,339,9],[329,0,366,0],[330,2,330,9],[331,1,332,3],[331,4,331,5],[332,4,332,5],[333,2,333,7],[364,3,364,7],[365,5,365,7],[348,7,348,8],[315,3,315,7],[317,8,317,9],[320,3,320,7],[321,1,322,2],[321,3,322,3],[321,4,322,4],[321,5,321,7],[321,9,322,9],[278,5,278,7],[278,9,279,9],[260,3,260,7],[261,3,261,7],[248,6,248,7],[257,7,257,9],[303,3,303,7],[304,3,304,7],[305,3,305,7],[308,7,308,9],[311,3,311,7],[312,7,312,9],[290,8,290,9],[291,1,292,2],[291,3,292,3],[291,4,291,5],[291,6,291,7],[300,7,300,9],[282,3,282,7],[283,5,283,7],[262,3,262,7],[265,7,265,9],[268,3,268,7],[269,7,269,9],[247,8,247,9],[248,1,249,2],[248,3,249,3],[248,4,248,5],[209,6,209,7],[214,7,214,9],[239,3,239,7],[240,5,240,7],[219,3,219,7],[222,7,222,9],[225,3,225,7],[226,7,226,9],[286,0,327,0],[287,2,287,9],[288,1,289,3],[288,4,288,5],[289,4,289,5],[290,2,290,7],[325,3,325,7],[326,5,326,7],[243,0,284,0],[244,2,244,9],[245,1,246,3],[245,4,245,5],[246,4,246,5],[247,2,247,7],[272,3,272,7],[274,8,274,9],[277,3,277,7],[278,1,279,2],[278,3,279,3],[278,4,279,4],[204,0,241,0],[205,2,205,9],[206,1,207,3],[206,4,206,5],[207,4,207,5],[208,2,208,7],[190,3,190,7],[192,8,192,9],[195,3,195,7],[196,1,197,2],[196,3,197,3],[196,4,197,4],[196,5,196,7],[196,9,197,9],[229,3,229,7],[231,8,231,9],[234,3,234,7],[235,1,236,2],[235,3,236,3],[235,4,236,4],[235,5,235,7],[235,9,236,9],[217,3,217,7],[218,3,218,7],[208,8,208,9],[209,1,210,2],[209,3,210,3],[209,4,209,5],[163,0,202,0],[200,3,200,7],[201,5,201,7],[178,3,178,7],[179,3,179,7],[180,3,180,7],[183,7,183,9],[186,3,186,7],[187,7,187,9],[167,8,167,9],[168,1,169,2],[168,3,169,3],[168,4,168,5],[168,6,168,7],[173,7,173,9],[164,2,164,9],[165,1,166,3],[165,4,165,5],[166,4,166,5],[167,2,167,7],[151,8,151,9],[154,3,154,7],[155,1,156,2],[155,3,156,3],[155,4,156,4],[155,5,155,7],[155,9,156,9],[136,3,136,7],[137,3,137,7],[140,7,140,9],[145,3,145,7],[146,7,146,9],[149,3,149,7],[127,1,128,2],[127,3,128,3],[127,4,127,5],[127,6,127,7],[132,7,132,9],[135,3,135,7],[119,5,119,7],[122,0,161,0],[123,2,123,9],[124,1,125,3],[124,4,124,5],[125,4,125,5],[126,2,126,7],[126,8,126,9],[159,3,159,7],[160,5,160,7],[114,1,115,2],[114,3,115,3],[114,4,115,4],[114,5,114,7],[114,9,115,9],[118,3,118,7],[93,7,93,9],[98,3,98,7],[101,7,101,9],[104,3,104,7],[105,7,105,9],[108,3,108,7],[83,0,120,0],[84,2,84,9],[85,1,86,3],[86,4,86,5],[87,2,87,7],[87,8,87,9],[88,1,89,2],[110,8,110,9],[113,3,113,7],[96,3,96,7],[97,3,97,7],[88,3,89,3],[88,4,88,5],[88,6,88,7],[79,3,79,7],[80,5,80,7],[85,4,85,5],[74,3,74,7],[75,1,76,2],[75,3,76,3],[75,4,76,4],[75,5,75,7],[75,9,76,9],[57,3,57,7],[60,7,60,9],[63,3,63,7],[64,7,64,9],[69,3,69,7],[71,8,71,9],[44,3,45,3],[44,4,44,5],[44,6,44,7],[49,7,49,9],[55,3,55,7],[56,3,56,7],[41,1,42,3],[41,4,41,5],[42,4,42,5],[43,2,43,7],[43,8,43,9],[44,1,45,2],[0,0,37,0],[3,4,3,5],[2,4,2,5],[1,2,1,9],[2,1,3,3],[31,3,32,3],[31,4,32,4],[31,5,31,7],[31,9,32,9],[35,3,35,7],[36,5,36,7],[10,7,10,9],[13,3,13,7],[14,3,14,7],[15,3,15,7],[18,7,18,9],[30,3,30,7],[31,1,32,2],[22,7,22,9],[25,3,25,7],[1608,5,1608,7],[1608,9,1609,9],[1616,3,1616,7],[1617,5,1617,7],[27,8,27,9],[21,3,21,7],[4,2,4,7],[4,8,4,9],[5,1,6,2],[5,3,6,3],[5,4,5,5],[5,6,5,7],[446,0,498,0],[447,2,447,9],[448,1,449,3],[448,4,448,5],[449,4,449,5],[450,2,450,7],[450,8,450,9],[451,1,452,2],[451,3,452,3],[451,4,451,5],[451,6,451,7],[459,7,459,9],[461,3,461,7],[462,3,462,7],[463,3,463,7],[466,7,466,9],[475,3,475,7],[39,0,81,0],[40,2,40,9],[539,0,576,0],[1622,4,1622,5],[1633,3,1633,7],[1634,3,1634,7],[1620,0,1669,0],[1621,2,1621,9],[1569,0,1618,0],[1570,2,1570,9],[1571,1,1572,3],[1571,4,1571,5],[1572,4,1572,5],[1573,2,1573,7],[1573,8,1573,9],[1574,1,1575,2],[1574,3,1575,3],[1574,4,1574,5],[1574,6,1574,7],[1579,7,1579,9],[1582,3,1582,7],[1583,3,1583,7],[1584,3,1584,7],[1587,7,1587,9],[1593,3,1593,7],[1594,7,1594,9],[1598,3,1598,7],[1600,8,1600,9],[1607,3,1607,7],[1608,1,1609,2],[1608,3,1609,3],[1608,4,1609,4],[1702,8,1702,9],[1709,3,1709,7],[1710,1,1711,2],[1710,3,1711,3],[1622,1,1623,3],[1623,4,1623,5],[1624,2,1624,7],[1624,8,1624,9],[1625,1,1626,2],[1625,3,1626,3],[1625,4,1625,5]],"merged_total":1067,"flags":["merged_cut"]}
[1,"1ª/GRD",{"$nulls":8},{"$f":"J37","v":8225.23}]
[null,"OBRA:"," PAVIMENTAÇÃO ASFÁLTICA EM CBUQ - VIAS URBANAS DIVERSAS - DISTRITO  DE CONCEIÇÃO DE TEIXEIRAS (AUGUSTO DE LIMA / MG)"]
[null,"Custo Unitário de Referência",null,null,"Minas Gerais"]
[{"$nulls":4}," Janeiro/2025 ",null,null,"Produção da equipe ",1,{"$f":"VLOOKUP(A1,ORÇAMENTO!$A$10:$L$42,7,1)","v":"GL"}]
[null,"CPU.1","MOBILIZAÇÃO E DESMOBILIZAÇÃO",{"$nulls":5},"Valores em reais (R$)"]
[null,"A - EQUIPAMENTOS",null,"Quantidade","Utilização",null,"Custo Horário",null,null,"Custo"]
[{"$nulls":4},"Operativa","Improdutiva","Produtivo","Improdutivo",null,"Horário Total"]
[null,"E9687","Caminhão carroceria com capacidade de 5 t - 115 kW",8,0.6,0.4,146.88079999999999,57.423099999999998,null,{"$f":"D8*(E8*G8+F8*H8)","v":888.78175999999996}]
[null,"E9575","Caminhão basculante com caçamba estanque com capacidade de 14 m³ - 210 kW",8,1,0,309.83940000000001,90.412199999999999,null,{"$f":"D9*(E9*G9+F9*H9)","v":2478.7152000000001}]
[{"$nulls":7},"Custo horário total de equipamentos",null,{"$f":"SUM(J8:J9)","v":3367.4969599999999}]
{"$rows_left_out":1712}
{"sheet":"CPU-FORNEC","index":2,"n_rows":92,"n_cols":14,"rows_kept":92,"cut":false,"hidden":false,"merged":[[81,1,81,7],[82,0,91,0],[82,1,82,3],[82,4,82,7],[83,2,83,5],[84,2,84,3],[85,1,85,7],[88,1,88,3],[88,5,88,6],[89,1,89,6],[90,1,90,6],[91,1,91,6],[60,0,69,0],[60,1,60,3],[60,4,60,7],[61,2,61,5],[62,2,62,3],[63,1,63,7],[66,1,66,3],[66,5,66,6],[67,1,67,6],[68,1,68,6],[69,1,69,6],[38,0,47,0],[38,1,38,3],[38,4,38,7],[39,2,39,5],[40,2,40,3],[41,1,41,7],[44,1,44,3],[44,5,44,6],[45,1,45,6],[46,1,46,6],[47,1,47,6],[22,5,22,6],[23,1,23,6],[24,1,24,6],[25,1,25,6],[5,1,5,7],[9,1,9,7],[13,1,13,7],[17,1,17,7],[0,10,0,11],[1,2,1,5],[1,10,1,11],[2,2,2,3],[3,1,3,7],[27,4,27,7],[28,2,28,5],[27,0,36,0],[29,2,29,3],[30,1,30,7],[33,1,33,3],[33,5,33,6],[34,1,34,6],[35,1,35,6],[36,1,36,6],[0,0,26,0],[0,1,0,3],[0,4,0,7],[22,1,22,3],[49,0,58,0],[49,1,49,3],[49,4,49,7],[50,2,50,5],[51,2,51,3],[52,1,52,7],[55,1,55,3],[55,5,55,6],[56,1,56,6],[57,1,57,6],[58,1,58,6],[27,1,27,3],[71,0,80,0],[71,1,71,3],[71,4,71,7],[72,2,72,5],[73,2,73,3],[74,1,74,7],[77,1,77,3],[77,5,77,6],[78,1,78,6],[79,1,79,6],[80,1,80,6]]}
[1,"CODEVASF",null,null," COMPOSIÇÃO DE PREÇO UNITÁRIO",null,null,null,{"$f":"H24","v":0},{"$f":"H26","v":0},"BDI CALCULADO:",null,{"$f":"ORÇAMENTO!L5","v":24.67}]
[null,"OBRA:  "," PAVIMENTAÇÃO ASFÁLTICA EM CBUQ - VIAS URBANAS DIVERSAS - DISTRITO  DE CONCEIÇÃO DE TEIXEIRAS (AUGUSTO DE LIMA / MG)",null,null,null,"DATA: ",{"$f":"ORÇAMENTO!C6","v":" ABRIL / 2025"},null,null,"BDI DIFERENCIADO:",null,{"$f":"'BDI FORN'!D31/100","v":0.15}]
[null,"SERVIÇO:  ","CPU.1",null,"Referência:","CODEVASF","UNIDADE: ",{"$f":"VLOOKUP(A1,ORÇAMENTO!A11:L30,5)","v":"MOBILIZAÇÃO E DESMOBILIZAÇÃO"}]
[]
[null,"TIPO ITEM","CODIGO ITEM","DESCRIÇÃO ITEM","UNIDADE ITEM","COEFICIENTE","PRECO UNITARIO","CUSTO TOTAL",null,"distancia =",90,"B.DESPACHO"]
[null,"EQUIPAMENTOS",{"$nulls":7},"Pá carregadeira ",null,null,10.1," ton"]
[null,null,"E9001","E9001","E9001",null,"E9001"]
[]
[]
[null,"MÃO DE OBRA"]
{"$rows_left_out":83}
{"sheet":"BDI SERV","index":3,"n_rows":60,"n_cols":5,"rows_kept":60,"cut":false,"hidden":false,"merged":[[35,0,35,5],[36,0,36,5],[38,1,38,4],[39,2,39,3],[0,1,2,4],[25,1,25,3],[26,1,26,2],[26,3,26,4],[27,3,27,4]]}
[null,"DETALHAMENTO DO BDI - SERVIÇOS"]
[]
[]
[null,"Item","Descrição dos Serviços","% - PV","% - CD"]
[]
[null,1,"ADMINISTRAÇÃO CENTRAL"," ",{"$f":"SUM(E7:E9)","v":4.01}]
[null,"1.1","ESCRITÓRIO CENTRAL",null,4.01]
[null,"1.2","VIAGENS"]
[null,"1.3","OUTROS"]
[null," "," "," "," "]
{"$rows_left_out":51}
{"sheet":"BDI FORN","index":4,"n_rows":37,"n_cols":5,"rows_kept":37,"cut":false,"hidden":false,"merged":[[31,1,31,2],[32,0,34,5],[36,0,36,5],[0,1,2,4],[3,1,4,1],[3,2,4,2],[28,0,28,5],[30,1,30,2]]}
[null,"DETALHAMENTO DO BDI - FORNECIMENTO \n(MATERIAL ASFÁLTICO)"]
[]
[]
[null,"Item","Descrição dos Serviços","%","%"]
[null,null,null,"PV","CD"]
[]
[null,1,"ADMINISTRAÇÃO CENTRAL"," ",3.45]
[null,"1.1","ESCRITÓRIO CENTRAL"," "," "]
[null,"1.2","VIAGENS"," "," "]
[null,"1.3","OUTROS"," "," "]
{"$rows_left_out":28}
{"sheet":"CRONOGRAMA","index":5,"n_rows":19,"n_cols":12,"rows_kept":19,"cut":false,"hidden":false,"merged":[[0,1,0,11],[1,1,2,1],[1,2,2,4],[1,6,1,11],[2,6,2,11],[9,0,10,0],[9,1,10,1],[9,2,10,2],[3,1,3,10],[5,0,6,0],[5,1,6,1],[5,2,6,2],[7,0,8,0],[7,1,8,1],[7,2,8,2],[15,1,16,2],[18,1,22,11],[11,0,12,0],[11,1,12,1],[11,2,12,2],[13,0,14,0],[13,1,14,1],[13,2,14,2]]}
[null,"CRONOGRAMA FÍSICO-FINANCEIRO"]
[null,"OBRA: ",{"$f":"ORÇAMENTO!C5","v":" PAVIMENTAÇÃO ASFÁLTICA EM CBUQ - VIAS URBANAS DIVERSAS - DISTRITO  DE CONCEIÇÃO DE TEIXEIRAS (AUGUSTO DE LIMA / MG)"},null,null,"VALOR:",{"$f":"ORÇAMENTO!L42","v":1999276.8}]
[{"$nulls":5},"PRAZO: ","180 DIAS "]
[]
[null,"ITEM","ETAPAS/DESCRIÇAO","FISICO/  FINANCEIRO","TOTAL    ETAPAS","MÊS 1","MÊS 2","MÊS 3","MÊS 4","MÊS 5","MÊS 6","TOTAL"]
["A",{"$f":"VLOOKUP(A6,ORÇAMENTO!$A$10:$L$42,2)","v":1},{"$f":"VLOOKUP(A6,ORÇAMENTO!$A$10:$L$42,5)","v":"SERVIÇOS PRELIMINARES "},"FISICO ",{"$f":"ROUND(E7/$G$2,4)","v":9.2799999999999994E-2},0.25,0.15,0.15,0.15,0.15,0.15,{"$f":"SUM(F6:K6)","v":1}]
[null,null,null,"FINANCEIRO",{"$f":"ORÇAMENTO!L10","v":185550.09000000003},{"$f":"ROUND($E$7*F6,2)","v":46387.519999999997},{"$f":"ROUND($E$7*G6,2)","v":27832.51},{"$f":"ROUND($E$7*H6,2)","v":27832.51},{"$f":"ROUND($E$7*I6,2)","v":27832.51},27832.51,27832.51,{"$f":"SUM(F7:K7)","v":185550.07}]
["B",{"$f":"VLOOKUP(A8,ORÇAMENTO!$A$10:$L$42,2)","v":2},{"$f":"VLOOKUP(A8,ORÇAMENTO!$A$10:$L$42,5)","v":"TERRAPLANAGEM E PAVIMENTAÇÃO"},"FISICO ",{"$f":"ROUND(E9/$G$2,4)","v":0.19919999999999999},0.1,0.2,0.2,0.2,0.2,0.1,{"$f":"SUM(F8:K8)","v":0.99999999999999989}]
[null,null,null,"FINANCEIRO",{"$f":"ORÇAMENTO!L16","v":398255.9},{"$f":"ROUND($E$9*F8,2)","v":39825.589999999997},{"$f":"ROUND($E$9*G8,2)","v":79651.179999999993},{"$f":"ROUND($E$9*H8,2)","v":79651.179999999993},{"$f":"ROUND($E$9*I8,2)","v":79651.179999999993},79651.179999999993,39825.589999999997,{"$f":"SUM(F9:K9)","v":398255.9}]
["C",{"$f":"VLOOKUP(A10,ORÇAMENTO!$A$10:$L$42,2)","v":3},{"$f":"VLOOKUP(A10,ORÇAMENTO!$A$10:$L$42,5)","v":"TRANSPORTE DE MATERIAIS"},"FISICO ",{"$f":"ROUND(E11/$G$2,4)","v":0.21740000000000001},0.25,0.5,0.25,null,null,null,{"$f":"SUM(F10:K10)","v":1}]
{"$rows_left_out":9}