{"text_format":"2","workbook":"xlsx","n_sheets":6,"sheets":["ORÇAMENTO","CPU-SERV","CPU-FORNEC","BDI SERV","BDI FORN","CRONOGRAMA"],"not_rendered":{"charts":0,"images":4,"macros":0,"external_links":1,"defined_names":8,"comments":2,"pivot_tables":0},"unopened":[],"bounds":{"document_bytes":16777216,"sheet_cells":100000,"run_cost":"one","rows_first":2000,"rows_last":500,"rows_between":2000,"halvings":0,"cell_chars":16384,"cell_head_chars":4096},"cells_cut":0,"cells_raw":0,"read":"whole","date_system":"1900"}

{"sheet":"ORÇAMENTO","index":0,"n_rows":42,"n_cols":12,"rows_kept":42,"cut":false,"hidden":false,"merged":[[4,2,4,7],[5,2,5,7],[7,1,7,11],[6,14,8,15],[41,1,41,4],[0,0,8,0],[0,4,0,11],[1,4,1,11],[2,4,2,11],[6,1,6,4],[9,14,9,15],[41,14,41,15],[4,8,4,10],[5,8,5,10],[6,8,6,10]]}
["<---- NUMERAR SERVIÇOS PARA CPU",null,null,null,"Ministério do Desenvolvimento Regional"]
[{"$nulls":4},"Companhia de Desenvolvimento dos Vales do São Francisco e do Parnaíba"]
[{"$nulls":4},"1ª Superintendência Regional"]
[]
[null,"OBRA: "," PAVIMENTAÇÃO ASFÁLTICA EM CBUQ - VIAS URBANAS DIVERSAS - DISTRITO  DE CONCEIÇÃO DE TEIXEIRAS (AUGUSTO DE LIMA / MG)",{"$nulls":5},"BDI Serviços (%):",null,null,{"$f":"'BDI SERV'!E26","v":24.67}]
[null,"DATA:"," ABRIL / 2025",{"$nulls":5},"BDI Diferenciado Serviços (%):",null,null,{"$f":"'BDI FORN'!D31","v":15}]
[null,"PRAZO DE EXECUÇÃO:     180 DIAS",{"$nulls":6},"BDI Fornecimentos (%):",null,null,{"$f":"'BDI FORN'!D31","v":15}]
[null,"PLANILHA DE ORÇAMENTAÇÃO"]
[null,"ITEM","CÓDIGO","FONTE","DISCRIMINAÇÃO","TIPO","UNID.","QUANT.","VR.UNIT.S/BDI","PR. UNIT.C/BDI","C. TOT.S/BDI","P. TOT.C/BDI"]
["A",1,null,null,"SERVIÇOS PRELIMINARES ",{"$nulls":5},{"$f":"SUM(K11:K15)","v":148843.63999999998},{"$f":"SUM(L11:L15)","v":185550.09000000003}]
[1,"1.1","CPU.1","CODEVASF","MOBILIZAÇÃO E DESMOBILIZAÇÃO","SERV","GL",1,{"$f":"VLOOKUP(A11,'CPU-SERV'!A:K,11,0)","v":8225.23},{"$f":"TRUNC(_xlfn.IFS(F11=\"SERV\",I11*(1+$L$5/100),F11=\"SERV DIF\",I11*(1+$L$6/100),F11=\"FORN\",I11*(1+$L$7/100)),2)","v":10254.39},{"$f":"TRUNC(H11*I11,2)","v":8225.23},{"$f":"TRUNC(H11*J11,2)","v":10254.39}]
[2,"1.2","CPU.2","CODEVASF","ADMINISTRAÇÃO LOCAL ","SERV","GL",1,{"$f":"VLOOKUP(A12,'CPU-SERV'!A:K,11,0)","v":124725.18},{"$f":"TRUNC(_xlfn.IFS(F12=\"SERV\",I12*(1+$L$5/100),F12=\"SERV DIF\",I12*(1+$L$6/100),F12=\"FORN\",I12*(1+$L$7/100)),2)","v":155494.88},{"$f":"TRUNC(H12*I12,2)","v":124725.18},{"$f":"TRUNC(H12*J12,2)","v":155494.88}]
[3,"1.3","CPU.3","CODEVASF","CANTEIRO DE OBRAS ","SERV","GL",1,{"$f":"VLOOKUP(A13,'CPU-SERV'!A:K,11,0)","v":7137.55},{"$f":"TRUNC(_xlfn.IFS(F13=\"SERV\",I13*(1+$L$5/100),F13=\"SERV DIF\",I13*(1+$L$6/100),F13=\"FORN\",I13*(1+$L$7/100)),2)","v":8898.3799999999992},7137.55,8898.3799999999992]
[4,"1.4",103689,"SINAPI","PLACA DE OBRA EM CHAPA DE AÇO GALVANIZADO","SERV","M2",4,{"$f":"VLOOKUP(A14,'CPU-SERV'!A:K,11,0)","v":351.42},{"$f":"TRUNC(_xlfn.IFS(F14=\"SERV\",I14*(1+$L$5/100),F14=\"SERV DIF\",I14*(1+$L$6/100),F14=\"FORN\",I14*(1+$L$7/100)),2)","v":438.11},1405.68,1752.44]
[6,"1.5",78472,"SINAPI","SERVIÇOS TOPOGRÁFICOS PARA PAVIMENTAÇÃO, INCLUSIVE LEVANTAMENTO PLANIALTIMÉTRICO CADASTRAL, GERAÇÃO DE NOTAS DE SERVIÇO, SEÇÕES TRANSVERSAIS E GREIDE, ESTAQUEAMENTO E ACOMPANHAMENTO EXECUTIVO","SERV","M2",15000,{"$f":"VLOOKUP(A15,'CPU-SERV'!A:K,11,0)","v":0.49},{"$f":"TRUNC(_xlfn.IFS(F15=\"SERV\",I15*(1+$L$5/100),F15=\"SERV DIF\",I15*(1+$L$6/100),F15=\"FORN\",I15*(1+$L$7/100)),2)","v":0.61},7350,9150]
["B",2,null,null,"TERRAPLANAGEM E PAVIMENTAÇÃO",{"$nulls":5},{"$f":"SUM(K17:K22)","v":319767.90000000002},{"$f":"SUM(L17:L22)","v":398255.9}]
[7,"2.1",5502140,"SICRO","ESCAVAÇÃO, CARGA E TRANSPORTE DE MATERIAL DE 1ª CATEGORIA - DMT 1.000 A 1.200M, CAMINHO DE SERVIÇO EM REVESTIMENTO PRIMÁRIO","SERV","M3",4500,{"$f":"VLOOKUP(A17,'CPU-SERV'!A:K,11,0)","v":6.74},{"$f":"TRUNC(_xlfn.IFS(F17=\"SERV\",I17*(1+$L$5/100),F17=\"SERV DIF\",I17*(1+$L$6/100),F17=\"FORN\",I17*(1+$L$7/100)),2)","v":8.4},{"$f":"TRUNC(H17*I17,2)","v":30330},{"$f":"TRUNC(H17*J17,2)","v":37800}]
[9,"2.2",4011209,"SICRO","REGULARIZAÇÃO E COMPACTAÇÃO DO SUBLEITO ","SERV","M2",15000,{"$f":"VLOOKUP(A18,'CPU-SERV'!A:K,11,0)","v":1.54},{"$f":"TRUNC(_xlfn.IFS(F18=\"SERV\",I18*(1+$L$5/100),F18=\"SERV DIF\",I18*(1+$L$6/100),F18=\"FORN\",I18*(1+$L$7/100)),2)","v":1.91},23100,28650]
[10,"2.3",4011219,"SICRO","EXECUÇÃO E COMPACTAÇÃO DE BASE E OU SUB BASE PARA PAVIMENTAÇÃO COM SOLO ESTABILIZADO GRANULOMETRICAMENTE SEM MISTURA, COM MATERIAL DE JAZIDA - EXCLUSIVE TRANSPORTE","SERV","M3",2200,{"$f":"VLOOKUP(A19,'CPU-SERV'!A:K,11,0)","v":14.78},{"$f":"TRUNC(_xlfn.IFS(F19=\"SERV\",I19*(1+$L$5/100),F19=\"SERV DIF\",I19*(1+$L$6/100),F19=\"FORN\",I19*(1+$L$7/100)),2)","v":18.420000000000002},32516,40524]
[12,"2.4",4011352,"SICRO","IMPRIMAÇÃO COM EMULSÃO ASFÁLTICA (EAI)","SERV","M2",14400,{"$f":"VLOOKUP(A20,'CPU-SERV'!A:K,11,0)","v":0.4},{"$f":"TRUNC(_xlfn.IFS(F20=\"SERV\",I20*(1+$L$5/100),F20=\"SERV DIF\",I20*(1+$L$6/100),F20=\"FORN\",I20*(1+$L$7/100)),2)","v":0.49},5760,7056]
[13,"2.5",4011353,"SICRO","PINTURA DE LIGAÇÃO COM EMULSÃO ASFÁLTICA RR-1C","SERV","M2",13200,{"$f":"VLOOKUP(A21,'CPU-SERV'!A:K,11,0)","v":0.27},{"$f":"TRUNC(_xlfn.IFS(F21=\"SERV\",I21*(1+$L$5/100),F21=\"SERV DIF\",I21*(1+$L$6/100),F21=\"FORN\",I21*(1+$L$7/100)),2)","v":0.33},3564,4356]
[14,"2.6",4011463,"SICRO","EXECUÇÃO DE PAVIMENTO COM APLICAÇÃO DE CONCRETO ASFÁLTICO USINADO A QUENTE (CBUQ), CAMADA DE ROLAMENTO - EXCLUSIVE TRANSPORTE","SERV","T",1270,{"$f":"VLOOKUP(A22,'CPU-SERV'!A:K,11,0)","v":176.77},{"$f":"TRUNC(_xlfn.IFS(F22=\"SERV\",I22*(1+$L$5/100),F22=\"SERV DIF\",I22*(1+$L$6/100),F22=\"FORN\",I22*(1+$L$7/100)),2)","v":220.37},224497.9,279869.90000000002]
["C",3,null,null,"TRANSPORTE DE MATERIAIS",{"$nulls":5},{"$f":"SUM(K24:K28)","v":349892},{"$f":"SUM(L24:L28)","v":434708}]
[15,"3.1",5915321,"SICRO","TRANSPORTE COM CAMINHÃO BASCULANTE, EM RODOVIA PAVIMENTADA","SERV","TXKM",100000,{"$f":"VLOOKUP(A24,'CPU-SERV'!A:K,11,0)","v":0.65},{"$f":"TRUNC(_xlfn.IFS(F24=\"SERV\",I24*(1+$L$5/100),F24=\"SERV DIF\",I24*(1+$L$6/100),F24=\"FORN\",I24*(1+$L$7/100)),2)","v":0.81},{"$f":"TRUNC(H24*I24,2)","v":65000},{"$f":"TRUNC(H24*J24,2)","v":81000}]
[16,"3.2",5915320,"SICRO","TRANSPORTE COM CAMINHÃO BASCULANTE, RODOVIA EM REVESTIMENTO PRIMÁRIO","SERV","TXKM",100000,{"$f":"VLOOKUP(A25,'CPU-SERV'!A:K,11,0)","v":0.72},{"$f":"TRUNC(_xlfn.IFS(F25=\"SERV\",I25*(1+$L$5/100),F25=\"SERV DIF\",I25*(1+$L$6/100),F25=\"FORN\",I25*(1+$L$7/100)),2)","v":0.89},72000,89000]
[17,"3.3",5914434,"SICRO","TRANSPORTE COM CAMINHÃO CARROCERIA 9T, EM VIA URBANA PREDOMINANTEMENTE PAVIMENTADA","SERV","TXKM",48000,{"$f":"VLOOKUP(A26,'CPU-SERV'!A:K,11,0)","v":0.74},{"$f":"TRUNC(_xlfn.IFS(F26=\"SERV\",I26*(1+$L$5/100),F26=\"SERV DIF\",I26*(1+$L$6/100),F26=\"FORN\",I26*(1+$L$7/100)),2)","v":0.92},35520,44160]
[18,"3.4",5914612,"SICRO","TRANSPORTE DE MISTURA BETUMINOSA A QUENTE COM CAMINHÃO CAÇAMBA TÉRMICA","SERV","TXKM",150000,{"$f":"VLOOKUP(A27,'CPU-SERV'!A:K,11,0)","v":1.1499999999999999},{"$f":"TRUNC(_xlfn.IFS(F27=\"SERV\",I27*(1+$L$5/100),F27=\"SERV DIF\",I27*(1+$L$6/100),F27=\"FORN\",I27*(1+$L$7/100)),2)","v":1.43},172500,214500]
[19,"3.5",5914622,"SICRO","TRANSPORTE COM CAMINHÃO TANQUE DE TRANSPORTE DE MATERIAL ASFÁLTICO DE 30000 L, EM VIA URBANA PREDOMINANTEMENTE PAVIMENTADA","SERV","TXKM",2800,{"$f":"VLOOKUP(A28,'CPU-SERV'!A:K,11,0)","v":1.74},{"$f":"TRUNC(_xlfn.IFS(F28=\"SERV\",I28*(1+$L$5/100),F28=\"SERV DIF\",I28*(1+$L$6/100),F28=\"FORN\",I28*(1+$L$7/100)),2)","v":2.16},4872,6048]
["E",4,null,null,"DRENAGEM E OBRAS COMPLEMENTARES",{"$nulls":5},{"$f":"SUM(K30:K34)","v":370606.38},{"$f":"SUM(L30:L34)","v":461977.77999999997}]
[20,"4.1",94273,"SINAPI","ASSENTAMENTO DE GUIA (MEIO-FIO) PRÉ-MOLDADO DE CONCRETO - 100X15X13X30 CM (COMPRIMENTO X BASE INFERIOR X BASE SUPERIOR X ALTURA) - USO VIÁRIO","SERV","M",4000,{"$f":"VLOOKUP(A30,'CPU-SERV'!A:K,11,0)","v":53.22},{"$f":"TRUNC(_xlfn.IFS(F30=\"SERV\",I30*(1+$L$5/100),F30=\"SERV DIF\",I30*(1+$L$6/100),F30=\"FORN\",I30*(1+$L$7/100)),2)","v":66.34},{"$f":"TRUNC(H30*I30,2)","v":212880},{"$f":"TRUNC(H30*J30,2)","v":265360}]
[23,"4.2","94287a","SINAPI","EXECUÇÃO DE SARJETA EM CONCRETO USINADO, MOLDADO IN LOCO - 30CM DE BASE X 5CM DE ALTURA","SERV","M",4000,{"$f":"VLOOKUP(A31,'CPU-SERV'!A:K,11,0)","v":31.55},{"$f":"TRUNC(_xlfn.IFS(F31=\"SERV\",I31*(1+$L$5/100),F31=\"SERV DIF\",I31*(1+$L$6/100),F31=\"FORN\",I31*(1+$L$7/100)),2)","v":39.33},126200,157320]
[46,"4.3",5213440,"SICRO","PLACA DE REGULAMENTAÇÃO EM AÇO, D=60CM - PELÍCULA RETRORREFLETIVA - FORNECIMENTO E INSTALAÇÃO, INCLUSIVE  SUPORTE","SERV","UN.",13,{"$f":"VLOOKUP(A32,'CPU-SERV'!A:K,11,0)","v":259.45999999999998},{"$f":"TRUNC(_xlfn.IFS(F32=\"SERV\",I32*(1+$L$5/100),F32=\"SERV DIF\",I32*(1+$L$6/100),F32=\"FORN\",I32*(1+$L$7/100)),2)","v":323.45999999999998},3372.98,4204.9799999999996]
[49,"4.4",5213401,"SICRO","PINTURA DE EIXO VIÁRIO SOBRE ASFALTO COM TINTA RETRORREFLETIVA A BASE DE RESINA ACRÍLICA COM MICROESFERAS DE VIDRO, APLICAÇÃO MECÂNICA COM DEMARCADORA AUTOPROPELIDA","SERV","M2",620,{"$f":"VLOOKUP(A33,'CPU-SERV'!A:K,11,0)","v":29.17},{"$f":"TRUNC(_xlfn.IFS(F33=\"SERV\",I33*(1+$L$5/100),F33=\"SERV DIF\",I33*(1+$L$6/100),F33=\"FORN\",I33*(1+$L$7/100)),2)","v":36.36},18085.400000000001,22543.200000000001]
[51,"4.5",5213405,"SICRO","PINTURA DE FAIXA DE PEDESTRE OU ZEBRADA TINTA RETRORREFLETIVA A BASE DE RESINA ACRÍLICA COM MICROESFERAS DE VIDRO, APLICAÇÃO MANUAL","SERV","M2",240,{"$f":"VLOOKUP(A34,'CPU-SERV'!A:K,11,0)","v":41.95},{"$f":"TRUNC(_xlfn.IFS(F34=\"SERV\",I34*(1+$L$5/100),F34=\"SERV DIF\",I34*(1+$L$6/100),F34=\"FORN\",I34*(1+$L$7/100)),2)","v":52.29},10068,12549.6]
["F",5,null,null,"FORNECIMENTOS - MATERIAL ASFÁLTICO (BDI DIFERENCIADO)",{"$nulls":5},{"$f":"SUM(K36:K41)","v":451118.26999999996},{"$f":"SUM(L36:L41)","v":518785.03}]
["F1","5.1","CPU.7","CODEVASF","AQUISIÇÃO DE EMULSÃO ASFÁLTICA PARA IMPRIMAÇÃO (EAI) - EXCLUSIVE TRANSPORTE","FORN","T",19,{"$f":"VLOOKUP(A36,'CPU-FORNEC'!A:J,9,0)","v":3189.94},{"$f":"TRUNC(_xlfn.IFS(F36=\"SERV\",I36*(1+$L$5/100),F36=\"SERV DIF\",I36*(1+$L$6/100),F36=\"FORN\",I36*(1+$L$7/100)),2)","v":3668.43},{"$f":"TRUNC(H36*I36,2)","v":60608.86},{"$f":"TRUNC(H36*J36,2)","v":69700.17}]
["F2","5.2","CPU.8","CODEVASF","TRANSPORTE DE EMULSÃO ASFÁLTICA PARA IMPRIMAÇÃO (EAI)","SERV DIF","T",19,{"$f":"VLOOKUP(A37,'CPU-FORNEC'!A:J,9,0)","v":198.11},{"$f":"TRUNC(_xlfn.IFS(F37=\"SERV\",I37*(1+$L$5/100),F37=\"SERV DIF\",I37*(1+$L$6/100),F37=\"FORN\",I37*(1+$L$7/100)),2)","v":227.82},3764.09,4328.58]
["F3","5.3","CPU.9","CODEVASF","AQUISIÇÃO DE EMULSAO ASFALTICA CATIONICA RR-1C - EXCLUSIVE TRANSPORTE","FORN","T",6,{"$f":"VLOOKUP(A38,'CPU-FORNEC'!A:J,9,0)","v":3510.21},{"$f":"TRUNC(_xlfn.IFS(F38=\"SERV\",I38*(1+$L$5/100),F38=\"SERV DIF\",I38*(1+$L$6/100),F38=\"FORN\",I38*(1+$L$7/100)),2)","v":4036.74},21061.26,24220.44]
["F4","5.4","CPU.10","CODEVASF","TRANSPORTE DE EMULSÃO ASFÁLTICA CATIONICA RR-1C","SERV DIF","T",6,{"$f":"VLOOKUP(A39,'CPU-FORNEC'!A:J,9,0)","v":224.56},{"$f":"TRUNC(_xlfn.IFS(F39=\"SERV\",I39*(1+$L$5/100),F39=\"SERV DIF\",I39*(1+$L$6/100),F39=\"FORN\",I39*(1+$L$7/100)),2)","v":258.24},1347.36,1549.44]
["F5","5.5","CPU.11","CODEVASF","AQUISIÇÃO DE CONCRETO ASFÁLTICO DE PETRÓLEO - CAP 50/70 - EXCLUSIVE TRANSPORTE","FORN","T",70,{"$f":"VLOOKUP(A40,'CPU-FORNEC'!A:J,9,0)","v":4816.4799999999996},{"$f":"TRUNC(_xlfn.IFS(F40=\"SERV\",I40*(1+$L$5/100),F40=\"SERV DIF\",I40*(1+$L$6/100),F40=\"FORN\",I40*(1+$L$7/100)),2)","v":5538.95},337153.6,387726.5]
["F6","5.6","CPU.12","CODEVASF","TRANSPORTE DE CONCRETO ASFÁLTICO DE PETRÓLEO - CAP 50/70","SERV DIF","T",70,{"$f":"VLOOKUP(A41,'CPU-FORNEC'!A:J,9,0)","v":388.33},{"$f":"TRUNC(_xlfn.IFS(F41=\"SERV\",I41*(1+$L$5/100),F41=\"SERV DIF\",I41*(1+$L$6/100),F41=\"FORN\",I41*(1+$L$7/100)),2)","v":446.57},27183.1,31259.9]
[null,"TOTAL GERAL DA OBRA COM BDI ",{"$nulls":8},{"$f":"SUM(K10,K16,K23,K29,K35)","v":1640228.19},{"$f":"SUM(L10,L16,L23,L29,L35)","v":1999276.8}]

{"sheet":"CPU-SERV","index":1,"n_rows":1721,"n_cols":11,"rows_kept":1721,"cut":false,"hidden":false,"merged":[[1519,2,1519,9],[1485,7,1485,9],[1491,3,1491,7],[1492,7,1492,9],[1520,1,1521,3],[1520,4,1520,5],[1521,4,1521,5],[1522,2,1522,7],[1496,3,1496,7],[1498,8,1498,9],[1505,3,1505,7],[1506,1,1507,2],[1506,3,1507,3],[1506,4,1507,4],[1506,5,1506,7],[1506,9,1507,9],[1565,3,1565,7],[1566,5,1566,7],[1547,3,1547,7],[1549,8,1549,9],[1556,3,1556,7],[1557,1,1558,2],[1557,3,1558,3],[1557,4,1558,4],[1557,5,1557,7],[1557,9,1558,9],[1542,3,1542,7],[1543,7,1543,9],[1471,2,1471,7],[1514,3,1514,7],[1515,5,1515,7],[1518,0,1567,0],[1440,3,1440,7],[1441,7,1441,9],[1531,3,1531,7],[1532,3,1532,7],[1533,3,1533,7],[1536,7,1536,9],[1528,7,1528,9],[1426,7,1426,9],[1480,3,1480,7],[1481,3,1481,7],[1482,3,1482,7],[1365,0,1414,0],[1467,0,1516,0],[1471,8,1471,9],[1472,1,1473,2],[1472,3,1473,3],[1472,4,1472,5],[1472,6,1472,7],[1477,7,1477,9],[1463,3,1463,7],[1464,5,1464,7],[1522,8,1522,9],[1523,1,1524,2],[1523,3,1524,3],[1523,4,1523,5],[1523,6,1523,7],[1469,4,1469,5],[1470,4,1470,5],[1366,2,1366,9],[1367,1,1368,3],[1367,4,1367,5],[1368,4,1368,5],[1369,2,1369,7],[1412,3,1412,7],[1413,5,1413,7],[1416,0,1465,0],[1417,2,1417,9],[1418,1,1419,3],[1418,4,1418,5],[1419,4,1419,5],[1420,2,1420,7],[1394,3,1394,7],[1396,8,1396,9],[1403,3,1403,7],[1404,1,1405,2],[1404,3,1405,3],[1421,1,1422,2],[1421,3,1422,3],[1421,4,1421,5],[1421,6,1421,7],[1455,5,1455,7],[1455,9,1456,9],[1429,3,1429,7],[1430,3,1430,7],[1431,3,1431,7],[1434,7,1434,9],[1468,2,1468,9],[1469,1,1470,3],[1404,4,1405,4],[1404,5,1404,7],[1404,9,1405,9],[1445,3,1445,7],[1447,8,1447,9],[1454,3,1454,7],[1455,1,1456,2],[1455,3,1456,3],[1455,4,1456,4],[1420,8,1420,9],[1319,3,1320,3],[1319,4,1319,5],[1319,6,1319,7],[1324,7,1324,9],[1378,3,1378,7],[1379,3,1379,7],[1380,3,1380,7],[1383,7,1383,9],[1389,3,1389,7],[1390,7,1390,9],[1369,8,1369,9],[1370,1,1371,2],[1370,3,1371,3],[1370,4,1370,5],[1370,6,1370,7],[1375,7,1375,9],[1361,3,1361,7],[1362,5,1362,7],[1314,0,1363,0],[1315,2,1315,9],[1316,1,1317,3],[1316,4,1316,5],[1317,4,1317,5],[1318,2,1318,7],[1292,3,1292,7],[1294,8,1294,9],[1301,3,1301,7],[1302,1,1303,2],[1302,3,1303,3],[1302,4,1303,4],[1302,5,1302,7],[1302,9,1303,9],[1343,3,1343,7],[1345,8,1345,9],[1352,3,1352,7],[1353,1,1354,2],[1353,3,1354,3],[1353,4,1354,4],[1353,5,1353,7],[1353,9,1354,9],[1327,3,1327,7],[1328,3,1328,7],[1329,3,1329,7],[1332,7,1332,9],[1338,3,1338,7],[1339,7,1339,9],[1318,8,1318,9],[1319,1,1320,2],[1281,7,1281,9],[1287,3,1287,7],[1288,7,1288,9],[1267,8,1267,9],[1268,1,1269,2],[1268,3,1269,3],[1268,4,1268,5],[1268,6,1268,7],[1273,7,1273,9],[1259,3,1259,7],[1260,5,1260,7],[1263,0,1312,0],[1264,2,1264,9],[1265,1,1266,3],[1265,4,1265,5],[1266,4,1266,5],[1267,2,1267,7],[1310,3,1310,7],[1311,5,1311,7],[1276,3,1276,7],[1277,3,1277,7],[1278,3,1278,7],[1251,5,1251,7],[1251,9,1252,9],[1225,3,1225,7],[1226,3,1226,7],[1227,3,1227,7],[1230,7,1230,9],[1236,3,1236,7],[1237,7,1237,9],[1216,8,1216,9],[1217,1,1218,2],[1217,3,1218,3],[1217,4,1217,5],[1217,6,1217,7],[1222,7,1222,9],[1115,3,1116,3],[1115,4,1115,5],[1115,6,1115,7],[1120,7,1120,9],[1174,3,1174,7],[1175,3,1175,7],[1176,3,1176,7],[1179,7,1179,9],[1185,3,1185,7],[1186,7,1186,9],[1165,8,1165,9],[1166,1,1167,2],[1166,3,1167,3],[1166,4,1166,5],[1166,6,1166,7],[1171,7,1171,9],[1157,3,1157,7],[1158,5,1158,7],[1161,0,1210,0],[1162,2,1162,9],[1163,1,1164,3],[1163,4,1163,5],[1164,4,1164,5],[1165,2,1165,7],[1208,3,1208,7],[1209,5,1209,7],[1212,0,1261,0],[1213,2,1213,9],[1214,1,1215,3],[1214,4,1214,5],[1215,4,1215,5],[1216,2,1216,7],[1190,3,1190,7],[1192,8,1192,9],[1199,3,1199,7],[1200,1,1201,2],[1200,3,1201,3],[1200,4,1201,4],[1200,5,1200,7],[1200,9,1201,9],[1241,3,1241,7],[1243,8,1243,9],[1250,3,1250,7],[1251,1,1252,2],[1251,3,1252,3],[1251,4,1252,4],[1110,0,1159,0],[1111,2,1111,9],[1112,1,1113,3],[1112,4,1112,5],[1113,4,1113,5],[1114,2,1114,7],[1088,3,1088,7],[1090,8,1090,9],[1097,3,1097,7],[1098,1,1099,2],[1098,3,1099,3],[1098,4,1099,4],[1098,5,1098,7],[1098,9,1099,9],[1139,3,1139,7],[1141,8,1141,9],[1148,3,1148,7],[1149,1,1150,2],[1149,3,1150,3],[1149,4,1150,4],[1149,5,1149,7],[1149,9,1150,9],[1123,3,1123,7],[1124,3,1124,7],[1061,4,1061,5],[1062,4,1062,5],[1063,2,1063,7],[1106,3,1106,7],[1107,5,1107,7],[1047,5,1047,7],[1047,9,1048,9],[1021,3,1021,7],[1022,3,1022,7],[1023,3,1023,7],[1026,7,1026,9],[1032,3,1032,7],[1033,7,1033,9],[1125,3,1125,7],[1128,7,1128,9],[1134,3,1134,7],[1135,7,1135,9],[1114,8,1114,9],[1115,1,1116,2],[1077,7,1077,9],[1083,3,1083,7],[1084,7,1084,9],[1063,8,1063,9],[1064,1,1065,2],[1064,3,1065,3],[1064,4,1064,5],[1064,6,1064,7],[1069,7,1069,9],[1055,3,1055,7],[1056,5,1056,7],[1018,7,1018,9],[1072,3,1072,7],[1073,3,1073,7],[1074,3,1074,7],[957,0,1006,0],[958,2,958,9],[959,1,960,3],[959,4,959,5],[960,4,960,5],[961,2,961,7],[1004,3,1004,7],[1005,5,1005,7],[1008,0,1057,0],[1009,2,1009,9],[1010,1,1011,3],[1010,4,1010,5],[1011,4,1011,5],[1012,2,1012,7],[986,3,986,7],[988,8,988,9],[995,3,995,7],[996,1,997,2],[996,3,997,3],[1059,0,1108,0],[1060,2,1060,9],[1061,1,1062,3],[996,4,997,4],[996,5,996,7],[996,9,997,9],[1037,3,1037,7],[1039,8,1039,9],[1046,3,1046,7],[1047,1,1048,2],[1047,3,1048,3],[1047,4,1048,4],[911,3,912,3],[911,4,911,5],[911,6,911,7],[916,7,916,9],[970,3,970,7],[971,3,971,7],[972,3,972,7],[975,7,975,9],[981,3,981,7],[982,7,982,9],[961,8,961,9],[962,1,963,2],[962,3,963,3],[962,4,962,5],[962,6,962,7],[967,7,967,9],[953,3,953,7],[954,5,954,7],[1012,8,1012,9],[1013,1,1014,2],[1013,3,1014,3],[1013,4,1013,5],[1013,6,1013,7],[906,0,955,0],[907,2,907,9],[908,1,909,3],[908,4,908,5],[909,4,909,5],[910,2,910,7],[888,3,888,7],[890,8,890,9],[895,3,895,7],[896,1,897,2],[896,3,897,3],[896,4,897,4],[896,5,896,7],[896,9,897,9],[935,3,935,7],[937,8,937,9],[944,3,944,7],[945,1,946,2],[945,3,946,3],[945,4,946,4],[945,5,945,7],[945,9,946,9],[919,3,919,7],[920,3,920,7],[921,3,921,7],[924,7,924,9],[930,3,930,7],[931,7,931,9],[910,8,910,9],[911,1,912,2],[850,3,851,3],[850,4,851,4],[850,5,850,7],[850,9,851,9],[873,3,873,7],[874,3,874,7],[875,3,875,7],[878,7,878,9],[884,3,884,7],[885,7,885,9],[864,8,864,9],[865,1,866,2],[865,3,866,3],[865,4,865,5],[865,6,865,7],[870,7,870,9],[860,0,904,0],[861,2,861,9],[862,1,863,3],[862,4,862,5],[863,4,863,5],[864,2,864,7],[902,3,902,7],[903,5,903,7],[810,3,810,7],[811,5,811,7],[775,0,812,0],[776,2,776,9],[777,1,778,3],[777,4,777,5],[778,4,778,5],[779,2,779,7],[827,3,827,7],[828,3,828,7],[829,3,829,7],[832,7,832,9],[838,3,838,7],[839,7,839,9],[818,8,818,9],[819,1,820,2],[819,3,820,3],[819,4,819,5],[819,6,819,7],[824,7,824,9],[814,0,858,0],[815,2,815,9],[816,1,817,3],[816,4,816,5],[817,4,817,5],[818,2,818,7],[856,3,856,7],[857,5,857,7],[842,3,842,7],[844,8,844,9],[849,3,849,7],[850,1,851,2],[767,3,768,3],[767,4,768,4],[767,5,767,7],[767,9,768,9],[800,3,800,7],[802,8,802,9],[805,3,805,7],[806,1,807,2],[806,3,807,3],[806,4,807,4],[806,5,806,7],[806,9,807,9],[788,3,788,7],[789,3,789,7],[790,3,790,7],[793,7,793,9],[796,3,796,7],[797,7,797,9],[779,8,779,9],[780,1,781,2],[780,3,781,3],[780,4,780,5],[780,6,780,7],[785,7,785,9],[730,3,730,7],[731,5,731,7],[695,0,732,0],[696,2,696,9],[697,1,698,3],[697,4,697,5],[698,4,698,5],[699,2,699,7],[747,3,747,7],[748,3,748,7],[749,3,749,7],[752,7,752,9],[757,3,757,7],[758,7,758,9],[738,8,738,9],[739,1,740,2],[739,3,740,3],[739,4,739,5],[739,6,739,7],[744,7,744,9],[734,0,773,0],[735,2,735,9],[736,1,737,3],[736,4,736,5],[737,4,737,5],[738,2,738,7],[771,3,771,7],[772,5,772,7],[761,3,761,7],[763,8,763,9],[766,3,766,7],[767,1,768,2],[687,3,688,3],[687,4,688,4],[687,5,687,7],[687,9,688,9],[720,3,720,7],[722,8,722,9],[725,3,725,7],[726,1,727,2],[726,3,727,3],[726,4,727,4],[726,5,726,7],[726,9,727,9],[708,3,708,7],[709,3,709,7],[710,3,710,7],[713,7,713,9],[716,3,716,7],[717,7,717,9],[699,8,699,9],[700,1,701,2],[700,3,701,3],[700,4,700,5],[700,6,700,7],[705,7,705,9],[669,3,669,7],[670,3,670,7],[671,3,671,7],[674,7,674,9],[677,3,677,7],[678,7,678,9],[660,8,660,9],[661,1,662,2],[661,3,662,3],[661,4,661,5],[661,6,661,7],[666,7,666,9],[652,3,652,7],[653,5,653,7],[656,0,693,0],[657,2,657,9],[658,1,659,3],[658,4,658,5],[659,4,659,5],[660,2,660,7],[691,3,691,7],[692,5,692,7],[617,0,654,0],[618,2,618,9],[619,1,620,3],[619,4,619,5],[620,4,620,5],[621,2,621,7],[681,3,681,7],[683,8,683,9],[686,3,686,7],[687,1,688,2],[642,3,642,7],[644,8,644,9],[647,3,647,7],[648,1,649,2],[648,3,649,3],[648,4,649,4],[648,5,648,7],[648,9,649,9],[630,3,630,7],[631,3,631,7],[632,3,632,7],[635,7,635,9],[638,3,638,7],[639,7,639,9],[621,8,621,9],[622,1,623,2],[622,3,623,3],[622,4,622,5],[622,6,622,7],[627,7,627,9],[600,7,600,9],[582,8,582,9],[583,1,584,2],[583,3,584,3],[583,4,583,5],[583,6,583,7],[588,7,588,9],[535,3,535,7],[536,5,536,7],[578,0,615,0],[579,2,579,9],[580,1,581,3],[580,4,580,5],[581,4,581,5],[582,2,582,7],[613,3,613,7],[614,5,614,7],[500,0,537,0],[501,2,501,9],[502,1,503,3],[502,4,502,5],[503,4,503,5],[603,3,603,7],[605,8,605,9],[608,3,608,7],[609,1,610,2],[609,3,610,3],[609,4,610,4],[609,5,609,7],[609,9,610,9],[514,3,514,7],[515,3,515,7],[518,7,518,9],[521,3,521,7],[522,7,522,9],[504,8,504,9],[505,1,506,2],[505,3,506,3],[505,4,505,5],[505,6,505,7],[510,7,510,9],[591,3,591,7],[592,3,592,7],[593,3,593,7],[596,7,596,9],[599,3,599,7],[504,2,504,7],[434,8,434,9],[437,3,437,7],[438,1,439,2],[438,3,439,3],[438,4,439,4],[438,5,438,7],[438,9,439,9],[488,1,489,2],[488,3,489,3],[488,4,489,4],[488,5,488,7],[488,9,489,9],[496,3,496,7],[478,3,478,7],[480,8,480,9],[487,3,487,7],[513,3,513,7],[471,7,471,8],[497,5,497,7],[525,3,525,7],[527,8,527,9],[530,3,530,7],[531,1,532,2],[531,3,532,3],[531,4,532,4],[531,5,531,7],[531,9,532,9],[373,6,373,7],[378,7,378,9],[420,3,420,7],[421,3,421,7],[422,3,422,7],[425,7,425,9],[428,3,428,7],[429,7,429,9],[411,8,411,9],[412,1,413,2],[412,3,413,3],[412,4,412,5],[412,6,412,7],[418,7,418,9],[403,3,403,7],[404,5,404,7],[382,3,382,7],[383,3,383,7],[386,7,386,9],[389,3,389,7],[390,7,390,9],[476,7,476,9],[432,3,432,7],[407,0,444,0],[408,2,408,9],[409,1,410,3],[409,4,409,5],[410,4,410,5],[411,2,411,7],[442,3,442,7],[443,5,443,7],[387,7,387,8],[368,0,405,0],[369,2,369,9],[370,1,371,3],[370,4,370,5],[371,4,371,5],[372,2,372,7],[354,3,354,7],[356,8,356,9],[359,3,359,7],[360,1,361,2],[360,3,361,3],[360,4,361,4],[360,5,360,7],[360,9,361,9],[393,3,393,7],[395,8,395,9],[398,3,398,7],[399,1,400,2],[399,3,400,3],[399,4,400,4],[399,5,399,7],[399,9,400,9],[381,3,381,7],[372,8,372,9],[373,1,374,2],[373,3,374,3],[373,4,373,5],[342,3,342,7],[343,3,343,7],[344,3,344,7],[347,7,347,9],[350,3,350,7],[351,7,351,9],[333,8,333,9],[334,1,335,2],[334,3,335,3],[334,4,334,5],[334,6,334,7],[339,7,339,9],[329,0,366,0],[330,2,330,9],[331,1,332,3],[331,4,331,5],[332,4,332,5],[333,2,333,7],[364,3,364,7],[365,5,365,7],[348,7,348,8],[315,3,315,7],[317,8,317,9],[320,3,320,7],[321,1,322,2],[321,3,322,3],[321,4,322,4],[321,5,321,7],[321,9,322,9],[278,5,278,7],[278,9,279,9],[260,3,260,7],[261,3,261,7],[248,6,248,7],[257,7,257,9],[303,3,303,7],[304,3,304,7],[305,3,305,7],[308,7,308,9],[311,3,311,7],[312,7,312,9],[290,8,290,9],[291,1,292,2],[291,3,292,3],[291,4,291,5],[291,6,291,7],[300,7,300,9],[282,3,282,7],[283,5,283,7],[262,3,262,7],[265,7,265,9],[268,3,268,7],[269,7,269,9],[247,8,247,9],[248,1,249,2],[248,3,249,3],[248,4,248,5],[209,6,209,7],[214,7,214,9],[239,3,239,7],[240,5,240,7],[219,3,219,7],[222,7,222,9],[225,3,225,7],[226,7,226,9],[286,0,327,0],[287,2,287,9],[288,1,289,3],[288,4,288,5],[289,4,289,5],[290,2,290,7],[325,3,325,7],[326,5,326,7],[243,0,284,0],[244,2,244,9],[245,1,246,3],[245,4,245,5],[246,4,246,5],[247,2,247,7],[272,3,272,7],[274,8,274,9],[277,3,277,7],[278,1,279,2],[278,3,279,3],[278,4,279,4],[204,0,241,0],[205,2,205,9],[206,1,207,3],[206,4,206,5],[207,4,207,5],[208,2,208,7],[190,3,190,7],[192,8,192,9],[195,3,195,7],[196,1,197,2],[196,3,197,3],[196,4,197,4],[196,5,196,7],[196,9,197,9],[229,3,229,7],[231,8,231,9],[234,3,234,7],[235,1,236,2],[235,3,236,3],[235,4,236,4],[235,5,235,7],[235,9,236,9],[217,3,217,7],[218,3,218,7],[208,8,208,9],[209,1,210,2],[209,3,210,3],[209,4,209,5],[163,0,202,0],[200,3,200,7],[201,5,201,7],[178,3,178,7],[179,3,179,7],[180,3,180,7],[183,7,183,9],[186,3,186,7],[187,7,187,9],[167,8,167,9],[168,1,169,2],[168,3,169,3],[168,4,168,5],[168,6,168,7],[173,7,173,9],[164,2,164,9],[165,1,166,3],[165,4,165,5],[166,4,166,5],[167,2,167,7],[151,8,151,9],[154,3,154,7],[155,1,156,2],[155,3,156,3],[155,4,156,4],[155,5,155,7],[155,9,156,9],[136,3,136,7],[137,3,137,7],[140,7,140,9],[145,3,145,7],[146,7,146,9],[149,3,149,7],[127,1,128,2],[127,3,128,3],[127,4,127,5],[127,6,127,7],[132,7,132,9],[135,3,135,7],[119,5,119,7],[122,0,161,0],[123,2,123,9],[124,1,125,3],[124,4,124,5],[125,4,125,5],[126,2,126,7],[126,8,126,9],[159,3,159,7],[160,5,160,7],[114,1,115,2],[114,3,115,3],[114,4,115,4],[114,5,114,7],[114,9,115,9],[118,3,118,7],[93,7,93,9],[98,3,98,7],[101,7,101,9],[104,3,104,7],[105,7,105,9],[108,3,108,7],[83,0,120,0],[84,2,84,9],[85,1,86,3],[86,4,86,5],[87,2,87,7],[87,8,87,9],[88,1,89,2],[110,8,110,9],[113,3,113,7],[96,3,96,7],[97,3,97,7],[88,3,89,3],[88,4,88,5],[88,6,88,7],[79,3,79,7],[80,5,80,7],[85,4,85,5],[74,3,74,7],[75,1,76,2],[75,3,76,3],[75,4,76,4],[75,5,75,7],[75,9,76,9],[57,3,57,7],[60,7,60,9],[63,3,63,7],[64,7,64,9],[69,3,69,7],[71,8,71,9],[44,3,45,3],[44,4,44,5],[44,6,44,7],[49,7,49,9],[55,3,55,7],[56,3,56,7],[41,1,42,3],[41,4,41,5],[42,4,42,5],[43,2,43,7],[43,8,43,9],[44,1,45,2],[0,0,37,0],[3,4,3,5],[2,4,2,5],[1,2,1,9],[2,1,3,3],[31,3,32,3],[31,4,32,4],[31,5,31,7],[31,9,32,9],[35,3,35,7],[36,5,36,7],[10,7,10,9],[13,3,13,7],[14,3,14,7],[15,3,15,7],[18,7,18,9],[30,3,30,7],[31,1,32,2],[22,7,22,9],[25,3,25,7],[1608,5,1608,7],[1608,9,1609,9],[1616,3,1616,7],[1617,5,1617,7],[27,8,27,9],[21,3,21,7],[4,2,4,7],[4,8,4,9],[5,1,6,2],[5,3,6,3],[5,4,5,5],[5,6,5,7],[446,0,498,0],[447,2,447,9],[448,1,449,3],[448,4,448,5],[449,4,449,5],[450,2,450,7],[450,8,450,9],[451,1,452,2],[451,3,452,3],[451,4,451,5],[451,6,451,7],[459,7,459,9],[461,3,461,7],[462,3,462,7],[463,3,463,7],[466,7,466,9],[475,3,475,7],[39,0,81,0],[40,2,40,9],[539,0,576,0],[1622,4,1622,5],[1633,3,1633,7],[1634,3,1634,7],[1620,0,1669,0],[1621,2,1621,9],[1569,0,1618,0],[1570,2,1570,9],[1571,1,1572,3],[1571,4,1571,5],[1572,4,1572,5],[1573,2,1573,7],[1573,8,1573,9],[1574,1,1575,2],[1574,3,1575,3],[1574,4,1574,5],[1574,6,1574,7],[1579,7,1579,9],[1582,3,1582,7],[1583,3,1583,7],[1584,3,1584,7],[1587,7,1587,9],[1593,3,1593,7],[1594,7,1594,9],[1598,3,1598,7],[1600,8,1600,9],[1607,3,1607,7],[1608,1,1609,2],[1608,3,1609,3],[1608,4,1609,4],[1702,8,1702,9],[1709,3,1709,7],[1710,1,1711,2],[1710,3,1711,3],[1622,1,1623,3],[1623,4,1623,5],[1624,2,1624,7],[1624,8,1624,9],[1625,1,1626,2],[1625,3,1626,3],[1625,4,1625,5]],"merged_total":1067,"flags":["merged_cut"]}
[1,"1ª/GRD",{"$nulls":8},{"$f":"J37","v":8225.23}]
[null,"OBRA:"," PAVIMENTAÇÃO ASFÁLTICA EM CBUQ - VIAS URBANAS DIVERSAS - DISTRITO  DE CONCEIÇÃO DE TEIXEIRAS (AUGUSTO DE LIMA / MG)"]
[null,"Custo Unitário de Referência",null,null,"Minas Gerais"]
[{"$nulls":4}," Janeiro/2025 ",null,null,"Produção da equipe ",1,{"$f":"VLOOKUP(A1,ORÇAMENTO!$A$10:$L$42,7,1)","v":"GL"}]
[null,"CPU.1","MOBILIZAÇÃO E DESMOBILIZAÇÃO",{"$nulls":5},"Valores em reais (R$)"]
[null,"A - EQUIPAMENTOS",null,"Quantidade","Utilização",null,"Custo Horário",null,null,"Custo"]
[{"$nulls":4},"Operativa","Improdutiva","Produtivo","Improdutivo",null,"Horário Total"]
[null,"E9687","Caminhão carroceria com capacidade de 5 t - 115 kW",8,0.6,0.4,146.88079999999999,57.423099999999998,null,{"$f":"D8*(E8*G8+F8*H8)","v":888.78175999999996}]
[null,"E9575","Caminhão basculante com caçamba estanque com capacidade de 14 m³ - 210 kW",8,1,0,309.83940000000001,90.412199999999999,null,{"$f":"D9*(E9*G9+F9*H9)","v":2478.7152000000001}]
[{"$nulls":7},"Custo horário total de equipamentos",null,{"$f":"SUM(J8:J9)","v":3367.4969599999999}]
[null,"B - MÃO DE OBRA",null,"Quantidade","Unidade",null,"Custo Horário","Custo Horário Total"]
[null,"P9824","Servente",8,"h",null,21.3355,null,null,{"$f":"D12*G12","v":170.684}]
[{"$nulls":9},{"$f":"D13*G13","v":0}]
[null,null,null,"Custo horário total de mão de obra",{"$nulls":5},{"$f":"SUM(J12:J13)","v":170.684}]
[null,null,null,"Custo horário total de execução",{"$nulls":5},{"$f":"J10+J14","v":3538.1809600000001}]
[null,null,null,"Custo unitário de execução",{"$nulls":5},{"$f":"J15/I4","v":3538.1809600000001}]
[{"$nulls":7},"Custo do FIC",null,0]
[{"$nulls":7},"Custo do FIT",null,0]
[null,"C - MATERIAL",null,"Quantidade","Unidade",null,"Preço Unitário","Custo Unitário"]
[null,"-",0,null,0,null,0,null,null,{"$f":"D20*G20","v":0}]
[null,"-",0,null,0,null,0,null,null,{"$f":"D21*G21","v":0}]
[null,null,null,"Custo unitário total de material",{"$nulls":5},{"$f":"SUM(J20:J21)","v":0}]
[null,"D - ATIVIDADES AUXILIARES",null,"Quantidade","Unidade",null,"Custo Unitário","Custo Unitário"]
[null,5914640,"Transporte com cavalo mecânico com semirreboque com capacidade de 30 t - rodovia pavimentada",8222.9000000000015,"tkm",null,0.56999999999999995,null,null,{"$f":"D24*G24","v":4687.0530000000008}]
[null,"-",0,0,0,null,0,null,null,{"$f":"D25*G25","v":0}]
[null,null,null,"Custo total de atividades auxiliares",{"$nulls":5},{"$f":"SUM(J24:J25)","v":4687.0530000000008}]
[{"$nulls":7},"Subtotal",null,{"$f":"J16+J22+J26+J17+J18","v":8225.2339600000014}]
[null,"E - TEMPO FIXO",null,"Código","Quantidade","Unidade",null,"Custo Unitário","Custo Unitário"]
[null,"-",0,"-",null,0,null,0,null,{"$f":"ROUNDDOWN(E29*H29,4)","v":0}]
[null,"-",0,"-",null,0,null,0,null,{"$f":"ROUNDDOWN(E30*H30,4)","v":0}]
[null,null,null,"Custo unitário total de tempo fixo",{"$nulls":5},{"$f":"SUM(J29:J30)","v":0}]
[null,"F - MOMENTO DE TRANSPORTE",null,"Quantidade","Unidade","DMT",null,null,null,"Custo Unitário"]
[{"$nulls":5},"LN","RP","P"]
[null,"-",0,null,"tkm"]
[null,"-",0,null,"tkm"]
[null,null,null,"Custo unitário total de transporte"]
[{"$nulls":5},"Custo unitário direto total",null,null,null,{"$f":"TRUNC(J27+J31,2)","v":8225.23}]
[null,"Obs."]
[]
[{"$f":"A1+1","v":2},"1ª/GRD",{"$nulls":8},{"$f":"J81","v":124725.18}]
[null,"OBRA:"," PAVIMENTAÇÃO ASFÁLTICA EM CBUQ - VIAS URBANAS DIVERSAS - DISTRITO  DE CONCEIÇÃO DE TEIXEIRAS (AUGUSTO DE LIMA / MG)"]
[null,"Custo Unitário de Referência",null,null,"Minas Gerais"]
[{"$nulls":4}," Janeiro/2025 ",null,null,"Produção da equipe ",0.16666666666666666,{"$f":"VLOOKUP(A40,ORÇAMENTO!$A$10:$L$42,7,1)","v":"GL"},"6 MESES"]
[null,"CPU.2","ADMINISTRAÇÃO LOCAL ",{"$nulls":5},"Valores em reais (R$)"]
[null,"A - EQUIPAMENTOS",null,"Quantidade","Utilização",null,"Custo Horário",null,null,"Custo"]
[{"$nulls":4},"Operativa","Improdutiva","Produtivo","Improdutivo",null,"Horário Total"]
[null,"-",0,null,null,null,0,0,null,{"$f":"D47*(E47*G47+F47*H47)","v":0}]
[null,"-",0,null,null,null,0,0,null,{"$f":"D48*(E48*G48+F48*H48)","v":0}]
[{"$nulls":7},"Custo horário total de equipamentos",null,{"$f":"SUM(J47:J48)","v":0}]
[null,"B - MÃO DE OBRA",null,"Quantidade","Unidade",null,"Custo Horário","Custo Horário Total"]
[null,"P9812","Engenheiro",0.19853791688045189,"mês",null,26055.551500000001,null,null,{"$f":"D51*G51","v":5173.0149179813334}]
[null,"P9840","Encarregado geral",1,"mês",null,9322.8229499999998,null,null,{"$f":"D52*G52","v":9322.8229499999998}]
[null,"P9876","Técnico de segurança do trabalho",0.5,"mês",null,5491.8777199999995,null,null,2745.9388599999997]
[null,"P9858","Laboratorista",0.5,"mês",null,4464.0894899999994,null,null,2232.0447449999997]
[null,"P9806","Auxiliar administrativo",0.25,"mês",null,3130.4371699999997,null,null,782.60929249999992]
[null,null,null,"Custo horário total de mão de obra",{"$nulls":5},{"$f":"SUM(J51:J55)","v":20256.430765481331}]
[null,null,null,"Custo horário total de execução",{"$nulls":5},{"$f":"J49+J56","v":20256.430765481331}]
[null,null,null,"Custo unitário de execução",{"$nulls":5},{"$f":"J57/I43","v":121538.58459288799}]
[{"$nulls":7},"Custo do FIC",null,"-"]
[{"$nulls":7},"Custo do FIT",null,"-"]
[null,"C - MATERIAL",null,"Quantidade","Unidade",null,"Preço Unitário","Custo Unitário"]
[null,"-",0,0,0,null,0,null,null,{"$f":"D62*G62","v":0}]
[null,"-",0,0,0,null,0,null,null,0]
[null,null,null,"Custo unitário total de material",{"$nulls":5},{"$f":"SUM(J62:J63)","v":0}]
[null,"D - ATIVIDADES AUXILIARES",null,"Quantidade","Unidade",null,"Custo Unitário","Custo Unitário"]
[null,14250,"Energia Elétrica",360,"kwh",null,0.95,null,null,{"$f":"D66*G66","v":342}]
[null,44480,"Tarifa A - Água e Esgoto",24,"m³",null,17.97,null,null,{"$f":"D67*G67","v":431.28}]
[null,5212560,"Placa de advertência para sinalização de obras montada em suporte metálico móvel, lado 1,00 m - utilização de 600 ciclos - fornecimento, 01 implantação e 01 retirada diária",528,"un.dia",null,3.89,null,null,{"$f":"D68*G68","v":2053.92}]
[null,"Cotação","Telefone",6,"mês",null,59.9,null,null,{"$f":"D69*G69","v":359.4}]
[null,null,null,"Custo total de atividades auxiliares",{"$nulls":5},{"$f":"SUM(J66:J69)","v":3186.6}]
[{"$nulls":7},"Subtotal",null,{"$f":"J58+J64+J70","v":124725.18459288799}]
[null,"E - TEMPO FIXO",null,"Código","Quantidade","Unidade",null,"Custo Unitário","Custo Unitário"]
[null,"-",0,"-",0,"t",null,0,null,{"$f":"ROUNDDOWN(E73*H73,4)","v":0}]
[null,"-",0,"-",0,"t",null,0,null,{"$f":"ROUNDDOWN(E74*H74,4)","v":0}]
[null,null,null,"Custo unitário total de tempo fixo",{"$nulls":5},{"$f":"SUM(J73:J74)","v":0}]
[null,"F - MOMENTO DE TRANSPORTE",null,"Quantidade","Unidade","DMT",null,null,null,"Custo Unitário"]
[{"$nulls":5},"LN","RP","P"]
[null,"-",0,null,"tkm"]
[null,"-",0,null,"tkm"]
[null,null,null,"Custo unitário total de transporte"]
[{"$nulls":5},"Custo unitário direto total",null,null,null,{"$f":"TRUNC(J71+J75,2)","v":124725.18}]
[null,"Obs."]
[]
[{"$f":"A40+1","v":3},"1ª/GRD",{"$nulls":8},{"$f":"J120","v":7137.55}]
[null,"OBRA:"," PAVIMENTAÇÃO ASFÁLTICA EM CBUQ - VIAS URBANAS DIVERSAS - DISTRITO  DE CONCEIÇÃO DE TEIXEIRAS (AUGUSTO DE LIMA / MG)"]
[null,"Custo Unitário de Referência",null,null,"Minas Gerais"]
[{"$nulls":4}," Janeiro/2025 ",null,null,"Produção da equipe ",1,{"$f":"VLOOKUP(A84,ORÇAMENTO!$A$10:$L$42,7,1)","v":"GL"}]
[null,"CPU.3","CANTEIRO DE OBRAS ",{"$nulls":5},"Valores em reais (R$)"]
[null,"A - EQUIPAMENTOS",null,"Quantidade","Utilização",null,"Custo Horário",null,null,"Custo"]
[{"$nulls":4},"Operativa","Improdutiva","Produtivo","Improdutivo",null,"Horário Total"]
[null,"-",0,null,null,null,0,0,null,{"$f":"D91*(E91*G91+F91*H91)","v":0}]
[null,"-",0,null,null,null,0,0,null,{"$f":"D92*(E92*G92+F92*H92)","v":0}]
[{"$nulls":7},"Custo horário total de equipamentos",null,{"$f":"SUM(J91:J92)","v":0}]
[null,"B - MÃO DE OBRA",null,"Quantidade","Unidade",null,"Custo Horário","Custo Horário Total"]
[null,"P9824","Servente",8,"h",null,21.3355,null,null,{"$f":"D95*G95","v":170.684}]
[null,"P9808","Carpinteiro",8,"h",null,26.4529,null,null,{"$f":"D96*G96","v":211.6232}]
[null,null,null,"Custo horário total de mão de obra",{"$nulls":5},{"$f":"SUM(J95:J96)","v":382.30719999999997}]
[null,null,null,"Custo horário total de execução",{"$nulls":5},{"$f":"J93+J97","v":382.30719999999997}]
[null,null,null,"Custo unitário de execução",{"$nulls":5},{"$f":"J98/I87","v":382.30719999999997}]
[{"$nulls":7},"Custo do FIC",null,"-"]
[{"$nulls":7},"Custo do FIT",null,"-"]
[null,"C - MATERIAL",null,"Quantidade","Unidade",null,"Preço Unitário","Custo Unitário"]
[null,"M0053","Tela plástica em polipropileno na cor laranja para tapume - L = 1,2 m",60,"m",null,1.7749999999999999,null,null,{"$f":"D103*G103","v":106.5}]
[null,"-",0,0,0,null,0,null,null,{"$f":"D104*G104","v":0}]
[null,null,null,"Custo unitário total de material",{"$nulls":5},{"$f":"SUM(J103:J104)","v":106.5}]
[null,"D - ATIVIDADES AUXILIARES",null,"Quantidade","Unidade",null,"Custo Unitário","Custo Unitário"]
[null,10775,"Locação de container 2,30 X 6,00 m, alt. 2,50 m, com 1 sanitário, para escritório, completo, sem divisórias internas",3,"mês",null,985,null,null,{"$f":"D107*G107","v":2955}]
[null,10779,"Locação de container 2,30 X 4,30 m, alt. 2,50 M, p/ sanitário, c/ 5 bacias, 1 lavatório e 4 mictórios",3,"mês",null,1231.25,null,null,{"$f":"D108*G108","v":3693.75}]
[null,null,null,"Custo total de atividades auxiliares",{"$nulls":5},{"$f":"SUM(J107:J108)","v":6648.75}]
[{"$nulls":7},"Subtotal",null,{"$f":"J99+J105+J109","v":7137.5572000000002}]
[null,"E - TEMPO FIXO",null,"Código","Quantidade","Unidade",null,"Custo Unitário","Custo Unitário"]
[null,"-",0,"-",0,"t",null,0,null,{"$f":"ROUNDDOWN(E112*H112,4)","v":0}]
[null,"-",0,"-",0,"t",null,0,null,{"$f":"ROUNDDOWN(E113*H113,4)","v":0}]
[null,null,null,"Custo unitário total de tempo fixo",{"$nulls":5},{"$f":"SUM(J112:J113)","v":0}]
[null,"F - MOMENTO DE TRANSPORTE",null,"Quantidade","Unidade","DMT",null,null,null,"Custo Unitário"]
[{"$nulls":5},"LN","RP","P"]
[null,"-",0,0,"tkm"]
[null,"-",0,0,"tkm"]
[null,null,null,"Custo unitário total de transporte"]
[{"$nulls":5},"Custo unitário direto total",null,null,null,{"$f":"TRUNC(J110+J114,2)","v":7137.55}]
[null,"Obs."]
[]
[{"$f":"A84+1","v":4},"1ª/GRD",{"$nulls":8},{"$f":"J161","v":351.42}]
[null,"OBRA:"," PAVIMENTAÇÃO ASFÁLTICA EM CBUQ - VIAS URBANAS DIVERSAS - DISTRITO  DE CONCEIÇÃO DE TEIXEIRAS (AUGUSTO DE LIMA / MG)"]
[null,"Custo Unitário de Referência",null,null,"Minas Gerais"]
[{"$nulls":4}," Janeiro/2025 ",null,null,"Produção da equipe ",1,{"$f":"VLOOKUP(A123,ORÇAMENTO!$A$10:$L$42,7,1)","v":"M2"}]
[null,103689,"PLACA DE OBRA EM CHAPA DE AÇO GALVANIZADO",{"$nulls":5},"Valores em reais (R$)"]
[null,"A - EQUIPAMENTOS",null,"Quantidade","Utilização",null,"Custo Horário",null,null,"Custo"]
[{"$nulls":4},"Operativa","Improdutiva","Produtivo","Improdutivo",null,"Horário Total"]
[null,"-",0,null,null,null,0,0,null,{"$f":"D130*(E130*G130+F130*H130)","v":0}]
[null,"-",0,null,null,null,0,0,null,{"$f":"D131*(E131*G131+F131*H131)","v":0}]
[{"$nulls":7},"Custo horário total de equipamentos",null,{"$f":"SUM(J130:J131)","v":0}]
[null,"B - MÃO DE OBRA",null,"Quantidade","Unidade",null,"Custo Horário","Custo Horário Total"]
[null,"P9824","Servente",1.1186,"h",null,21.3355,null,null,{"$f":"D134*G134","v":23.8658903}]
[null,"P9808","Carpinteiro",0.37290000000000001,"h",null,26.4529,null,null,{"$f":"D135*G135","v":9.8642864100000001}]
[null,null,null,"Custo horário total de mão de obra",{"$nulls":5},{"$f":"SUM(J134:J135)","v":33.730176710000002}]
[null,null,null,"Custo horário total de execução",{"$nulls":5},{"$f":"J132+J136","v":33.730176710000002}]
[null,null,null,"Custo unitário de execução",{"$nulls":5},{"$f":"J137/I126","v":33.730176710000002}]
[{"$nulls":7},"Custo do FIC",null,"-"]
[{"$nulls":7},"Custo do FIT",null,"-"]
[null,"C - MATERIAL",null,"Quantidade","Unidade",null,"Preço Unitário","Custo Unitário"]
[null,"M1358","Sarrafo em madeira de terceira - E = 2,5 cm e L = 5 cm",6.4165999999999999,"m",null,1.9665999999999999,null,null,{"$f":"D142*G142","v":12.618885559999999}]
[null,"M1205","Prego de ferro",2.4500000000000001E-2,"kg",null,16.544499999999999,null,null,{"$f":"D143*G143","v":0.40534025000000001}]
[null,"M0998","Madeira estrutural de eucalipto",2.2608E-2,"m³",null,2418.0391,null,null,{"$f":"D144*G144","v":54.6670279728}]
[null,4813,"Placa de obra (para construção civil) em chapa galvanizada *N. 22*, adesivada, de *2,4 X 1,2* m (sem postes para fixação)",1,"m²",null,250,null,null,250]
[null,null,null,"Custo unitário total de material",{"$nulls":5},{"$f":"SUM(J142:J145)","v":317.6912537828}]
[null,"D - ATIVIDADES AUXILIARES",null,"Quantidade","Unidade",null,"Custo Unitário","Custo Unitário"]
[null,"-",0,0,0,null,0,null,null,{"$f":"D148*G148","v":0}]
[null,"-",0,0,0,null,0,null,null,{"$f":"D149*G149","v":0}]
[null,null,null,"Custo total de atividades auxiliares",{"$nulls":5},{"$f":"SUM(J148:J149)","v":0}]
[{"$nulls":7},"Subtotal",null,{"$f":"J138+J146+J150","v":351.42143049280003}]
[null,"E - TEMPO FIXO",null,"Código","Quantidade","Unidade",null,"Custo Unitário","Custo Unitário"]
[null,"-",0,"-",0,"t",null,0,null,{"$f":"ROUNDDOWN(E153*H153,4)","v":0}]
[null,"-",0,"-",0,"t",null,0,null,{"$f":"ROUNDDOWN(E154*H154,4)","v":0}]
[null,null,null,"Custo unitário total de tempo fixo",{"$nulls":5},{"$f":"SUM(J153:J154)","v":0}]
[null,"F - MOMENTO DE TRANSPORTE",null,"Quantidade","Unidade","DMT",null,null,null,"Custo Unitário"]
[{"$nulls":5},"LN","RP","P"]
[null,"-",0,0,"tkm"]
[null,"-",0,0,"tkm"]
[null,null,null,"Custo unitário total de transporte"]
[{"$nulls":5},"Custo unitário direto total",null,null,null,{"$f":"TRUNC(J151+J155,2)","v":351.42}]
[null,"Obs."]
[]
[6,"1ª/GRD",{"$nulls":8},{"$f":"J202","v":0.49}]
[null,"OBRA:"," PAVIMENTAÇÃO ASFÁLTICA EM CBUQ - VIAS URBANAS DIVERSAS - DISTRITO  DE CONCEIÇÃO DE TEIXEIRAS (AUGUSTO DE LIMA / MG)"]
[null,"Custo Unitário de Referência",null,null,"Minas Gerais"]
[{"$nulls":4}," Janeiro/2025 ",null,null,"Produção da equipe ",1,{"$f":"VLOOKUP(A164,ORÇAMENTO!$A$10:$L$42,7,1)","v":"M2"}]
[null,78472,"SERVIÇOS TOPOGRÁFICOS PARA PAVIMENTAÇÃO, INCLUSIVE LEVANTAMENTO PLANIALTIMÉTRICO CADASTRAL, GERAÇÃO DE NOTAS DE SERVIÇO, SEÇÕES TRANSVERSAIS E GREIDE, ESTAQUEAMENTO E ACOMPANHAMENTO EXECUTIVO",{"$nulls":5},"Valores em reais (R$)"]
[null,"A - EQUIPAMENTOS",null,"Quantidade","Utilização",null,"Custo Horário",null,null,"Custo"]
[{"$nulls":4},"Operativa","Improdutiva","Produtivo","Improdutivo",null,"Horário Total"]
[null,92145,"Caminhonete cabine simples com motor 1.6 flex, câmbio manual, potência 101/104 cv, 2 portas",5.0000000000000001E-4,1,0,76.5,0,null,{"$f":"D171*(E171*G171+F171*H171)","v":3.8249999999999999E-2}]
[null,"-",0,0,1,0,0,0,null,{"$f":"D172*(E172*G172+F172*H172)","v":0}]
[{"$nulls":7},"Custo horário total de equipamentos",null,{"$f":"SUM(J171:J172)","v":3.8249999999999999E-2}]
[null,"B - MÃO DE OBRA",null,"Quantidade","Unidade",null,"Custo Horário","Custo Horário Total"]
[null,"P9949","Topógrafo",1.590909090909091E-5,"mês",null,6816.9715999999999,28.404048333333332,null,{"$f":"D175*G175","v":0.10845182090909092}]
[null,"P9950","Auxiliar de topografia",1.590909090909091E-5,"mês",null,6157.8463000000002,22.806838148148149,null,{"$f":"D176*G176","v":9.7965736590909097E-2}]
[null,"P9824","Servente",7.4999999999999997E-3,"h",null,21.3355,8.889791666666666E-2,null,{"$f":"D177*G177","v":0.16001625}]
[null,"P9848","Desenhista",9.090909090909091E-6,"mês",null,10307.748600000001,38.17684666666667,null,{"$f":"D178*G178","v":9.3706805454545461E-2}]
[null,null,null,"Custo horário total de mão de obra",{"$nulls":5},{"$f":"SUM(J175:J178)","v":0.46014061295454545}]
[null,null,null,"Custo horário total de execução",{"$nulls":5},{"$f":"J173+J179","v":0.49839061295454545}]
[null,null,null,"Custo unitário de execução",{"$nulls":5},{"$f":"J180/I167","v":0.49839061295454545}]
[{"$nulls":7},"Custo do FIC",null,"-"]
[{"$nulls":7},"Custo do FIT",null,"-"]
[null,"C - MATERIAL",null,"Quantidade","Unidade",null,"Preço Unitário","Custo Unitário"]
[null,"-",0,0,0,null,0,null,null,{"$f":"D185*G185","v":0}]
[null,"-",0,0,0,null,0,null,null,0]
[null,null,null,"Custo unitário total de material",{"$nulls":5},{"$f":"SUM(J185:J186)","v":0}]
[null,"D - ATIVIDADES AUXILIARES",null,"Quantidade","Unidade",null,"Custo Unitário","Custo Unitário"]
[null,"-",0,0,0,null,0,null,null,{"$f":"D189*G189","v":0}]
[null,"-",0,0,0,null,0,null,null,{"$f":"D190*G190","v":0}]
[null,null,null,"Custo total de atividades auxiliares",{"$nulls":5},{"$f":"SUM(J189:J190)","v":0}]
[{"$nulls":7},"Subtotal",null,{"$f":"J181+J187+J191","v":0.49839061295454545}]
[null,"E - TEMPO FIXO",null,"Código","Quantidade","Unidade",null,"Custo Unitário","Custo Unitário"]
[null,"-",0,"-",0,"t",null,0,null,{"$f":"ROUNDDOWN(E194*H194,4)","v":0}]
[null,"-",0,"-",0,"t",null,0,null,{"$f":"ROUNDDOWN(E195*H195,4)","v":0}]
[null,null,null,"Custo unitário total de tempo fixo",{"$nulls":5},{"$f":"SUM(J194:J195)","v":0}]
[null,"F - MOMENTO DE TRANSPORTE",null,"Quantidade","Unidade","DMT",null,null,null,"Custo Unitário"]
[{"$nulls":5},"LN","RP","P"]
[null,"-",0,0,"tkm"]
[null,"-",0,0,"tkm"]
[null,null,null,"Custo unitário total de transporte"]
[{"$nulls":5},"Custo unitário direto total",null,null,null,{"$f":"TRUNC(J192+J196,2)","v":0.49}]
[null,"Obs."]
[]
[{"$f":"A164+1","v":7},"1ª/GRD",{"$nulls":8},{"$f":"J241","v":6.74}]
[null,"OBRA:"," PAVIMENTAÇÃO ASFÁLTICA EM CBUQ - VIAS URBANAS DIVERSAS - DISTRITO  DE CONCEIÇÃO DE TEIXEIRAS (AUGUSTO DE LIMA / MG)"]
[null,"Custo Unitário de Referência",null,null,"Minas Gerais"]
[{"$nulls":4}," Janeiro/2025 ",null,null,"Produção da equipe ",230.19,{"$f":"VLOOKUP(A205,ORÇAMENTO!$A$10:$L$42,7,1)","v":"M3"}]
[null,5502140,"ESCAVAÇÃO, CARGA E TRANSPORTE DE MATERIAL DE 1ª CATEGORIA - DMT 1.000 A 1.200M, CAMINHO DE SERVIÇO EM REVESTIMENTO PRIMÁRIO",{"$nulls":5},"Valores em reais (R$)"]
[null,"A - EQUIPAMENTOS",null,"Quantidade","Utilização",null,"Custo Horário",null,null,"Custo"]
[{"$nulls":4},"Operativa","Improdutiva","Produtivo","Improdutivo",null,"Horário Total"]
[null,"E9667","Caminhão basculante com capacidade de 14 m³ - 210 kW",4,0.97,0.03,309.83940000000001,90.412199999999999,null,{"$f":"D212*(E212*G212+F212*H212)","v":1213.0263359999999}]
[null,"E9515","Escavadeira hidráulica sobre esteiras com caçamba com capacidade de 1,56 m³ - 118 kW",1,1,0,287.62189999999998,129.0472,null,{"$f":"D213*(E213*G213+F213*H213)","v":287.62189999999998}]
[{"$nulls":7},"Custo horário total de equipamentos",null,{"$f":"SUM(J212:J213)","v":1500.648236}]
[null,"B - MÃO DE OBRA",null,"Quantidade","Unidade",null,"Custo Horário","Custo Horário Total"]
[null,"P9824","Servente",1,"h",null,21.3355,null,null,{"$f":"D216*G216","v":21.3355}]
[{"$nulls":9},{"$f":"D217*G217","v":0}]
[null,null,null,"Custo horário total de mão de obra",{"$nulls":5},{"$f":"SUM(J216:J217)","v":21.3355}]
[null,null,null,"Custo horário total de execução",{"$nulls":5},{"$f":"J214+J218","v":1521.9837359999999}]
[null,null,null,"Custo unitário de execução",{"$nulls":5},{"$f":"J219/I208","v":6.6118586211390591}]
[{"$nulls":7},"Custo do FIC",null,0.1313]
[{"$nulls":7},"Custo do FIT",null,0]
[null,"C - MATERIAL",null,"Quantidade","Unidade",null,"Preço Unitário","Custo Unitário"]
[null,"-",0,null,0,null,0,null,null,{"$f":"D224*G224","v":0}]
[null,"-",0,null,0,null,0,null,null,{"$f":"D225*G225","v":0}]
[null,null,null,"Custo unitário total de material",{"$nulls":5},{"$f":"SUM(J224:J225)","v":0}]
[null,"D - ATIVIDADES AUXILIARES",null,"Quantidade","Unidade",null,"Custo Unitário","Custo Unitário"]
[null,"-",0,0,0,null,0,null,null,{"$f":"D228*G228","v":0}]
[null,"-",0,0,0,null,0,null,null,{"$f":"D229*G229","v":0}]
[null,null,null,"Custo total de atividades auxiliares",{"$nulls":5},{"$f":"SUM(J228:J229)","v":0}]
[{"$nulls":7},"Subtotal",null,{"$f":"J220+J226+J230+J221+J222","v":6.7431586211390595}]
[null,"E - TEMPO FIXO",null,"Código","Quantidade","Unidade",null,"Custo Unitário","Custo Unitário"]
[null,"-",0,"-",0,"t",null,0,null,{"$f":"ROUNDDOWN(E233*H233,4)","v":0}]
[null,"-",0,"-",0,"t",null,0,null,{"$f":"ROUNDDOWN(E234*H234,4)","v":0}]
[null,null,null,"Custo unitário total de tempo fixo",{"$nulls":5},{"$f":"SUM(J233:J234)","v":0}]
[null,"F - MOMENTO DE TRANSPORTE",null,"Quantidade","Unidade","DMT",null,null,null,"Custo Unitário"]
[{"$nulls":5},"LN","RP","P"]
[null,"-",0,null,"tkm","5914449","5914464","5914479"]
[null,"-",0,null,"tkm","5914449","5914464","5914479"]
[null,null,null,"Custo unitário total de transporte"]
[{"$nulls":5},"Custo unitário direto total",null,null,null,{"$f":"TRUNC(J231+J235,2)","v":6.74}]
[null,"Obs."]
[]
[9,"1ª/GRD",{"$nulls":8},{"$f":"J284","v":1.54}]
[null,"OBRA:"," PAVIMENTAÇÃO ASFÁLTICA EM CBUQ - VIAS URBANAS DIVERSAS - DISTRITO  DE CONCEIÇÃO DE TEIXEIRAS (AUGUSTO DE LIMA / MG)"]
[null,"Custo Unitário de Referência",null,null,"Minas Gerais"]
[{"$nulls":4}," Janeiro/2025 ",null,null,"Produção da equipe ",672.8,{"$f":"VLOOKUP(A244,ORÇAMENTO!$A$10:$L$42,7,1)","v":"M2"}]
[null,4011209,"REGULARIZAÇÃO E COMPACTAÇÃO DO SUBLEITO ",{"$nulls":5},"Valores em reais (R$)"]
[null,"A - EQUIPAMENTOS",null,"Quantidade","Utilização",null,"Custo Horário",null,null,"Custo"]
[{"$nulls":4},"Operativa","Improdutiva","Produtivo","Improdutivo",null,"Horário Total"]
[null,"E9571","Caminhão tanque com capacidade de 10.000 l - 188 kW",1,0.61,0.39,323.59019999999998,80.173299999999998,null,{"$f":"D251*(E251*G251+F251*H251)","v":228.65760899999998}]
[null,"E9518","Grade de 24 discos rebocável de D = 60 cm (24\")",1,0.41,0.59000000000000008,4.9436,3.4426000000000001,null,{"$f":"D252*(E252*G252+F252*H252)","v":4.0580099999999995}]
[null,"E9524","Motoniveladora - 93 kW",1,0.43,0.57000000000000006,288.51479999999998,125.7629,null,195.746217]
[null,"E9762","Rolo compactador de pneus autopropelido de 27 t - 85 kW",1,0.96,4.0000000000000036E-2,255.65049999999999,124.5621,null,250.40696399999999]
[null,"E9685","Rolo compactador pé de carneiro vibratório autopropelido por pneus de 11,6 t - 82 kW",1,1,0,225.9264,101.55289999999999,null,225.9264]
[null,"E9577","Trator agrícola sobre pneus - 77 kW",1,0.41,0.59000000000000008,152.69229999999999,55.394399999999997,null,95.286538999999991]
[{"$nulls":7},"Custo horário total de equipamentos",null,{"$f":"SUM(J251:J256)","v":1000.081739}]
[null,"B - MÃO DE OBRA",null,"Quantidade","Unidade",null,"Custo Horário","Custo Horário Total"]
[null,"P9824","Servente",1,"h",null,21.3355,null,null,{"$f":"D259*G259","v":21.3355}]
[null,"-",null,0,0,null,0,null,null,{"$f":"D260*G260","v":0}]
[null,null,null,"Custo horário total de mão de obra",{"$nulls":5},{"$f":"SUM(J259:J260)","v":21.3355}]
[null,null,null,"Custo horário total de execução",{"$nulls":5},{"$f":"J257+J261","v":1021.417239}]
[null,null,null,"Custo unitário de execução",{"$nulls":5},{"$f":"J262/I247","v":1.5181587975624258}]
[{"$nulls":7},"Custo do FIC",null,2.2700000000000001E-2]
[{"$nulls":7},"Custo do FIT",null,0]
[null,"C - MATERIAL",null,"Quantidade","Unidade",null,"Preço Unitário","Custo Unitário"]
[null,"-",0,null,0,null,0,null,null,{"$f":"D267*G267","v":0}]
[null,"-",0,null,0,null,0,null,null,{"$f":"D268*G268","v":0}]
[null,null,null,"Custo unitário total de material",{"$nulls":5},{"$f":"SUM(J267:J268)","v":0}]
[null,"D - ATIVIDADES AUXILIARES",null,"Quantidade","Unidade",null,"Custo Unitário","Custo Unitário"]
[null,"-",0,0,0,null,0,null,null,{"$f":"D271*G271","v":0}]
[null,"-",0,0,0,null,0,null,null,{"$f":"D272*G272","v":0}]
[null,null,null,"Custo total de atividades auxiliares",{"$nulls":5},{"$f":"SUM(J271:J272)","v":0}]
[{"$nulls":7},"Subtotal",null,{"$f":"J263+J269+J273+J264+J265","v":1.5408587975624257}]
[null,"E - TEMPO FIXO",null,"Código","Quantidade","Unidade",null,"Custo Unitário","Custo Unitário"]
[null,"-",0,"-",0,"t",null,0,null,{"$f":"ROUNDDOWN(E276*H276,4)","v":0}]
[null,"-",0,"-",0,"t",null,0,null,{"$f":"ROUNDDOWN(E277*H277,4)","v":0}]
[null,null,null,"Custo unitário total de tempo fixo",{"$nulls":5},{"$f":"SUM(J276:J277)","v":0}]
[null,"F - MOMENTO DE TRANSPORTE",null,"Quantidade","Unidade","DMT",null,null,null,"Custo Unitário"]
[{"$nulls":5},"LN","RP","P"]
[null,"-",0,null,"tkm","5914449","5914464","5914479"]
[null,"-",0,null,"tkm","5914449","5914464","5914479"]
[null,null,null,"Custo unitário total de transporte"]
[{"$nulls":5},"Custo unitário direto total",null,null,null,{"$f":"TRUNC(J274+J278,2)","v":1.54}]
[null,"Obs."]
[]
[{"$f":"A244+1","v":10},"1ª/GRD",{"$nulls":8},{"$f":"J327","v":14.78}]
[null,"OBRA:"," PAVIMENTAÇÃO ASFÁLTICA EM CBUQ - VIAS URBANAS DIVERSAS - DISTRITO  DE CONCEIÇÃO DE TEIXEIRAS (AUGUSTO DE LIMA / MG)"]
[null,"Custo Unitário de Referência",null,null,"Minas Gerais"]
[{"$nulls":4}," Janeiro/2025 ",null,null,"Produção da equipe ",112.13,{"$f":"VLOOKUP(A287,ORÇAMENTO!$A$10:$L$42,7,1)","v":"M3"}]
[null,4011219,"EXECUÇÃO E COMPACTAÇÃO DE BASE E OU SUB BASE PARA PAVIMENTAÇÃO COM SOLO ESTABILIZADO GRANULOMETRICAMENTE SEM MISTURA, COM MATERIAL DE JAZIDA - EXCLUSIVE TRANSPORTE",{"$nulls":5},"Valores em reais (R$)"]
[null,"A - EQUIPAMENTOS",null,"Quantidade","Utilização",null,"Custo Horário",null,null,"Custo"]
[{"$nulls":4},"Operativa","Improdutiva","Produtivo","Improdutivo",null,"Horário Total"]
[null,"E9571","Caminhão tanque com capacidade de 10.000 l - 188 kW",1,0.62,0.38,323.59019999999998,80.173299999999998,null,{"$f":"D294*(E294*G294+F294*H294)","v":231.09177800000001}]
[null,"E9518","Grade de 24 discos rebocável de D = 60 cm (24\")",1,0.34,0.65999999999999992,4.9436,3.4426000000000001,null,{"$f":"D295*(E295*G295+F295*H295)","v":3.9529399999999999}]
[null,"E9524","Motoniveladora - 93 kW",1,0.5,0.5,288.51479999999998,125.7629,null,{"$f":"D296*(E296*G296+F296*H296)","v":207.13884999999999}]
[null,"E9762","Rolo compactador de pneus autopropelido de 27 t - 85 kW",1,0.96,4.0000000000000036E-2,255.65049999999999,124.5621,null,250.40696399999999]
[null,"E9685","Rolo compactador pé de carneiro vibratório autopropelido por pneus de 11,6 t - 82 kW",1,1,0,225.9264,101.55289999999999,null,225.9264]
[null,"E9577","Trator agrícola sobre pneus - 77 kW",1,0.34,0.65999999999999992,152.69229999999999,55.394399999999997,null,88.475685999999996]
[{"$nulls":7},"Custo horário total de equipamentos",null,{"$f":"SUM(J294:J299)","v":1006.992618}]
[null,"B - MÃO DE OBRA",null,"Quantidade","Unidade",null,"Custo Horário","Custo Horário Total"]
[null,"P9824","Servente",1,"h",null,21.3355,null,null,{"$f":"D302*G302","v":21.3355}]
[null,"-",0,0,0,null,0,null,null,{"$f":"D303*G303","v":0}]
[null,null,null,"Custo horário total de mão de obra",{"$nulls":5},{"$f":"SUM(J302:J303)","v":21.3355}]
[null,null,null,"Custo horário total de execução",{"$nulls":5},{"$f":"J300+J304","v":1028.3281179999999}]
[null,null,null,"Custo unitário de execução",{"$nulls":5},{"$f":"J305/I290","v":9.1708563096405946}]
[{"$nulls":7},"Custo do FIC",null,0.18740000000000001]
[{"$nulls":7},"Custo do FIT",null,0]
[null,"C - MATERIAL",null,"Quantidade","Unidade",null,"Preço Unitário","Custo Unitário"]
[null,"-",0,null,0,null,0,null,null,{"$f":"D310*G310","v":0}]
[null,"-",0,null,0,null,0,null,null,{"$f":"D311*G311","v":0}]
[null,null,null,"Custo unitário total de material",{"$nulls":5},{"$f":"SUM(J310:J311)","v":0}]
[null,"D - ATIVIDADES AUXILIARES",null,"Quantidade","Unidade",null,"Custo Unitário","Custo Unitário"]
[null,4016096,"Escavação e carga de material de jazida com escavadeira hidráulica de 1,56 m³",1.1002700000000001,"m³",null,1.37,null,null,{"$f":"D314*G314","v":1.5073699000000003}]
[null,"-",0,0,0,null,0,null,null,{"$f":"D315*G315","v":0}]
[null,null,null,"Custo total de atividades auxiliares",{"$nulls":5},{"$f":"SUM(J314:J315)","v":1.5073699000000003}]
[{"$nulls":7},"Subtotal",null,{"$f":"J306+J312+J316+J307+J308","v":10.865626209640595}]
[null,"E - TEMPO FIXO",null,"Código","Quantidade","Unidade",null,"Custo Unitário","Custo Unitário"]
[null,4016096,"Escavação e carga de material de jazida com escavadeira hidráulica de 1,56 m³",5914354,2.0630099999999998,"t",null,1.9,null,{"$f":"ROUNDDOWN(E319*H319,4)","v":3.9197000000000002}]
[null,"-",0,"-",null,"t",null,0,null,{"$f":"ROUNDDOWN(E320*H320,4)","v":0}]
[null,null,null,"Custo unitário total de tempo fixo",{"$nulls":5},{"$f":"SUM(J319:J320)","v":3.9197000000000002}]
[null,"F - MOMENTO DE TRANSPORTE",null,"Quantidade","Unidade","DMT",null,null,null,"Custo Unitário"]
[{"$nulls":5},"LN","RP","P"]
[null,4016096,"Escavação e carga de material de jazida com escavadeira hidráulica de 1,56 m³",2.0630099999999998,"tkm","5914359","5914374","5914389"]
[null,"-",0,0,"tkm"]
[null,null,null,"Custo unitário total de transporte"]
[{"$nulls":5},"Custo unitário direto total",null,null,null,{"$f":"TRUNC(J317+J321,2)","v":14.78}]
[null,"Obs."]
[]
[12,"1ª/GRD",{"$nulls":8},{"$f":"J366","v":0.4}]
[null,"OBRA:"," PAVIMENTAÇÃO ASFÁLTICA EM CBUQ - VIAS URBANAS DIVERSAS - DISTRITO  DE CONCEIÇÃO DE TEIXEIRAS (AUGUSTO DE LIMA / MG)"]
[null,"Custo Unitário de Referência",null,null,"Minas Gerais"]
[{"$nulls":4}," Janeiro/2025 ",null,null,"Produção da equipe ",1038.46,{"$f":"VLOOKUP(A330,ORÇAMENTO!$A$10:$L$42,7,1)","v":"M2"}]
[null,4011352,"IMPRIMAÇÃO COM EMULSÃO ASFÁLTICA (EAI)",{"$nulls":5},"Valores em reais (R$)"]
[null,"A - EQUIPAMENTOS",null,"Quantidade","Utilização",null,"Custo Horário",null,null,"Custo"]
[{"$nulls":4},"Operativa","Improdutiva","Produtivo","Improdutivo",null,"Horário Total"]
[null,"E9509","Caminhão tanque distribuidor de asfalto com capacidade de 6.000 l - 7 kW/136 kW",1,1,0,261.03050000000002,72.388300000000001,null,{"$f":"D337*(E337*G337+F337*H337)","v":261.03050000000002}]
[null,"E9558","Tanque de estocagem de asfalto com capacidade de 30.000 l",2,1,0,56.138500000000001,38.346699999999998,null,{"$f":"D338*(E338*G338+F338*H338)","v":112.277}]
[{"$nulls":7},"Custo horário total de equipamentos",null,{"$f":"SUM(J337:J338)","v":373.3075}]
[null,"B - MÃO DE OBRA",null,"Quantidade","Unidade",null,"Custo Horário","Custo Horário Total"]
[null,"P9824","Servente",2,"h",null,21.3355,null,null,{"$f":"D341*G341","v":42.670999999999999}]
[null,"-",{"$nulls":7},{"$f":"D342*G342","v":0}]
[null,null,null,"Custo horário total de mão de obra",{"$nulls":5},{"$f":"SUM(J341:J342)","v":42.670999999999999}]
[null,null,null,"Custo horário total de execução",{"$nulls":5},{"$f":"J339+J343","v":415.9785}]
[null,null,null,"Custo unitário de execução",{"$nulls":5},{"$f":"J344/I333","v":0.40057248232960341}]
[{"$nulls":7},"Custo do FIC",null,1.4E-3]
[{"$nulls":7},"Custo do FIT",null,0]
[null,"C - MATERIAL",null,"Quantidade","Unidade",null,"Preço Unitário","Custo Unitário"]
[null,"M2092","Emulsão asfáltica para imprimação",1.2999999999999999E-3,"t",null,0,"FORNECIMENTO COM BDI DIFERENCIADO",null,{"$f":"D349*G349","v":0}]
[null,"-",0,89.28,0,null,0,null,null,{"$f":"D350*G350","v":0}]
[null,null,null,"Custo unitário total de material",{"$nulls":5},{"$f":"SUM(J349:J350)","v":0}]
[null,"D - ATIVIDADES AUXILIARES",null,"Quantidade","Unidade",null,"Custo Unitário","Custo Unitário"]
[null,"-",0,0,0,null,0,null,null,{"$f":"D353*G353","v":0}]
[null,"-",0,0,0,null,0,null,null,{"$f":"D354*G354","v":0}]
[null,null,null,"Custo total de atividades auxiliares",{"$nulls":5},{"$f":"SUM(J353:J354)","v":0}]
[{"$nulls":7},"Subtotal",null,{"$f":"J345+J351+J355+J346+J347","v":0.40197248232960342}]
[null,"E - TEMPO FIXO",null,"Código","Quantidade","Unidade",null,"Custo Unitário","Custo Unitário"]
[null,"-",0,"-",0,"t",null,0,null,{"$f":"ROUNDDOWN(E358*H358,4)","v":0}]
[null,"-",0,"-",0,"t",null,0,null,{"$f":"ROUNDDOWN(E359*H359,4)","v":0}]
[null,null,null,"Custo unitário total de tempo fixo",{"$nulls":5},{"$f":"SUM(J358:J359)","v":0}]
[null,"F - MOMENTO DE TRANSPORTE",null,"Quantidade","Unidade","DMT",null,null,null,"Custo Unitário"]
[{"$nulls":5},"LN","RP","P"]
[null,"-",0,null,"tkm"]
[null,"-",0,null,"tkm"]
[null,null,null,"Custo unitário total de transporte"]
[{"$nulls":5},"Custo unitário direto total",null,null,null,{"$f":"TRUNC(J356+J360,2)","v":0.4}]
[null,"Obs."]
[]
[{"$f":"A330+1","v":13},"1ª/GRD",{"$nulls":8},{"$f":"J405","v":0.27}]
[null,"OBRA:"," PAVIMENTAÇÃO ASFÁLTICA EM CBUQ - VIAS URBANAS DIVERSAS - DISTRITO  DE CONCEIÇÃO DE TEIXEIRAS (AUGUSTO DE LIMA / MG)"]
[null,"Custo Unitário de Referência",null,null,"Minas Gerais"]
[{"$nulls":4}," Janeiro/2025 ",null,null,"Produção da equipe ",1500,{"$f":"VLOOKUP(A369,ORÇAMENTO!$A$10:$L$42,7,1)","v":"M2"}]
[null,4011353,"PINTURA DE LIGAÇÃO COM EMULSÃO ASFÁLTICA RR-1C",{"$nulls":5},"Valores em reais (R$)"]
[null,"A - EQUIPAMENTOS",null,"Quantidade","Utilização",null,"Custo Horário",null,null,"Custo"]
[{"$nulls":4},"Operativa","Improdutiva","Produtivo","Improdutivo",null,"Horário Total"]
[null,"E9509","Caminhão tanque distribuidor de asfalto com capacidade de 6.000 l - 7 kW/136 kW",1,1,0,261.03050000000002,72.388300000000001,null,{"$f":"D376*(E376*G376+F376*H376)","v":261.03050000000002}]
[null,"E9558","Tanque de estocagem de asfalto com capacidade de 30.000 l",2,1,0,56.138500000000001,38.346699999999998,null,{"$f":"D377*(E377*G377+F377*H377)","v":112.277}]
[{"$nulls":7},"Custo horário total de equipamentos",null,{"$f":"SUM(J376:J377)","v":373.3075}]
[null,"B - MÃO DE OBRA",null,"Quantidade","Unidade",null,"Custo Horário","Custo Horário Total"]
[null,"P9824","Servente",2,"h",null,21.3355,null,null,{"$f":"D380*G380","v":42.670999999999999}]
[null,"-",{"$nulls":7},{"$f":"D381*G381","v":0}]
[null,null,null,"Custo horário total de mão de obra",{"$nulls":5},{"$f":"SUM(J380:J381)","v":42.670999999999999}]
[null,null,null,"Custo horário total de execução",{"$nulls":5},{"$f":"J378+J382","v":415.9785}]
[null,null,null,"Custo unitário de execução",{"$nulls":5},{"$f":"J383/I372","v":0.27731899999999998}]
[{"$nulls":7},"Custo do FIC",null,8.9999999999999998E-4]
[{"$nulls":7},"Custo do FIT",null,0]
[null,"C - MATERIAL",null,"Quantidade","Unidade",null,"Preço Unitário","Custo Unitário"]
[null,"M1946","Emulsão asfáltica - RR-1C",4.4999999999999999E-4,"t",null,0,"FORNECIMENTO COM BDI DIFERENCIADO",null,{"$f":"D388*G388","v":0}]
[null,"-",0,null,0,null,0,null,null,{"$f":"D389*G389","v":0}]
[null,null,null,"Custo unitário total de material",{"$nulls":5},{"$f":"SUM(J388:J389)","v":0}]
[null,"D - ATIVIDADES AUXILIARES",null,"Quantidade","Unidade",null,"Custo Unitário","Custo Unitário"]
[null,"-",0,0,0,null,0,null,null,{"$f":"D392*G392","v":0}]
[null,"-",0,0,0,null,0,null,null,{"$f":"D393*G393","v":0}]
[null,null,null,"Custo total de atividades auxiliares",{"$nulls":5},{"$f":"SUM(J392:J393)","v":0}]
[{"$nulls":7},"Subtotal",null,{"$f":"J384+J390+J394+J385+J386","v":0.27821899999999999}]
[null,"E - TEMPO FIXO",null,"Código","Quantidade","Unidade",null,"Custo Unitário","Custo Unitário"]
[null,"-",0,"-",0,"t",null,0,null,{"$f":"ROUNDDOWN(E397*H397,4)","v":0}]
[null,"-",0,"-",0,"t",null,0,null,{"$f":"ROUNDDOWN(E398*H398,4)","v":0}]
[null,null,null,"Custo unitário total de tempo fixo",{"$nulls":5},{"$f":"SUM(J397:J398)","v":0}]
[null,"F - MOMENTO DE TRANSPORTE",null,"Quantidade","Unidade","DMT",null,null,null,"Custo Unitário"]
[{"$nulls":5},"LN","RP","P"]
[null,"-",0,null,"tkm"]
[null,"-",0,null,"tkm"]
[null,null,null,"Custo unitário total de transporte"]
[{"$nulls":5},"Custo unitário direto total",null,null,null,{"$f":"TRUNC(J395+J399,2)","v":0.27}]
[null,"Obs."]
[]
[{"$f":"A369+1","v":14},"1ª/GRD",{"$nulls":8},{"$f":"J444","v":176.77}]
[null,"OBRA:"," PAVIMENTAÇÃO ASFÁLTICA EM CBUQ - VIAS URBANAS DIVERSAS - DISTRITO  DE CONCEIÇÃO DE TEIXEIRAS (AUGUSTO DE LIMA / MG)"]
[null,"Custo Unitário de Referência",null,null,"Minas Gerais"]
[{"$nulls":4}," Janeiro/2025 ",null,null,"Produção da equipe ",99.6,{"$f":"VLOOKUP(A408,ORÇAMENTO!$A$10:$L$42,7,1)","v":"T"}]
[null,4011463,"EXECUÇÃO DE PAVIMENTO COM APLICAÇÃO DE CONCRETO ASFÁLTICO USINADO A QUENTE (CBUQ), CAMADA DE ROLAMENTO - EXCLUSIVE TRANSPORTE",{"$nulls":5},"Valores em reais (R$)"]
[null,"A - EQUIPAMENTOS",null,"Quantidade","Utilização",null,"Custo Horário",null,null,"Custo"]
[{"$nulls":4},"Operativa","Improdutiva","Produtivo","Improdutivo",null,"Horário Total"]
[null,"E9762","Rolo compactador de pneus autopropelido de 27 t - 85 kW",1,0.71,0.28999999999999998,255.65049999999999,124.5621,null,{"$f":"D415*(E415*G415+F415*H415)","v":217.63486399999999}]
[null,"E9681","Rolo compactador liso tandem vibratório autopropelido de 10,4 t - 82 kW",1,0.82,0.18,296.77460000000002,113.3899,null,{"$f":"D416*(E416*G416+F416*H416)","v":263.765354}]
[null,"E9545","Vibroacabadora de asfalto sobre esteiras - 97 kW",1,1,0,359.27379999999999,154.22659999999999,null,{"$f":"D417*(E417*G417+F417*H417)","v":359.27379999999999}]
[{"$nulls":7},"Custo horário total de equipamentos",null,{"$f":"SUM(J415:J417)","v":840.67401799999993}]
[null,"B - MÃO DE OBRA",null,"Quantidade","Unidade",null,"Custo Horário","Custo Horário Total"]
[null,"P9824","Servente",8,"h",null,21.3355,null,null,{"$f":"D420*G420","v":170.684}]
[null,null,null,"Custo horário total de mão de obra",{"$nulls":5},{"$f":"SUM(J420:J420)","v":170.684}]
[null,null,null,"Custo horário total de execução",{"$nulls":5},{"$f":"J418+J421","v":1011.3580179999999}]
[null,null,null,"Custo unitário de execução",{"$nulls":5},{"$f":"J422/I411","v":10.154196967871485}]
[{"$nulls":7},"Custo do FIC",null,3.8600000000000002E-2]
[{"$nulls":7},"Custo do FIT",null,0]
[null,"C - MATERIAL",null,"Quantidade","Unidade",null,"Preço Unitário","Custo Unitário"]
[null,"-",0,null,0,null,0,null,null,{"$f":"D427*G427","v":0}]
[null,"-",0,null,0,null,0,null,null,{"$f":"D428*G428","v":0}]
[null,null,null,"Custo unitário total de material",{"$nulls":5},{"$f":"SUM(J427:J428)","v":0}]
[null,"D - ATIVIDADES AUXILIARES",null,"Quantidade","Unidade",null,"Custo Unitário","Custo Unitário"]
[null,6416078,"Usinagem de concreto asfáltico - faixa C-12,5 - areia e brita comerciais",1,"t",null,158.53550119476304,null,null,{"$f":"D431*G431","v":158.53550119476304}]
[null,"-",0,0,0,null,0,null,null,{"$f":"D432*G432","v":0}]
[null,null,null,"Custo total de atividades auxiliares",{"$nulls":5},{"$f":"SUM(J431:J432)","v":158.53550119476304}]
[{"$nulls":7},"Subtotal",null,{"$f":"J423+J429+J433+J424+J425","v":168.72829816263453}]
[null,"E - TEMPO FIXO",null,"Código","Quantidade","Unidade",null,"Custo Unitário","Custo Unitário"]
[null,6416078,"Usinagem de concreto asfáltico - faixa C-12,5 - areia e brita comerciais",5914649,1,"t",null,8.0500000000000007,null,{"$f":"ROUNDDOWN(E436*H436,4)","v":8.0500000000000007}]
[null,"-",0,"-",0,"t",null,0,null,{"$f":"ROUNDDOWN(E437*H437,4)","v":0}]
[null,null,null,"Custo unitário total de tempo fixo",{"$nulls":5},{"$f":"SUM(J436:J437)","v":8.0500000000000007}]
[null,"F - MOMENTO DE TRANSPORTE",null,"Quantidade","Unidade","DMT",null,null,null,"Custo Unitário"]
[{"$nulls":5},"LN","RP","P"]
[null,6416078,"Usinagem de concreto asfáltico - faixa C-12,5 - areia e brita comerciais",1,"tkm"]
[null,"-",0,0,"tkm"]
[null,null,null,"Custo unitário total de transporte"]
[{"$nulls":5},"Custo unitário direto total",null,null,null,{"$f":"TRUNC(J434+J438,2)","v":176.77},205.7]
[null,"Obs."]
[]
[null,"1ª/GRD",{"$nulls":8},{"$f":"J498","v":158.53550119476304}]
[null,"OBRA:"," PAVIMENTAÇÃO ASFÁLTICA EM CBUQ - VIAS URBANAS DIVERSAS - DISTRITO  DE CONCEIÇÃO DE TEIXEIRAS (AUGUSTO DE LIMA / MG)"]
[null,"Custo Unitário de Referência - Auxiliar",null,null,"Minas Gerais"]
[{"$nulls":4}," Janeiro/2025 ",null,null,"Produção da equipe ",99.6,"t"]
[null,6416078,"Usinagem de concreto asfáltico - faixa C - areia e brita comerciais",{"$nulls":5},"Valores em reais (R$)"]
[null,"A - EQUIPAMENTOS",null,"Quantidade","Utilização",null,"Custo Horário",null,null,"Custo"]
[{"$nulls":4},"Operativa","Improdutiva","Produtivo","Improdutivo",null,"Horário Total"]
[null,"E9559","Aquecedor de fluido térmico - 12 kW",1,1,0,70.491399999999999,40.1297,null,{"$f":"D454*(E454*G454+F454*H454)","v":70.491399999999999}]
[null,"E9584","Carregadeira de pneus com capacidade de 1,72 m³ - 113 kW",1,0.86,0.14000000000000001,207.59360000000001,103.7398,null,{"$f":"D455*(E455*G455+F455*H455)","v":193.054068}]
[null,"E9021","Grupo gerador - 456 kVA",1,1,0,415.94510000000002,22.186399999999999,null,415.94510000000002]
[null,"E9558","Tanque de estocagem de asfalto com capacidade de 30.000 l",2,1,0,56.138500000000001,38.346699999999998,null,112.277]
[null,"E9689","Usina de asfalto a quente gravimétrica com capacidade de 100/140 t/h - 260 kW",1,1,0,1239.9634000000001,657.78120000000001,null,{"$f":"D458*(E458*G458+F458*H458)","v":1239.9634000000001}]
[{"$nulls":7},"Custo horário total de equipamentos",null,{"$f":"SUM(J454:J458)","v":2031.7309680000003}]
[null,"B - MÃO DE OBRA",null,"Quantidade","Unidade",null,"Custo Horário","Custo Horário Total"]
[null,"P9824","Servente",4,"h",null,21.3355,null,null,{"$f":"D461*G461","v":85.341999999999999}]
[null,null,null,"Custo horário total de mão de obra",{"$nulls":5},{"$f":"SUM(J461:J461)","v":85.341999999999999}]
[null,null,null,"Custo horário total de execução",{"$nulls":5},{"$f":"J459+J462","v":2117.0729680000004}]
[null,null,null,"Custo unitário de execução",{"$nulls":5},{"$f":"J463/I450","v":21.255752690763057}]
[{"$nulls":7},"Custo do FIC",null,4.2099999999999999E-2]
[{"$nulls":7},"Custo do FIT",null,0]
[null,"C - MATERIAL",null,"Quantidade","Unidade",null,"Preço Unitário","Custo Unitário"]
[null,"M0028","Areia média",2.7009999999999999E-2,"m³",null,158.15639999999999,null,null,{"$f":"D468*G468","v":4.2718043639999994}]
[null,"M0005","Brita 0",9.0029999999999999E-2,"m³",null,119,null,null,{"$f":"D469*G469","v":10.713570000000001}]
[null,"M0191","Brita 1",3.2149999999999998E-2,"m³",null,119,null,null,3.82585]
[null,"M0344","Cal hidratada - a granel",14.4636,"kg",null,0.61650000000000005,null,null,8.9168094]
[null,"M1943","Cimento asfáltico de petróleo - CAP 50/70",5.5449999999999999E-2,"t",null,0,"FORNECIMENTO COM BDI DIFERENCIADO",null,0]
[null,"M1941","Óleo tipo A1",8,"l",null,6.3849,null,null,51.0792]
[null,"M1103","Pedrisco",0.1479,"m³",null,176.94059999999999,null,null,{"$f":"D474*G474","v":26.16951474}]
[null,"M1135","Pó de pedra",0.33631,"m³",null,90,null,null,30.267900000000001]
[null,null,null,"Custo unitário total de material",{"$nulls":5},{"$f":"SUM(J468:J475)","v":135.244648504}]
[null,"D - ATIVIDADES AUXILIARES",null,"Quantidade","Unidade",null,"Custo Unitário","Custo Unitário"]
[null,"-",0,0,0,null,0,null,null,{"$f":"D478*G478","v":0}]
[null,null,null,"Custo total de atividades auxiliares",{"$nulls":5},{"$f":"SUM(J478:J478)","v":0}]
[{"$nulls":7},"Subtotal",null,{"$f":"J464+J476+J479+J465+J466","v":156.54250119476305}]
[null,"E - TEMPO FIXO",null,"Código","Quantidade","Unidade",null,"Custo Unitário","Custo Unitário"]
[null,"M0028","Areia média",5914647,4.052E-2,"t",null,1.83,null,{"$f":"ROUNDDOWN(E482*H482,4)","v":7.4099999999999999E-2}]
[null,"M0005","Brita 0",5914647,0.13505,"t",null,1.83,null,0.24709999999999999]
[null,"M0191","Brita 1",5914647,4.8230000000000002E-2,"t",null,1.83,null,8.8200000000000001E-2]
[null,"M0344","Cal hidratada - a granel",5914363,1.4460000000000001E-2,"t",null,17.61,null,0.25459999999999999]
[null,"M1103","Pedrisco",5914647,0.22184999999999999,"t",null,1.83,null,{"$f":"ROUNDDOWN(E486*H486,4)","v":0.40589999999999998}]
[null,"M1135","Pó de pedra",5914647,0.50446999999999997,"t",null,1.83,null,{"$f":"ROUNDDOWN(E487*H487,4)","v":0.92310000000000003}]
[null,null,null,"Custo unitário total de tempo fixo",{"$nulls":5},{"$f":"SUM(J482:J487)","v":1.9929999999999999}]
[null,"F - MOMENTO DE TRANSPORTE",null,"Quantidade","Unidade","DMT",null,null,null,"Custo Unitário"]
[{"$nulls":5},"LN","RP","P"]
[null,"M0028","Areia média",4.052E-2,"tkm"]
[null,"M0005","Brita 0",0.13505,"tkm"]
[null,"M0191","Brita 1",4.8230000000000002E-2,"tkm"]
[null,"M0344","Cal hidratada - a granel",1.4460000000000001E-2,"tkm"]
[null,"M1103","Pedrisco",0.22184999999999999,"tkm"]
[null,"M1135","Pó de pedra",0.50446999999999997,"tkm"]
[null,null,null,"Custo unitário total de transporte"]
[{"$nulls":5},"Custo unitário direto total",null,null,null,{"$f":"J480+J488","v":158.53550119476304}]
[null,"Obs."]
[]
[{"$f":"A408+1","v":15},"1ª/GRD",{"$nulls":8},{"$f":"J537","v":0.65}]
[null,"OBRA:"," PAVIMENTAÇÃO ASFÁLTICA EM CBUQ - VIAS URBANAS DIVERSAS - DISTRITO  DE CONCEIÇÃO DE TEIXEIRAS (AUGUSTO DE LIMA / MG)"]
[null,"Custo Unitário de Referência",null,null,"Minas Gerais"]
[{"$nulls":4}," Janeiro/2025 ",null,null,"Produção da equipe ",470.61,{"$f":"VLOOKUP(A501,ORÇAMENTO!$A$10:$L$42,7,1)","v":"TXKM"}]
[null,5915321,"TRANSPORTE COM CAMINHÃO BASCULANTE, EM RODOVIA PAVIMENTADA",{"$nulls":5},"Valores em reais (R$)"]
[null,"A - EQUIPAMENTOS",null,"Quantidade","Utilização",null,"Custo Horário",null,null,"Custo"]
[{"$nulls":4},"Operativa","Improdutiva","Produtivo","Improdutivo",null,"Horário Total"]
[null,"E9667","Caminhão basculante com capacidade de 14 m³ - 210 kW",1,1,0,309.83940000000001,90.412199999999999,null,{"$f":"D508*(E508*G508+F508*H508)","v":309.83940000000001}]
[null,"-",0,null,null,null,0,0,null,{"$f":"D509*(E509*G509+F509*H509)","v":0}]
[{"$nulls":7},"Custo horário total de equipamentos",null,{"$f":"SUM(J508:J509)","v":309.83940000000001}]
[null,"B - MÃO DE OBRA",null,"Quantidade","Unidade",null,"Custo Horário","Custo Horário Total"]
[null,"-",0,null,0,null,0,null,null,{"$f":"D512*G512","v":0}]
[null,"-",0,null,0,null,0,null,null,{"$f":"D513*G513","v":0}]
[null,null,null,"Custo horário total de mão de obra",{"$nulls":5},{"$f":"SUM(J512:J513)","v":0}]
[null,null,null,"Custo horário total de execução",{"$nulls":5},{"$f":"J510+J514","v":309.83940000000001}]
[null,null,null,"Custo unitário de execução",{"$nulls":5},{"$f":"J515/I504","v":0.65837827500478108}]
[{"$nulls":7},"Custo do FIC",null,0]
[{"$nulls":7},"Custo do FIT",null,0]
[null,"C - MATERIAL",null,"Quantidade","Unidade",null,"Preço Unitário","Custo Unitário"]
[null,"-",0,0,0,null,0,null,null,{"$f":"D520*G520","v":0}]
[null,"-",0,0,0,null,0,null,null,{"$f":"D521*G521","v":0}]
[null,null,null,"Custo unitário total de material",{"$nulls":5},{"$f":"SUM(J520:J521)","v":0}]
[null,"D - ATIVIDADES AUXILIARES",null,"Quantidade","Unidade",null,"Custo Unitário","Custo Unitário"]
[null,"-",0,0,0,null,0,null,null,{"$f":"D524*G524","v":0}]
[null,"-",0,0,0,null,0,null,null,{"$f":"D525*G525","v":0}]
[null,null,null,"Custo total de atividades auxiliares",{"$nulls":5},{"$f":"SUM(J524:J525)","v":0}]
[{"$nulls":7},"Subtotal",null,{"$f":"J516+J522+J526+J517+J518","v":0.65837827500478108}]
[null,"E - TEMPO FIXO",null,"Código","Quantidade","Unidade",null,"Custo Unitário","Custo Unitário"]
[null,"-",0,"-",0,"t",null,0,null,{"$f":"ROUNDDOWN(E529*H529,4)","v":0}]
[null,"-",0,"-",0,"t",null,0,null,{"$f":"ROUNDDOWN(E530*H530,4)","v":0}]
[null,null,null,"Custo unitário total de tempo fixo",{"$nulls":5},{"$f":"SUM(J529:J530)","v":0}]
[null,"F - MOMENTO DE TRANSPORTE",null,"Quantidade","Unidade","DMT",null,null,null,"Custo Unitário"]
[{"$nulls":5},"LN","RP","P"]
[null,"-",0,0,"tkm"]
[null,"-",0,0,"tkm"]
[null,null,null,"Custo unitário total de transporte"]
[{"$nulls":5},"Custo unitário direto total",null,null,null,{"$f":"TRUNC(J527+J531,2)","v":0.65}]
[null,"Obs."]
[]
[16,"1ª/GRD",{"$nulls":8},{"$f":"J576","v":0.72}]
[null,"OBRA:"," PAVIMENTAÇÃO ASFÁLTICA EM CBUQ - VIAS URBANAS DIVERSAS - DISTRITO  DE CONCEIÇÃO DE TEIXEIRAS (AUGUSTO DE LIMA / MG)"]
[null,"Custo Unitário de Referência",null,null,"Minas Gerais"]
[{"$nulls":4}," Janeiro/2025 ",null,null,"Produção da equipe ",435.75,{"$f":"VLOOKUP(A540,ORÇAMENTO!$A$10:$L$42,7,1)","v":"TXKM"}]
[null,5915320,"TRANSPORTE COM CAMINHÃO BASCULANTE, RODOVIA EM REVESTIMENTO PRIMÁRIO",{"$nulls":5},"Valores em reais (R$)"]
[null,"A - EQUIPAMENTOS",null,"Quantidade","Utilização",null,"Custo Horário",null,null,"Custo"]
[{"$nulls":4},"Operativa","Improdutiva","Produtivo","Improdutivo",null,"Horário Total"]
[null,"E9667","Caminhão basculante com capacidade de 14 m³ - 210 kW",1,1,0,309.83940000000001,90.412199999999999,null,{"$f":"D547*(E547*G547+F547*H547)","v":309.83940000000001}]
[null,"-",0,null,null,null,0,0,null,{"$f":"D548*(E548*G548+F548*H548)","v":0}]
[{"$nulls":7},"Custo horário total de equipamentos",null,{"$f":"SUM(J547:J548)","v":309.83940000000001}]
[null,"B - MÃO DE OBRA",null,"Quantidade","Unidade",null,"Custo Horário","Custo Horário Total"]
[null,"-",0,null,0,null,0,null,null,{"$f":"D551*G551","v":0}]
[null,"-",0,null,0,null,0,null,null,{"$f":"D552*G552","v":0}]
[null,null,null,"Custo horário total de mão de obra",{"$nulls":5},{"$f":"SUM(J551:J552)","v":0}]
[null,null,null,"Custo horário total de execução",{"$nulls":5},{"$f":"J549+J553","v":309.83940000000001}]
[null,null,null,"Custo unitário de execução",{"$nulls":5},{"$f":"J554/I543","v":0.71104853700516357}]
[{"$nulls":7},"Custo do FIC",null,1.4E-2]
[{"$nulls":7},"Custo do FIT",null,0]
[null,"C - MATERIAL",null,"Quantidade","Unidade",null,"Preço Unitário","Custo Unitário"]
[null,"-",0,0,0,null,0,null,null,{"$f":"D559*G559","v":0}]
[null,"-",0,0,0,null,0,null,null,{"$f":"D560*G560","v":0}]
[null,null,null,"Custo unitário total de material",{"$nulls":5},{"$f":"SUM(J559:J560)","v":0}]
[null,"D - ATIVIDADES AUXILIARES",null,"Quantidade","Unidade",null,"Custo Unitário","Custo Unitário"]
[null,"-",0,0,0,null,0,null,null,{"$f":"D563*G563","v":0}]
[null,"-",0,0,0,null,0,null,null,{"$f":"D564*G564","v":0}]
[null,null,null,"Custo total de atividades auxiliares",{"$nulls":5},{"$f":"SUM(J563:J564)","v":0}]
[{"$nulls":7},"Subtotal",null,{"$f":"J555+J561+J565+J556+J557","v":0.72504853700516358}]
[null,"E - TEMPO FIXO",null,"Código","Quantidade","Unidade",null,"Custo Unitário","Custo Unitário"]
[null,"-",0,"-",0,"t",null,0,null,{"$f":"ROUNDDOWN(E568*H568,4)","v":0}]
[null,"-",0,"-",0,"t",null,0,null,{"$f":"ROUNDDOWN(E569*H569,4)","v":0}]
[null,null,null,"Custo unitário total de tempo fixo",{"$nulls":5},{"$f":"SUM(J568:J569)","v":0}]
[null,"F - MOMENTO DE TRANSPORTE",null,"Quantidade","Unidade","DMT",null,null,null,"Custo Unitário"]
[{"$nulls":5},"LN","RP","P"]
[null,"-",0,0,"tkm"]
[null,"-",0,0,"tkm"]
[null,null,null,"Custo unitário total de transporte"]
[{"$nulls":5},"Custo unitário direto total",null,null,null,{"$f":"TRUNC(J566+J570,2)","v":0.72}]
[null,"Obs."]
[]
[{"$f":"A540+1","v":17},"1ª/GRD",{"$nulls":8},{"$f":"J615","v":0.74}]
[null,"OBRA:"," PAVIMENTAÇÃO ASFÁLTICA EM CBUQ - VIAS URBANAS DIVERSAS - DISTRITO  DE CONCEIÇÃO DE TEIXEIRAS (AUGUSTO DE LIMA / MG)"]
[null,"Custo Unitário de Referência",null,null,"Minas Gerais"]
[{"$nulls":4}," Janeiro/2025 ",null,null,"Produção da equipe ",241.03,{"$f":"VLOOKUP(A579,ORÇAMENTO!$A$10:$L$42,7,1)","v":"TXKM"}]
[null,5914434,"TRANSPORTE COM CAMINHÃO CARROCERIA 9T, EM VIA URBANA PREDOMINANTEMENTE PAVIMENTADA",{"$nulls":5},"Valores em reais (R$)"]
[null,"A - EQUIPAMENTOS",null,"Quantidade","Utilização",null,"Custo Horário",null,null,"Custo"]
[{"$nulls":4},"Operativa","Improdutiva","Produtivo","Improdutivo",null,"Horário Total"]
[null,"E9508","Caminhão carroceria com capacidade de 9 t - 136 kW",1,1,0,178.82759999999999,67.927099999999996,null,{"$f":"D586*(E586*G586+F586*H586)","v":178.82759999999999}]
[null,"-",0,null,null,null,0,0,null,{"$f":"D587*(E587*G587+F587*H587)","v":0}]
[{"$nulls":7},"Custo horário total de equipamentos",null,{"$f":"SUM(J586:J587)","v":178.82759999999999}]
[null,"B - MÃO DE OBRA",null,"Quantidade","Unidade",null,"Custo Horário","Custo Horário Total"]
[null,"-",0,0,0,null,0,null,null,{"$f":"D590*G590","v":0}]
[null,"-",0,0,0,null,0,null,null,{"$f":"D591*G591","v":0}]
[null,null,null,"Custo horário total de mão de obra",{"$nulls":5},{"$f":"SUM(J590:J591)","v":0}]
[null,null,null,"Custo horário total de execução",{"$nulls":5},{"$f":"J588+J592","v":178.82759999999999}]
[null,null,null,"Custo unitário de execução",{"$nulls":5},{"$f":"J593/I582","v":0.7419308799734472}]
[{"$nulls":7},"Custo do FIC",null,0]
[{"$nulls":7},"Custo do FIT",null,0]
[null,"C - MATERIAL",null,"Quantidade","Unidade",null,"Preço Unitário","Custo Unitário"]
[null,"-",0,0,0,null,0,null,null,{"$f":"D598*G598","v":0}]
[null,"-",0,0,0,null,0,null,null,{"$f":"D599*G599","v":0}]
[null,null,null,"Custo unitário total de material",{"$nulls":5},{"$f":"SUM(J598:J599)","v":0}]
[null,"D - ATIVIDADES AUXILIARES",null,"Quantidade","Unidade",null,"Custo Unitário","Custo Unitário"]
[null,"-",0,0,0,null,0,null,null,{"$f":"D602*G602","v":0}]
[null,"-",0,0,0,null,0,null,null,{"$f":"D603*G603","v":0}]
[null,null,null,"Custo total de atividades auxiliares",{"$nulls":5},{"$f":"SUM(J602:J603)","v":0}]
[{"$nulls":7},"Subtotal",null,{"$f":"J594+J600+J604+J595+J596","v":0.7419308799734472}]
[null,"E - TEMPO FIXO",null,"Código","Quantidade","Unidade",null,"Custo Unitário","Custo Unitário"]
[null,"-",0,"-",0,"t",null,0,null,{"$f":"ROUNDDOWN(E607*H607,4)","v":0}]
[null,"-",0,"-",0,"t",null,0,null,{"$f":"ROUNDDOWN(E608*H608,4)","v":0}]
[null,null,null,"Custo unitário total de tempo fixo",{"$nulls":5},{"$f":"SUM(J607:J608)","v":0}]
[null,"F - MOMENTO DE TRANSPORTE",null,"Quantidade","Unidade","DMT",null,null,null,"Custo Unitário"]
[{"$nulls":5},"LN","RP","P"]
[null,"-",0,0,"tkm"]
[null,"-",0,0,"tkm"]
[null,null,null,"Custo unitário total de transporte"]
[{"$nulls":5},"Custo unitário direto total",null,null,null,{"$f":"TRUNC(J605+J609,2)","v":0.74}]
[null,"Obs."]
[]
[{"$f":"A579+1","v":18},"1ª/GRD",{"$nulls":8},{"$f":"J654","v":1.1499999999999999}]
[null,"OBRA:"," PAVIMENTAÇÃO ASFÁLTICA EM CBUQ - VIAS URBANAS DIVERSAS - DISTRITO  DE CONCEIÇÃO DE TEIXEIRAS (AUGUSTO DE LIMA / MG)"]
[null,"Custo Unitário de Referência",null,null,"Minas Gerais"]
[{"$nulls":4}," Janeiro/2025 ",null,null,"Produção da equipe ",229.1,{"$f":"VLOOKUP(A618,ORÇAMENTO!$A$10:$L$42,7,1)","v":"TXKM"}]
[null,5914612,"TRANSPORTE DE MISTURA BETUMINOSA A QUENTE COM CAMINHÃO CAÇAMBA TÉRMICA",{"$nulls":5},"Valores em reais (R$)"]
[null,"A - EQUIPAMENTOS",null,"Quantidade","Utilização",null,"Custo Horário",null,null,"Custo"]
[{"$nulls":4},"Operativa","Improdutiva","Produtivo","Improdutivo",null,"Horário Total"]
[null,"E9520","Caminhão com caçamba térmica com capacidade de 6 m³ - 188 kW",1,1,0,265.74349999999998,76.6511,null,{"$f":"D625*(E625*G625+F625*H625)","v":265.74349999999998}]
[null,"-",0,null,null,null,0,0,null,{"$f":"D626*(E626*G626+F626*H626)","v":0}]
[{"$nulls":7},"Custo horário total de equipamentos",null,{"$f":"SUM(J625:J626)","v":265.74349999999998}]
[null,"B - MÃO DE OBRA",null,"Quantidade","Unidade",null,"Custo Horário","Custo Horário Total"]
[null,"-",0,0,0,null,0,null,null,{"$f":"D629*G629","v":0}]
[null,"-",0,0,0,null,0,null,null,{"$f":"D630*G630","v":0}]
[null,null,null,"Custo horário total de mão de obra",{"$nulls":5},{"$f":"SUM(J629:J630)","v":0}]
[null,null,null,"Custo horário total de execução",{"$nulls":5},{"$f":"J627+J631","v":265.74349999999998}]
[null,null,null,"Custo unitário de execução",{"$nulls":5},{"$f":"J632/I621","v":1.1599454386730685}]
[{"$nulls":7},"Custo do FIC",null,0]
[{"$nulls":7},"Custo do FIT",null,0]
[null,"C - MATERIAL",null,"Quantidade","Unidade",null,"Preço Unitário","Custo Unitário"]
[null,"-",0,0,0,null,0,null,null,{"$f":"D637*G637","v":0}]
[null,"-",0,0,0,null,0,null,null,{"$f":"D638*G638","v":0}]
[null,null,null,"Custo unitário total de material",{"$nulls":5},{"$f":"SUM(J637:J638)","v":0}]
[null,"D - ATIVIDADES AUXILIARES",null,"Quantidade","Unidade",null,"Custo Unitário","Custo Unitário"]
[null,"-",0,0,0,null,0,null,null,{"$f":"D641*G641","v":0}]
[null,"-",0,0,0,null,0,null,null,{"$f":"D642*G642","v":0}]
[null,null,null,"Custo total de atividades auxiliares",{"$nulls":5},{"$f":"SUM(J641:J642)","v":0}]
[{"$nulls":7},"Subtotal",null,{"$f":"J633+J639+J643+J634+J635","v":1.1599454386730685}]
[null,"E - TEMPO FIXO",null,"Código","Quantidade","Unidade",null,"Custo Unitário","Custo Unitário"]
[null,"-",0,"-",0,"t",null,0,null,{"$f":"ROUNDDOWN(E646*H646,4)","v":0}]
[null,"-",0,"-",0,"t",null,0,null,{"$f":"ROUNDDOWN(E647*H647,4)","v":0}]
[null,null,null,"Custo unitário total de tempo fixo",{"$nulls":5},{"$f":"SUM(J646:J647)","v":0}]
[null,"F - MOMENTO DE TRANSPORTE",null,"Quantidade","Unidade","DMT",null,null,null,"Custo Unitário"]
[{"$nulls":5},"LN","RP","P"]
[null,"-",0,0,"tkm"]
[null,"-",0,0,"tkm"]
[null,null,null,"Custo unitário total de transporte"]
[{"$nulls":5},"Custo unitário direto total",null,null,null,{"$f":"TRUNC(J644+J648,2)","v":1.1499999999999999}]
[null,"Obs."]
[]
[{"$f":"A618+1","v":19},"1ª/GRD",{"$nulls":8},{"$f":"J693","v":1.74}]
[null,"OBRA:"," PAVIMENTAÇÃO ASFÁLTICA EM CBUQ - VIAS URBANAS DIVERSAS - DISTRITO  DE CONCEIÇÃO DE TEIXEIRAS (AUGUSTO DE LIMA / MG)"]
[null,"Custo Unitário de Referência",null,null,"Minas Gerais"]
[{"$nulls":4}," Janeiro/2025 ",null,null,"Produção da equipe ",149.4,{"$f":"VLOOKUP(A657,ORÇAMENTO!$A$10:$L$42,7,1)","v":"TXKM"}]
[null,5914622,"TRANSPORTE COM CAMINHÃO TANQUE DE TRANSPORTE DE MATERIAL ASFÁLTICO DE 30000 L, EM VIA URBANA PREDOMINANTEMENTE PAVIMENTADA",{"$nulls":5},"Valores em reais (R$)"]
[null,"A - EQUIPAMENTOS",null,"Quantidade","Utilização",null,"Custo Horário",null,null,"Custo"]
[{"$nulls":4},"Operativa","Improdutiva","Produtivo","Improdutivo",null,"Horário Total"]
[null,"E9509","Caminhão tanque distribuidor de asfalto com capacidade de 6.000 l - 7 kW/136 kW",1,1,0,261.03050000000002,72.388300000000001,null,{"$f":"D664*(E664*G664+F664*H664)","v":261.03050000000002}]
[null,"-",0,null,null,null,0,0,null,{"$f":"D665*(E665*G665+F665*H665)","v":0}]
[{"$nulls":7},"Custo horário total de equipamentos",null,{"$f":"SUM(J664:J665)","v":261.03050000000002}]
[null,"B - MÃO DE OBRA",null,"Quantidade","Unidade",null,"Custo Horário","Custo Horário Total"]
[null,"-",0,0,0,null,0,null,null,{"$f":"D668*G668","v":0}]
[null,"-",0,0,0,null,0,null,null,{"$f":"D669*G669","v":0}]
[null,null,null,"Custo horário total de mão de obra",{"$nulls":5},{"$f":"SUM(J668:J669)","v":0}]
[null,null,null,"Custo horário total de execução",{"$nulls":5},{"$f":"J666+J670","v":261.03050000000002}]
[null,null,null,"Custo unitário de execução",{"$nulls":5},{"$f":"J671/I660","v":1.7471921017402945}]
[{"$nulls":7},"Custo do FIC",null,0]
[{"$nulls":7},"Custo do FIT",null,0]
[null,"C - MATERIAL",null,"Quantidade","Unidade",null,"Preço Unitário","Custo Unitário"]
[null,"-",0,996,0,null,0,null,null,{"$f":"D676*G676","v":0}]
[null,"-",0,89.28,0,null,0,null,null,{"$f":"D677*G677","v":0}]
[null,null,null,"Custo unitário total de material",{"$nulls":5},{"$f":"SUM(J676:J677)","v":0}]
[null,"D - ATIVIDADES AUXILIARES",null,"Quantidade","Unidade",null,"Custo Unitário","Custo Unitário"]
[null,"-",0,0,0,null,0,null,null,{"$f":"D680*G680","v":0}]
[null,"-",0,0,0,null,0,null,null,{"$f":"D681*G681","v":0}]
[null,null,null,"Custo total de atividades auxiliares",{"$nulls":5},{"$f":"SUM(J680:J681)","v":0}]
[{"$nulls":7},"Subtotal",null,{"$f":"J672+J678+J682+J673+J674","v":1.7471921017402945}]
[null,"E - TEMPO FIXO",null,"Código","Quantidade","Unidade",null,"Custo Unitário","Custo Unitário"]
[null,"-",0,"-",0,"t",null,0,null,{"$f":"ROUNDDOWN(E685*H685,4)","v":0}]
[null,"-",0,"-",0,"t",null,0,null,{"$f":"ROUNDDOWN(E686*H686,4)","v":0}]
[null,null,null,"Custo unitário total de tempo fixo",{"$nulls":5},{"$f":"SUM(J685:J686)","v":0}]
[null,"F - MOMENTO DE TRANSPORTE",null,"Quantidade","Unidade","DMT",null,null,null,"Custo Unitário"]
[{"$nulls":5},"LN","RP","P"]
[null,"-",0,0,"tkm"]
[null,"-",0,0,"tkm"]
[null,null,null,"Custo unitário total de transporte"]
[{"$nulls":5},"Custo unitário direto total",null,null,null,{"$f":"TRUNC(J683+J687,2)","v":1.74}]
[null,"Obs."]
[]
[{"$f":"A657+1","v":20},"1ª/GRD",{"$nulls":8},{"$f":"J732","v":53.22}]
[null,"OBRA:"," PAVIMENTAÇÃO ASFÁLTICA EM CBUQ - VIAS URBANAS DIVERSAS - DISTRITO  DE CONCEIÇÃO DE TEIXEIRAS (AUGUSTO DE LIMA / MG)"]
[null,"Custo Unitário de Referência",null,null,"Minas Gerais"]
[{"$nulls":4}," Janeiro/2025 ",null,null,"Produção da equipe ",1,{"$f":"VLOOKUP(A696,ORÇAMENTO!$A$10:$L$42,7,1)","v":"M"}]
[null,94273,"ASSENTAMENTO DE GUIA (MEIO-FIO) PRÉ-MOLDADO DE CONCRETO - 100X15X13X30 CM (COMPRIMENTO X BASE INFERIOR X BASE SUPERIOR X ALTURA) - USO VIÁRIO",{"$nulls":5},"Valores em reais (R$)"]
[null,"A - EQUIPAMENTOS",null,"Quantidade","Utilização",null,"Custo Horário",null,null,"Custo"]
[{"$nulls":4},"Operativa","Improdutiva","Produtivo","Improdutivo",null,"Horário Total"]
[null,"-",0,null,null,null,0,0,null,{"$f":"D703*(E703*G703+F703*H703)","v":0}]
[null,"-",0,null,null,null,0,0,null,{"$f":"D704*(E704*G704+F704*H704)","v":0}]
[{"$nulls":7},"Custo horário total de equipamentos",null,{"$f":"SUM(J703:J704)","v":0}]
[null,"B - MÃO DE OBRA",null,"Quantidade","Unidade",null,"Custo Horário","Custo Horário Total"]
[null,"P9824","Servente",0.2296,"h",null,21.3355,null,null,{"$f":"D707*G707","v":4.8986308000000003}]
[null,"P9821","Pedreiro",0.2296,"h",null,26.6785,null,null,{"$f":"D708*G708","v":6.1253836000000002}]
[null,null,null,"Custo horário total de mão de obra",{"$nulls":5},{"$f":"SUM(J707:J708)","v":11.0240144}]
[null,null,null,"Custo horário total de execução",{"$nulls":5},{"$f":"J705+J709","v":11.0240144}]
[null,null,null,"Custo unitário de execução",{"$nulls":5},{"$f":"J710/I699","v":11.0240144}]
[{"$nulls":7},"Custo do FIC",null,0]
[{"$nulls":7},"Custo do FIT",null,0]
[null,"C - MATERIAL",null,"Quantidade","Unidade",null,"Preço Unitário","Custo Unitário"]
[null,"M0082","Areia média lavada",6.6E-3,"m³",null,164.1893,null,null,{"$f":"D715*G715","v":1.08364938}]
[null,4059,"Meio-fio ou guia de concreto, pré-moldado, comp.1,0m x 30 x 12/15 cm (H X L1/L2)",1.0049999999999999,"m",null,40,null,null,40.199999999999996]
[null,null,null,"Custo unitário total de material",{"$nulls":5},{"$f":"SUM(J715:J716)","v":41.283649379999993}]
[null,"D - ATIVIDADES AUXILIARES",null,"Quantidade","Unidade",null,"Custo Unitário","Custo Unitário"]
[null,1109669,"Argamassa de cimento e areia 1:3 - confecção em betoneira e lançamento manual - areia comercial",1.8E-3,"m³",null,507.26,null,null,{"$f":"D719*G719","v":0.91306799999999999}]
[null,"-",0,0,0,null,0,null,null,{"$f":"D720*G720","v":0}]
[null,null,null,"Custo total de atividades auxiliares",{"$nulls":5},{"$f":"SUM(J719:J720)","v":0.91306799999999999}]
[{"$nulls":7},"Subtotal",null,{"$f":"J711+J717+J721+J712+J713","v":53.220731779999994}]
[null,"E - TEMPO FIXO",null,"Código","Quantidade","Unidade",null,"Custo Unitário","Custo Unitário"]
[null,"-",0,"-",0,"t",null,0,null,{"$f":"ROUNDDOWN(E724*H724,4)","v":0}]
[null,"-",0,"-",0,"t",null,0,null,{"$f":"ROUNDDOWN(E725*H725,4)","v":0}]
[null,null,null,"Custo unitário total de tempo fixo",{"$nulls":5},{"$f":"SUM(J724:J725)","v":0}]
[null,"F - MOMENTO DE TRANSPORTE",null,"Quantidade","Unidade","DMT",null,null,null,"Custo Unitário"]
[{"$nulls":5},"LN","RP","P"]
[null,"-",0,0,"tkm","5914449","5914464","5914479"]
[null,"-",0,0,"tkm","5914449","5914464","5914479"]
[null,null,null,"Custo unitário total de transporte"]
[{"$nulls":5},"Custo unitário direto total",null,null,null,{"$f":"TRUNC(J722+J726,2)","v":53.22}]
[null,"Obs."]
[]
[23,"1ª/GRD",{"$nulls":8},{"$f":"J773","v":31.55}]
[null,"OBRA:"," PAVIMENTAÇÃO ASFÁLTICA EM CBUQ - VIAS URBANAS DIVERSAS - DISTRITO  DE CONCEIÇÃO DE TEIXEIRAS (AUGUSTO DE LIMA / MG)"]
[null,"Custo Unitário de Referência",null,null,"Minas Gerais"]
[{"$nulls":4}," Janeiro/2025 ",null,null,"Produção da equipe ",1,{"$f":"VLOOKUP(A735,ORÇAMENTO!$A$10:$L$42,7,1)","v":"M"}]
[null,"94287a","EXECUÇÃO DE SARJETA EM CONCRETO USINADO, MOLDADO IN LOCO - 30CM DE BASE X 5CM DE ALTURA",{"$nulls":5},"Valores em reais (R$)"]
[null,"A - EQUIPAMENTOS",null,"Quantidade","Utilização",null,"Custo Horário",null,null,"Custo"]
[{"$nulls":4},"Operativa","Improdutiva","Produtivo","Improdutivo",null,"Horário Total"]
[null,"-",0,null,null,null,0,0,null,{"$f":"D742*(E742*G742+F742*H742)","v":0}]
[null,"-",0,null,null,null,0,0,null,{"$f":"D743*(E743*G743+F743*H743)","v":0}]
[{"$nulls":7},"Custo horário total de equipamentos",null,{"$f":"SUM(J742:J743)","v":0}]
[null,"B - MÃO DE OBRA",null,"Quantidade","Unidade",null,"Custo Horário","Custo Horário Total"]
[null,"P9821","Pedreiro",0.36499999999999999,"h",null,26.6785,null,null,{"$f":"D746*G746","v":9.7376524999999994}]
[null,"P9824","Servente",0.36499999999999999,"h",null,21.3355,null,null,{"$f":"D747*G747","v":7.7874574999999995}]
[null,null,null,"Custo horário total de mão de obra",{"$nulls":5},{"$f":"SUM(J746:J747)","v":17.525109999999998}]
[null,null,null,"Custo horário total de execução",{"$nulls":5},{"$f":"J744+J748","v":17.525109999999998}]
[null,null,null,"Custo unitário de execução",{"$nulls":5},{"$f":"J749/I738","v":17.525109999999998}]
[{"$nulls":7},"Custo do FIC",null,0]
[{"$nulls":7},"Custo do FIT",null,0]
[null,"C - MATERIAL",null,"Quantidade","Unidade",null,"Preço Unitário","Custo Unitário"]
[null,"M0082","Areia média lavada",9.9000000000000008E-3,"m³",null,164.1893,null,null,{"$f":"D754*G754","v":1.6254740700000001}]
[null,"M0286","Tábua - E = 2,5 cm e L = 30 cm",8.3299999999999999E-2,"m",null,15.537800000000001,null,null,{"$f":"D755*G755","v":1.2942987400000001}]
[null,"M0451","Concreto usinado - fck = 20 MPa (comercial)",1.8800000000000001E-2,"m³",null,570,null,null,10.716000000000001]
[null,"M1358","Sarrafo em madeira de terceira - E = 2,5 cm e L = 5 cm",0.2,"m",null,1.9665999999999999,null,null,0.39332]
[null,null,null,"Custo unitário total de material",{"$nulls":5},{"$f":"SUM(J754:J757)","v":14.029092810000002}]
[null,"D - ATIVIDADES AUXILIARES",null,"Quantidade","Unidade",null,"Custo Unitário","Custo Unitário"]
[null,"-",0,null,0,null,0,null,null,{"$f":"D760*G760","v":0}]
[null,"-",0,null,0,null,0,null,null,{"$f":"D761*G761","v":0}]
[null,null,null,"Custo total de atividades auxiliares",{"$nulls":5},{"$f":"SUM(J760:J761)","v":0}]
[{"$nulls":7},"Subtotal",null,{"$f":"J750+J758+J762+J751+J752","v":31.55420281}]
[null,"E - TEMPO FIXO",null,"Código","Quantidade","Unidade",null,"Custo Unitário","Custo Unitário"]
[null,"-",0,"-",0,"t",null,0,null,{"$f":"ROUNDDOWN(E765*H765,4)","v":0}]
[null,"-",0,"-",0,"t",null,0,null,{"$f":"ROUNDDOWN(E766*H766,4)","v":0}]
[null,null,null,"Custo unitário total de tempo fixo",{"$nulls":5},{"$f":"SUM(J765:J766)","v":0}]
[null,"F - MOMENTO DE TRANSPORTE",null,"Quantidade","Unidade","DMT",null,null,null,"Custo Unitário"]
[{"$nulls":5},"LN","RP","P"]
[null,"-",0,0,"tkm"]
[null,"-",0,0,"tkm"]
[null,null,null,"Custo unitário total de transporte"]
[{"$nulls":5},"Custo unitário direto total",null,null,null,{"$f":"TRUNC(J763+J767,2)","v":31.55}]
[null,"Obs."]
[]
[46,"1ª/GRD",{"$nulls":8},{"$f":"J812","v":259.45999999999998}]
[null,"OBRA:"," PAVIMENTAÇÃO ASFÁLTICA EM CBUQ - VIAS URBANAS DIVERSAS - DISTRITO  DE CONCEIÇÃO DE TEIXEIRAS (AUGUSTO DE LIMA / MG)"]
[null,"Custo Unitário de Referência",null,null,"Minas Gerais"]
[{"$nulls":4}," Janeiro/2025 ",null,null,"Produção da equipe ",3,{"$f":"VLOOKUP(A776,ORÇAMENTO!$A$10:$L$42,7,1)","v":"UN."}]
[null,5213440,"PLACA DE REGULAMENTAÇÃO EM AÇO, D=60CM - PELÍCULA RETRORREFLETIVA - FORNECIMENTO E INSTALAÇÃO, INCLUSIVE  SUPORTE",{"$nulls":5},"Valores em reais (R$)"]
[null,"A - EQUIPAMENTOS",null,"Quantidade","Utilização",null,"Custo Horário",null,null,"Custo"]
[{"$nulls":4},"Operativa","Improdutiva","Produtivo","Improdutivo",null,"Horário Total"]
[null,"E9687","Caminhão carroceria com capacidade de 5 t - 115 kW",1,0.3,0.7,146.88079999999999,57.423099999999998,null,{"$f":"D783*(E783*G783+F783*H783)","v":84.260409999999993}]
[null,"-",0,null,null,null,0,0,null,{"$f":"D784*(E784*G784+F784*H784)","v":0}]
[{"$nulls":7},"Custo horário total de equipamentos",null,{"$f":"SUM(J783:J784)","v":84.260409999999993}]
[null,"B - MÃO DE OBRA",null,"Quantidade","Unidade",null,"Custo Horário","Custo Horário Total"]
[null,"P9830","Montador",1,"h",null,36.409500000000001,null,null,{"$f":"D787*G787","v":36.409500000000001}]
[null,"P9824","Servente",2,"h",null,21.3355,null,null,{"$f":"D788*G788","v":42.670999999999999}]
[null,null,null,"Custo horário total de mão de obra",{"$nulls":5},{"$f":"SUM(J787:J788)","v":79.080500000000001}]
[null,null,null,"Custo horário total de execução",{"$nulls":5},{"$f":"J785+J789","v":163.34091000000001}]
[null,null,null,"Custo unitário de execução",{"$nulls":5},{"$f":"J790/I779","v":54.44697}]
[{"$nulls":7},"Custo do FIC",null,0]
[{"$nulls":7},"Custo do FIT",null,0]
[null,"C - MATERIAL",null,"Quantidade","Unidade",null,"Preço Unitário","Custo Unitário"]
[null,"-",0,null,0,null,0,null,null,{"$f":"D795*G795","v":0}]
[null,"-",0,null,0,null,0,null,null,{"$f":"D796*G796","v":0}]
[null,null,null,"Custo unitário total de material",{"$nulls":5},{"$f":"SUM(J795:J796)","v":0}]
[null,"D - ATIVIDADES AUXILIARES",null,"Quantidade","Unidade",null,"Custo Unitário","Custo Unitário"]
[null,5213414,"Placa em aço nº 16 galvanizado com película retrorrefletiva tipo I + SI - confecção",0.35993999999999998,"m²",null,569.58000000000004,null,null,{"$f":"D799*G799","v":205.01462520000001}]
[null,"-",0,null,0,null,0,null,null,{"$f":"D800*G800","v":0}]
[null,null,null,"Custo total de atividades auxiliares",{"$nulls":5},{"$f":"SUM(J799:J800)","v":205.01462520000001}]
[{"$nulls":7},"Subtotal",null,{"$f":"J791+J797+J801+J792+J793","v":259.46159520000003}]
[null,"E - TEMPO FIXO",null,"Código","Quantidade","Unidade",null,"Custo Unitário","Custo Unitário"]
[null,"-",0,"-",null,"t",null,0,null,{"$f":"ROUNDDOWN(E804*H804,4)","v":0}]
[null,"-",0,"-",null,"t",null,0,null,{"$f":"ROUNDDOWN(E805*H805,4)","v":0}]
[null,null,null,"Custo unitário total de tempo fixo",{"$nulls":5},{"$f":"SUM(J804:J805)","v":0}]
[null,"F - MOMENTO DE TRANSPORTE",null,"Quantidade","Unidade","DMT",null,null,null,"Custo Unitário"]
[{"$nulls":5},"LN","RP","P"]
[null,"-",0,null,"tkm"]
[null,"-",0,null,"tkm"]
[null,null,null,"Custo unitário total de transporte"]
[{"$nulls":5},"Custo unitário direto total",null,null,null,{"$f":"TRUNC(J802+J806,2)","v":259.45999999999998}]
[null,"Obs."]
[]
[49,"1ª/GRD",{"$nulls":8},{"$f":"J858","v":29.17}]
[null,"OBRA:"," PAVIMENTAÇÃO ASFÁLTICA EM CBUQ - VIAS URBANAS DIVERSAS - DISTRITO  DE CONCEIÇÃO DE TEIXEIRAS (AUGUSTO DE LIMA / MG)"]
[null,"Custo Unitário de Referência",null,null,"Minas Gerais"]
[{"$nulls":4}," Janeiro/2025 ",null,null,"Produção da equipe ",149.4,{"$f":"VLOOKUP(A815,ORÇAMENTO!$A$10:$L$42,7,1)","v":"M2"}]
[null,5213401,"PINTURA DE EIXO VIÁRIO SOBRE ASFALTO COM TINTA RETRORREFLETIVA A BASE DE RESINA ACRÍLICA COM MICROESFERAS DE VIDRO, APLICAÇÃO MECÂNICA COM DEMARCADORA AUTOPROPELIDA",{"$nulls":5},"Valores em reais (R$)"]
[null,"A - EQUIPAMENTOS",null,"Quantidade","Utilização",null,"Custo Horário",null,null,"Custo"]
[{"$nulls":4},"Operativa","Improdutiva","Produtivo","Improdutivo",null,"Horário Total"]
[null,"E9644","Caminhão demarcador de faixas com sistema de pintura a frio - 28 kW/115 kW",1,1,0,374.84390000000002,155.3843,null,{"$f":"D822*(E822*G822+F822*H822)","v":374.84390000000002}]
[null,"-",0,null,null,null,0,0,null,{"$f":"D823*(E823*G823+F823*H823)","v":0}]
[{"$nulls":7},"Custo horário total de equipamentos",null,{"$f":"SUM(J822:J823)","v":374.84390000000002}]
[null,"B - MÃO DE OBRA",null,"Quantidade","Unidade",null,"Custo Horário","Custo Horário Total"]
[null,"P9853","Pré-marcador",1,"h",null,22.8993,null,null,{"$f":"D826*G826","v":22.8993}]
[null,"P9824","Servente",4,"h",null,21.3355,null,null,{"$f":"D827*G827","v":85.341999999999999}]
[null,null,null,"Custo horário total de mão de obra",{"$nulls":5},{"$f":"SUM(J826:J827)","v":108.2413}]
[null,null,null,"Custo horário total de execução",{"$nulls":5},{"$f":"J824+J828","v":483.08519999999999}]
[null,null,null,"Custo unitário de execução",{"$nulls":5},{"$f":"J829/I818","v":3.2335020080321284}]
[{"$nulls":7},"Custo do FIC",null,0]
[{"$nulls":7},"Custo do FIT",null,0]
[null,"C - MATERIAL",null,"Quantidade","Unidade",null,"Preço Unitário","Custo Unitário"]
[null,"M2037","Microesferas refletivas de vidro tipo I-B",0.12,"kg",null,8.7245000000000008,null,null,{"$f":"D834*G834","v":1.04694}]
[null,"M2038","Microesferas refletivas de vidro tipo II-A",0.35,"kg",null,8.9086999999999996,null,null,{"$f":"D835*G835","v":3.1180449999999995}]
[null,"M2034","Solvente para tinta à base de resina acrílica",0.03,"l",null,16.8491,null,null,0.50547299999999995]
[null,"M2044","Tinta à base de resina acrílica emulsionada em água para pré-marcação viária",9.7000000000000005E-4,"l",null,21.025400000000001,null,null,2.0394638000000003E-2]
[null,"M2027","Tinta à base de resina acrílica estirenada para demarcação viária",0.6,"l",null,35.350499999999997,null,null,21.210299999999997]
[null,null,null,"Custo unitário total de material",{"$nulls":5},{"$f":"SUM(J834:J838)","v":25.901152637999996}]
[null,"D - ATIVIDADES AUXILIARES",null,"Quantidade","Unidade",null,"Custo Unitário","Custo Unitário"]
[null,"-",0,null,0,null,0,null,null,{"$f":"D841*G841","v":0}]
[null,"-",0,null,0,null,0,null,null,{"$f":"D842*G842","v":0}]
[null,null,null,"Custo total de atividades auxiliares",{"$nulls":5},{"$f":"SUM(J841:J842)","v":0}]
[{"$nulls":7},"Subtotal",null,{"$f":"J830+J839+J843+J831+J832","v":29.134654646032125}]
[null,"E - TEMPO FIXO",null,"Código","Quantidade","Unidade",null,"Custo Unitário","Custo Unitário"]
[null,"M2037","Microesferas refletivas de vidro tipo I-B",5914655,1.2E-4,"t",null,32.520000000000003,null,{"$f":"ROUNDDOWN(E846*H846,4)","v":3.8999999999999998E-3}]
[null,"M2038","Microesferas refletivas de vidro tipo II-A",5914655,3.5E-4,"t",null,32.520000000000003,null,{"$f":"ROUNDDOWN(E847*H847,4)","v":1.1299999999999999E-2}]
[null,"M2034","Solvente para tinta à base de resina acrílica",5914655,3.0000000000000001E-5,"t",null,32.520000000000003,null,8.9999999999999998E-4]
[null,"M2027","Tinta à base de resina acrílica estirenada para demarcação viária",5914655,8.3000000000000001E-4,"t",null,32.520000000000003,null,2.69E-2]
[null,null,null,"Custo unitário total de tempo fixo",{"$nulls":5},{"$f":"SUM(J846:J849)","v":4.2999999999999997E-2}]
[null,"F - MOMENTO DE TRANSPORTE",null,"Quantidade","Unidade","DMT",null,null,null,"Custo Unitário"]
[{"$nulls":5},"LN","RP","P"]
[null,"M2037","Microesferas refletivas de vidro tipo I-B",1.2E-4,"tkm"]
[null,"M2038","Microesferas refletivas de vidro tipo II-A",3.5E-4,"tkm"]
[null,"M2034","Solvente para tinta à base de resina acrílica",3.0000000000000001E-5,"tkm"]
[null,"M2027","Tinta à base de resina acrílica estirenada para demarcação viária",8.3000000000000001E-4,"tkm"]
[null,null,null,"Custo unitário total de transporte"]
[{"$nulls":5},"Custo unitário direto total",null,null,null,{"$f":"TRUNC(J844+J850,2)","v":29.17}]
[null,"Obs."]
[]
[51,"1ª/GRD",{"$nulls":8},{"$f":"J904","v":41.95}]
[null,"OBRA:"," PAVIMENTAÇÃO ASFÁLTICA EM CBUQ - VIAS URBANAS DIVERSAS - DISTRITO  DE CONCEIÇÃO DE TEIXEIRAS (AUGUSTO DE LIMA / MG)"]
[null,"Custo Unitário de Referência",null,null,"Minas Gerais"]
[{"$nulls":4}," Janeiro/2025 ",null,null,"Produção da equipe ",30.18,{"$f":"VLOOKUP(A861,ORÇAMENTO!$A$10:$L$42,7,1)","v":"M2"}]
[null,5213405,"PINTURA DE FAIXA DE PEDESTRE OU ZEBRADA TINTA RETRORREFLETIVA A BASE DE RESINA ACRÍLICA COM MICROESFERAS DE VIDRO, APLICAÇÃO MANUAL",{"$nulls":5},"Valores em reais (R$)"]
[null,"A - EQUIPAMENTOS",null,"Quantidade","Utilização",null,"Custo Horário",null,null,"Custo"]
[{"$nulls":4},"Operativa","Improdutiva","Produtivo","Improdutivo",null,"Horário Total"]
[null,"E9644","Caminhão demarcador de faixas com sistema de pintura a frio - 28 kW/115 kW",1,1,0,374.84390000000002,155.3843,null,{"$f":"D868*(E868*G868+F868*H868)","v":374.84390000000002}]
[null,"-",0,null,null,null,0,0,null,{"$f":"D869*(E869*G869+F869*H869)","v":0}]
[{"$nulls":7},"Custo horário total de equipamentos",null,{"$f":"SUM(J868:J869)","v":374.84390000000002}]
[null,"B - MÃO DE OBRA",null,"Quantidade","Unidade",null,"Custo Horário","Custo Horário Total"]
[null,"P9853","Pré-marcador",1,"h",null,22.8993,null,null,{"$f":"D872*G872","v":22.8993}]
[null,"P9824","Servente",4,"h",null,21.3355,null,null,{"$f":"D873*G873","v":85.341999999999999}]
[null,null,null,"Custo horário total de mão de obra",{"$nulls":5},{"$f":"SUM(J872:J873)","v":108.2413}]
[null,null,null,"Custo horário total de execução",{"$nulls":5},{"$f":"J870+J874","v":483.08519999999999}]
[null,null,null,"Custo unitário de execução",{"$nulls":5},{"$f":"J875/I864","v":16.006799204771372}]
[{"$nulls":7},"Custo do FIC",null,0]
[{"$nulls":7},"Custo do FIT",null,0]
[null,"C - MATERIAL",null,"Quantidade","Unidade",null,"Preço Unitário","Custo Unitário"]
[null,"M2037","Microesferas refletivas de vidro tipo I-B",0.12,"kg",null,8.7245000000000008,null,null,{"$f":"D880*G880","v":1.04694}]
[null,"M2038","Microesferas refletivas de vidro tipo II-A",0.35,"kg",null,8.9086999999999996,null,null,{"$f":"D881*G881","v":3.1180449999999995}]
[null,"M2034","Solvente para tinta à base de resina acrílica",0.03,"l",null,16.8491,null,null,0.50547299999999995]
[null,"M2044","Tinta à base de resina acrílica emulsionada em água para pré-marcação viária",9.7000000000000005E-4,"l",null,21.025400000000001,null,null,2.0394638000000003E-2]
[null,"M2027","Tinta à base de resina acrílica estirenada para demarcação viária",0.6,"l",null,35.350499999999997,null,null,21.210299999999997]
[null,null,null,"Custo unitário total de material",{"$nulls":5},{"$f":"SUM(J880:J884)","v":25.901152637999996}]
[null,"D - ATIVIDADES AUXILIARES",null,"Quantidade","Unidade",null,"Custo Unitário","Custo Unitário"]
[null,"-",0,null,0,null,0,null,null,{"$f":"D887*G887","v":0}]
[null,"-",0,null,0,null,0,null,null,{"$f":"D888*G888","v":0}]
[null,null,null,"Custo total de atividades auxiliares",{"$nulls":5},{"$f":"SUM(J887:J888)","v":0}]
[{"$nulls":7},"Subtotal",null,{"$f":"J876+J885+J889+J877+J878","v":41.907951842771368}]
[null,"E - TEMPO FIXO",null,"Código","Quantidade","Unidade",null,"Custo Unitário","Custo Unitário"]
[null,"M2037","Microesferas refletivas de vidro tipo I-B",5914655,1.2E-4,"t",null,32.520000000000003,null,{"$f":"ROUNDDOWN(E892*H892,4)","v":3.8999999999999998E-3}]
[null,"M2038","Microesferas refletivas de vidro tipo II-A",5914655,3.5E-4,"t",null,32.520000000000003,null,{"$f":"ROUNDDOWN(E893*H893,4)","v":1.1299999999999999E-2}]
[null,"M2034","Solvente para tinta à base de resina acrílica",5914655,3.0000000000000001E-5,"t",null,32.520000000000003,null,8.9999999999999998E-4]
[null,"M2027","Tinta à base de resina acrílica estirenada para demarcação viária",5914655,8.3000000000000001E-4,"t",null,32.520000000000003,null,2.69E-2]
[null,null,null,"Custo unitário total de tempo fixo",{"$nulls":5},{"$f":"SUM(J892:J895)","v":4.2999999999999997E-2}]
[null,"F - MOMENTO DE TRANSPORTE",null,"Quantidade","Unidade","DMT",null,null,null,"Custo Unitário"]
[{"$nulls":5},"LN","RP","P"]
[null,"M2037","Microesferas refletivas de vidro tipo I-B",1.2E-4,"tkm"]
[null,"M2038","Microesferas refletivas de vidro tipo II-A",3.5E-4,"tkm"]
[null,"M2034","Solvente para tinta à base de resina acrílica",3.0000000000000001E-5,"tkm"]
[null,"M2027","Tinta à base de resina acrílica estirenada para demarcação viária",8.3000000000000001E-4,"tkm"]
[null,null,null,"Custo unitário total de transporte"]
[{"$nulls":5},"Custo unitário direto total",null,null,null,{"$f":"TRUNC(J890+J896,2)","v":41.95}]
[null,"Obs."]
[]
[{"$f":"A861+1","v":52},"1ª/GRD",{"$nulls":8},{"$f":"J955","v":0}]
[null,"OBRA:",0]
[null,"Custo Unitário de Referência",null,null,"Minas Gerais"]
[{"$nulls":4}," Janeiro/2025 ",null,null,"Produção da equipe ",1,{"$f":"VLOOKUP(A907,ORÇAMENTO!$A$10:$L$42,5,1)","v":"PINTURA DE FAIXA DE PEDESTRE OU ZEBRADA TINTA RETRORREFLETIVA A BASE DE RESINA ACRÍLICA COM MICROESFERAS DE VIDRO, APLICAÇÃO MANUAL"}]
[null,"SICRO",5213405,{"$nulls":5},"Valores em reais (R$)"]
[null,"A - EQUIPAMENTOS",null,"Quantidade","Utilização",null,"Custo Horário",null,null,"Custo"]
[{"$nulls":4},"Operativa","Improdutiva","Produtivo","Improdutivo",null,"Horário Total"]
[null,"-",0,null,null,null,0,0,null,{"$f":"D914*(E914*G914+F914*H914)","v":0}]
[null,"-",0,null,null,null,0,0,null,{"$f":"D915*(E915*G915+F915*H915)","v":0}]
[{"$nulls":7},"Custo horário total de equipamentos",null,{"$f":"SUM(J914:J915)","v":0}]
[null,"B - MÃO DE OBRA",null,"Quantidade","Unidade",null,"Custo Horário","Custo Horário Total"]
[null,"-",0,null,0,null,0,null,null,{"$f":"D918*G918","v":0}]
[null,"-",0,null,0,null,0,null,null,{"$f":"D919*G919","v":0}]
[null,null,null,"Custo horário total de mão de obra",{"$nulls":5},{"$f":"SUM(J918:J919)","v":0}]
[null,null,null,"Custo horário total de execução",{"$nulls":5},{"$f":"J916+J920","v":0}]
[null,null,null,"Custo unitário de execução",{"$nulls":5},{"$f":"J921/I910","v":0}]
[{"$nulls":7},"Custo do FIC",null,0]
[{"$nulls":7},"Custo do FIT",null,0]
[null,"C - MATERIAL",null,"Quantidade","Unidade",null,"Preço Unitário","Custo Unitário"]
[null,"-",0,null,0,null,0,null,null,{"$f":"D926*G926","v":0}]
[null,"-",0,null,0,null,0,null,null,{"$f":"D927*G927","v":0}]
[null,"-",0,null,0,null,0,null,null,0]
[null,"-",0,null,0,null,0,null,null,0]
[null,"-",0,null,0,null,0,null,null,0]
[null,null,null,"Custo unitário total de material",{"$nulls":5},{"$f":"SUM(J926:J930)","v":0}]
[null,"D - ATIVIDADES AUXILIARES",null,"Quantidade","Unidade",null,"Custo Unitário","Custo Unitário"]
[null,"-",0,null,0,null,0,null,null,{"$f":"D933*G933","v":0}]
[null,"-",0,null,0,null,0,null,null,{"$f":"D934*G934","v":0}]
[null,"-",0,null,0,null,0,null,null,{"$f":"D935*G935","v":0}]
[null,null,null,"Custo total de atividades auxiliares",{"$nulls":5},{"$f":"SUM(J933:J935)","v":0}]
[{"$nulls":7},"Subtotal",null,{"$f":"J922+J931+J936+J923+J924","v":0}]
[null,"E - TEMPO FIXO",null,"Código","Quantidade","Unidade",null,"Custo Unitário","Custo Unitário"]
[null,"-",0,"-",null,"t",null,0,null,{"$f":"ROUNDDOWN(E939*H939,4)","v":0}]
[null,"-",0,"-",null,"t",null,0,null,{"$f":"ROUNDDOWN(E940*H940,4)","v":0}]
[null,"-",0,"-",null,"t",null,0,null,0]
[null,"-",0,"-",null,"t",null,0,null,0]
[null,"-",0,"-",null,"t",null,0,null,0]
[null,"-",0,"-",null,"t",null,0,null,0]
[null,null,null,"Custo unitário total de tempo fixo",{"$nulls":5},{"$f":"SUM(J939:J944)","v":0}]
[null,"F - MOMENTO DE TRANSPORTE",null,"Quantidade","Unidade","DMT",null,null,null,"Custo Unitário"]
[{"$nulls":5},"LN","RP","P"]
[null,"-",0,null,"tkm"]
[null,"-",0,null,"tkm"]
[null,"-",0,null,"tkm"]
[null,"-",0,null,"tkm"]
[null,"-",0,null,"tkm"]
[null,"-",0,null,"tkm"]
[null,null,null,"Custo unitário total de transporte"]
[{"$nulls":5},"Custo unitário direto total",null,null,null,{"$f":"J937+J945","v":0}]
[null,"Obs."]
[]
[{"$f":"A907+1","v":53},"1ª/GRD",{"$nulls":8},{"$f":"J1006","v":0}]
[null,"OBRA:",0]
[null,"Custo Unitário de Referência",null,null,"Minas Gerais"]
[{"$nulls":4}," Janeiro/2025 ",null,null,"Produção da equipe ",1,{"$f":"VLOOKUP(A958,ORÇAMENTO!$A$10:$L$42,5,1)","v":"PINTURA DE FAIXA DE PEDESTRE OU ZEBRADA TINTA RETRORREFLETIVA A BASE DE RESINA ACRÍLICA COM MICROESFERAS DE VIDRO, APLICAÇÃO MANUAL"}]
[null,"SICRO",5213405,{"$nulls":5},"Valores em reais (R$)"]
[null,"A - EQUIPAMENTOS",null,"Quantidade","Utilização",null,"Custo Horário",null,null,"Custo"]
[{"$nulls":4},"Operativa","Improdutiva","Produtivo","Improdutivo",null,"Horário Total"]
[null,"-",0,null,null,null,0,0,null,{"$f":"D965*(E965*G965+F965*H965)","v":0}]
[null,"-",0,null,null,null,0,0,null,{"$f":"D966*(E966*G966+F966*H966)","v":0}]
[{"$nulls":7},"Custo horário total de equipamentos",null,{"$f":"SUM(J965:J966)","v":0}]
[null,"B - MÃO DE OBRA",null,"Quantidade","Unidade",null,"Custo Horário","Custo Horário Total"]
[null,"-",0,null,0,null,0,null,null,{"$f":"D969*G969","v":0}]
[null,"-",0,null,0,null,0,null,null,{"$f":"D970*G970","v":0}]
[null,null,null,"Custo horário total de mão de obra",{"$nulls":5},{"$f":"SUM(J969:J970)","v":0}]
[null,null,null,"Custo horário total de execução",{"$nulls":5},{"$f":"J967+J971","v":0}]
[null,null,null,"Custo unitário de execução",{"$nulls":5},{"$f":"J972/I961","v":0}]
[{"$nulls":7},"Custo do FIC",null,0]
[{"$nulls":7},"Custo do FIT",null,0]
[null,"C - MATERIAL",null,"Quantidade","Unidade",null,"Preço Unitário","Custo Unitário"]
[null,"-",0,null,0,null,0,null,null,{"$f":"D977*G977","v":0}]
[null,"-",0,null,0,null,0,null,null,{"$f":"D978*G978","v":0}]
[null,"-",0,null,0,null,0,null,null,0]
[null,"-",0,null,0,null,0,null,null,0]
[null,"-",0,null,0,null,0,null,null,0]
[null,null,null,"Custo unitário total de material",{"$nulls":5},{"$f":"SUM(J977:J981)","v":0}]
[null,"D - ATIVIDADES AUXILIARES",null,"Quantidade","Unidade",null,"Custo Unitário","Custo Unitário"]
[null,"-",0,null,0,null,0,null,null,{"$f":"D984*G984","v":0}]
[null,"-",0,null,0,null,0,null,null,{"$f":"D985*G985","v":0}]
[null,"-",0,null,0,null,0,null,null,{"$f":"D986*G986","v":0}]
[null,null,null,"Custo total de atividades auxiliares",{"$nulls":5},{"$f":"SUM(J984:J986)","v":0}]
[{"$nulls":7},"Subtotal",null,{"$f":"J973+J982+J987+J974+J975","v":0}]
[null,"E - TEMPO FIXO",null,"Código","Quantidade","Unidade",null,"Custo Unitário","Custo Unitário"]
[null,"-",0,"-",null,"t",null,0,null,{"$f":"ROUNDDOWN(E990*H990,4)","v":0}]
[null,"-",0,"-",null,"t",null,0,null,{"$f":"ROUNDDOWN(E991*H991,4)","v":0}]
[null,"-",0,"-",null,"t",null,0,null,0]
[null,"-",0,"-",null,"t",null,0,null,0]
[null,"-",0,"-",null,"t",null,0,null,0]
[null,"-",0,"-",null,"t",null,0,null,0]
[null,null,null,"Custo unitário total de tempo fixo",{"$nulls":5},{"$f":"SUM(J990:J995)","v":0}]
[null,"F - MOMENTO DE TRANSPORTE",null,"Quantidade","Unidade","DMT",null,null,null,"Custo Unitário"]
[{"$nulls":5},"LN","RP","P"]
[null,"-",0,null,"tkm"]
[null,"-",0,null,"tkm"]
[null,"-",0,null,"tkm"]
[null,"-",0,null,"tkm"]
[null,"-",0,null,"tkm"]
[null,"-",0,null,"tkm"]
[null,null,null,"Custo unitário total de transporte"]
[{"$nulls":5},"Custo unitário direto total",null,null,null,{"$f":"J988+J996","v":0}]
[null,"Obs."]
[]
[{"$f":"A958+1","v":54},"1ª/GRD",{"$nulls":8},{"$f":"J1057","v":0}]
[null,"OBRA:",0]
[null,"Custo Unitário de Referência",null,null,"Minas Gerais"]
[{"$nulls":4}," Janeiro/2025 ",null,null,"Produção da equipe ",1,{"$f":"VLOOKUP(A1009,ORÇAMENTO!$A$10:$L$42,5,1)","v":"PINTURA DE FAIXA DE PEDESTRE OU ZEBRADA TINTA RETRORREFLETIVA A BASE DE RESINA ACRÍLICA COM MICROESFERAS DE VIDRO, APLICAÇÃO MANUAL"}]
[null,"SICRO",5213405,{"$nulls":5},"Valores em reais (R$)"]
[null,"A - EQUIPAMENTOS",null,"Quantidade","Utilização",null,"Custo Horário",null,null,"Custo"]
[{"$nulls":4},"Operativa","Improdutiva","Produtivo","Improdutivo",null,"Horário Total"]
[null,"-",0,null,null,null,0,0,null,{"$f":"D1016*(E1016*G1016+F1016*H1016)","v":0}]
[null,"-",0,null,null,null,0,0,null,{"$f":"D1017*(E1017*G1017+F1017*H1017)","v":0}]
[{"$nulls":7},"Custo horário total de equipamentos",null,{"$f":"SUM(J1016:J1017)","v":0}]
[null,"B - MÃO DE OBRA",null,"Quantidade","Unidade",null,"Custo Horário","Custo Horário Total"]
[null,"-",0,null,0,null,0,null,null,{"$f":"D1020*G1020","v":0}]
[null,"-",0,null,0,null,0,null,null,{"$f":"D1021*G1021","v":0}]
[null,null,null,"Custo horário total de mão de obra",{"$nulls":5},{"$f":"SUM(J1020:J1021)","v":0}]
[null,null,null,"Custo horário total de execução",{"$nulls":5},{"$f":"J1018+J1022","v":0}]
[null,null,null,"Custo unitário de execução",{"$nulls":5},{"$f":"J1023/I1012","v":0}]
[{"$nulls":7},"Custo do FIC",null,0]
[{"$nulls":7},"Custo do FIT",null,0]
[null,"C - MATERIAL",null,"Quantidade","Unidade",null,"Preço Unitário","Custo Unitário"]
[null,"-",0,null,0,null,0,null,null,{"$f":"D1028*G1028","v":0}]
[null,"-",0,null,0,null,0,null,null,{"$f":"D1029*G1029","v":0}]
[null,"-",0,null,0,null,0,null,null,0]
[null,"-",0,null,0,null,0,null,null,0]
[null,"-",0,null,0,null,0,null,null,0]
[null,null,null,"Custo unitário total de material",{"$nulls":5},{"$f":"SUM(J1028:J1032)","v":0}]
[null,"D - ATIVIDADES AUXILIARES",null,"Quantidade","Unidade",null,"Custo Unitário","Custo Unitário"]
[null,"-",0,null,0,null,0,null,null,{"$f":"D1035*G1035","v":0}]
[null,"-",0,null,0,null,0,null,null,{"$f":"D1036*G1036","v":0}]
[null,"-",0,null,0,null,0,null,null,{"$f":"D1037*G1037","v":0}]
[null,null,null,"Custo total de atividades auxiliares",{"$nulls":5},{"$f":"SUM(J1035:J1037)","v":0}]
[{"$nulls":7},"Subtotal",null,{"$f":"J1024+J1033+J1038+J1025+J1026","v":0}]
[null,"E - TEMPO FIXO",null,"Código","Quantidade","Unidade",null,"Custo Unitário","Custo Unitário"]
[null,"-",0,"-",null,"t",null,0,null,{"$f":"ROUNDDOWN(E1041*H1041,4)","v":0}]
[null,"-",0,"-",null,"t",null,0,null,{"$f":"ROUNDDOWN(E1042*H1042,4)","v":0}]
[null,"-",0,"-",null,"t",null,0,null,0]
[null,"-",0,"-",null,"t",null,0,null,0]
[null,"-",0,"-",null,"t",null,0,null,0]
[null,"-",0,"-",null,"t",null,0,null,0]
[null,null,null,"Custo unitário total de tempo fixo",{"$nulls":5},{"$f":"SUM(J1041:J1046)","v":0}]
[null,"F - MOMENTO DE TRANSPORTE",null,"Quantidade","Unidade","DMT",null,null,null,"Custo Unitário"]
[{"$nulls":5},"LN","RP","P"]
[null,"-",0,null,"tkm"]
[null,"-",0,null,"tkm"]
[null,"-",0,null,"tkm"]
[null,"-",0,null,"tkm"]
[null,"-",0,null,"tkm"]
[null,"-",0,null,"tkm"]
[null,null,null,"Custo unitário total de transporte"]
[{"$nulls":5},"Custo unitário direto total",null,null,null,{"$f":"J1039+J1047","v":0}]
[null,"Obs."]
[]
[{"$f":"A1009+1","v":55},"1ª/GRD",{"$nulls":8},{"$f":"J1108","v":0}]
[null,"OBRA:",0]
[null,"Custo Unitário de Referência",null,null,"Minas Gerais"]
[{"$nulls":4}," Janeiro/2025 ",null,null,"Produção da equipe ",1,{"$f":"VLOOKUP(A1060,ORÇAMENTO!$A$10:$L$42,5,1)","v":"PINTURA DE FAIXA DE PEDESTRE OU ZEBRADA TINTA RETRORREFLETIVA A BASE DE RESINA ACRÍLICA COM MICROESFERAS DE VIDRO, APLICAÇÃO MANUAL"}]
[null,"SICRO",5213405,{"$nulls":5},"Valores em reais (R$)"]
[null,"A - EQUIPAMENTOS",null,"Quantidade","Utilização",null,"Custo Horário",null,null,"Custo"]
[{"$nulls":4},"Operativa","Improdutiva","Produtivo","Improdutivo",null,"Horário Total"]
[null,"-",0,null,null,null,0,0,null,{"$f":"D1067*(E1067*G1067+F1067*H1067)","v":0}]
[null,"-",0,null,null,null,0,0,null,{"$f":"D1068*(E1068*G1068+F1068*H1068)","v":0}]
[{"$nulls":7},"Custo horário total de equipamentos",null,{"$f":"SUM(J1067:J1068)","v":0}]
[null,"B - MÃO DE OBRA",null,"Quantidade","Unidade",null,"Custo Horário","Custo Horário Total"]
[null,"-",0,null,0,null,0,null,null,{"$f":"D1071*G1071","v":0}]
[null,"-",0,null,0,null,0,null,null,{"$f":"D1072*G1072","v":0}]
[null,null,null,"Custo horário total de mão de obra",{"$nulls":5},{"$f":"SUM(J1071:J1072)","v":0}]
[null,null,null,"Custo horário total de execução",{"$nulls":5},{"$f":"J1069+J1073","v":0}]
[null,null,null,"Custo unitário de execução",{"$nulls":5},{"$f":"J1074/I1063","v":0}]
[{"$nulls":7},"Custo do FIC",null,0]
[{"$nulls":7},"Custo do FIT",null,0]
[null,"C - MATERIAL",null,"Quantidade","Unidade",null,"Preço Unitário","Custo Unitário"]
[null,"-",0,null,0,null,0,null,null,{"$f":"D1079*G1079","v":0}]
[null,"-",0,null,0,null,0,null,null,{"$f":"D1080*G1080","v":0}]
[null,"-",0,null,0,null,0,null,null,0]
[null,"-",0,null,0,null,0,null,null,0]
[null,"-",0,null,0,null,0,null,null,0]
[null,null,null,"Custo unitário total de material",{"$nulls":5},{"$f":"SUM(J1079:J1083)","v":0}]
[null,"D - ATIVIDADES AUXILIARES",null,"Quantidade","Unidade",null,"Custo Unitário","Custo Unitário"]
[null,"-",0,null,0,null,0,null,null,{"$f":"D1086*G1086","v":0}]
[null,"-",0,null,0,null,0,null,null,{"$f":"D1087*G1087","v":0}]
[null,"-",0,null,0,null,0,null,null,{"$f":"D1088*G1088","v":0}]
[null,null,null,"Custo total de atividades auxiliares",{"$nulls":5},{"$f":"SUM(J1086:J1088)","v":0}]
[{"$nulls":7},"Subtotal",null,{"$f":"J1075+J1084+J1089+J1076+J1077","v":0}]
[null,"E - TEMPO FIXO",null,"Código","Quantidade","Unidade",null,"Custo Unitário","Custo Unitário"]
[null,"-",0,"-",null,"t",null,0,null,{"$f":"ROUNDDOWN(E1092*H1092,4)","v":0}]
[null,"-",0,"-",null,"t",null,0,null,{"$f":"ROUNDDOWN(E1093*H1093,4)","v":0}]
[null,"-",0,"-",null,"t",null,0,null,0]
[null,"-",0,"-",null,"t",null,0,null,0]
[null,"-",0,"-",null,"t",null,0,null,0]
[null,"-",0,"-",null,"t",null,0,null,0]
[null,null,null,"Custo unitário total de tempo fixo",{"$nulls":5},{"$f":"SUM(J1092:J1097)","v":0}]
[null,"F - MOMENTO DE TRANSPORTE",null,"Quantidade","Unidade","DMT",null,null,null,"Custo Unitário"]
[{"$nulls":5},"LN","RP","P"]
[null,"-",0,null,"tkm"]
[null,"-",0,null,"tkm"]
[null,"-",0,null,"tkm"]
[null,"-",0,null,"tkm"]
[null,"-",0,null,"tkm"]
[null,"-",0,null,"tkm"]
[null,null,null,"Custo unitário total de transporte"]
[{"$nulls":5},"Custo unitário direto total",null,null,null,{"$f":"J1090+J1098","v":0}]
[null,"Obs."]
[]
[{"$f":"A1060+1","v":56},"1ª/GRD",{"$nulls":8},{"$f":"J1159","v":0}]
[null,"OBRA:",0]
[null,"Custo Unitário de Referência",null,null,"Minas Gerais"]
[{"$nulls":4}," Janeiro/2025 ",null,null,"Produção da equipe ",1,{"$f":"VLOOKUP(A1111,ORÇAMENTO!$A$10:$L$42,5,1)","v":"PINTURA DE FAIXA DE PEDESTRE OU ZEBRADA TINTA RETRORREFLETIVA A BASE DE RESINA ACRÍLICA COM MICROESFERAS DE VIDRO, APLICAÇÃO MANUAL"}]
[null,"SICRO",5213405,{"$nulls":5},"Valores em reais (R$)"]
[null,"A - EQUIPAMENTOS",null,"Quantidade","Utilização",null,"Custo Horário",null,null,"Custo"]
[{"$nulls":4},"Operativa","Improdutiva","Produtivo","Improdutivo",null,"Horário Total"]
[null,"-",0,null,null,null,0,0,null,{"$f":"D1118*(E1118*G1118+F1118*H1118)","v":0}]
[null,"-",0,null,null,null,0,0,null,{"$f":"D1119*(E1119*G1119+F1119*H1119)","v":0}]
[{"$nulls":7},"Custo horário total de equipamentos",null,{"$f":"SUM(J1118:J1119)","v":0}]
[null,"B - MÃO DE OBRA",null,"Quantidade","Unidade",null,"Custo Horário","Custo Horário Total"]
[null,"-",0,null,0,null,0,null,null,{"$f":"D1122*G1122","v":0}]
[null,"-",0,null,0,null,0,null,null,{"$f":"D1123*G1123","v":0}]
[null,null,null,"Custo horário total de mão de obra",{"$nulls":5},{"$f":"SUM(J1122:J1123)","v":0}]
[null,null,null,"Custo horário total de execução",{"$nulls":5},{"$f":"J1120+J1124","v":0}]
[null,null,null,"Custo unitário de execução",{"$nulls":5},{"$f":"J1125/I1114","v":0}]
[{"$nulls":7},"Custo do FIC",null,0]
[{"$nulls":7},"Custo do FIT",null,0]
[null,"C - MATERIAL",null,"Quantidade","Unidade",null,"Preço Unitário","Custo Unitário"]
[null,"-",0,null,0,null,0,null,null,{"$f":"D1130*G1130","v":0}]
[null,"-",0,null,0,null,0,null,null,{"$f":"D1131*G1131","v":0}]
[null,"-",0,null,0,null,0,null,null,0]
[null,"-",0,null,0,null,0,null,null,0]
[null,"-",0,null,0,null,0,null,null,0]
[null,null,null,"Custo unitário total de material",{"$nulls":5},{"$f":"SUM(J1130:J1134)","v":0}]
[null,"D - ATIVIDADES AUXILIARES",null,"Quantidade","Unidade",null,"Custo Unitário","Custo Unitário"]
[null,"-",0,null,0,null,0,null,null,{"$f":"D1137*G1137","v":0}]
[null,"-",0,null,0,null,0,null,null,{"$f":"D1138*G1138","v":0}]
[null,"-",0,null,0,null,0,null,null,{"$f":"D1139*G1139","v":0}]
[null,null,null,"Custo total de atividades auxiliares",{"$nulls":5},{"$f":"SUM(J1137:J1139)","v":0}]
[{"$nulls":7},"Subtotal",null,{"$f":"J1126+J1135+J1140+J1127+J1128","v":0}]
[null,"E - TEMPO FIXO",null,"Código","Quantidade","Unidade",null,"Custo Unitário","Custo Unitário"]
[null,"-",0,"-",null,"t",null,0,null,{"$f":"ROUNDDOWN(E1143*H1143,4)","v":0}]
[null,"-",0,"-",null,"t",null,0,null,{"$f":"ROUNDDOWN(E1144*H1144,4)","v":0}]
[null,"-",0,"-",null,"t",null,0,null,0]
[null,"-",0,"-",null,"t",null,0,null,0]
[null,"-",0,"-",null,"t",null,0,null,0]
[null,"-",0,"-",null,"t",null,0,null,0]
[null,null,null,"Custo unitário total de tempo fixo",{"$nulls":5},{"$f":"SUM(J1143:J1148)","v":0}]
[null,"F - MOMENTO DE TRANSPORTE",null,"Quantidade","Unidade","DMT",null,null,null,"Custo Unitário"]
[{"$nulls":5},"LN","RP","P"]
[null,"-",0,null,"tkm"]
[null,"-",0,null,"tkm"]
[null,"-",0,null,"tkm"]
[null,"-",0,null,"tkm"]
[null,"-",0,null,"tkm"]
[null,"-",0,null,"tkm"]
[null,null,null,"Custo unitário total de transporte"]
[{"$nulls":5},"Custo unitário direto total",null,null,null,{"$f":"J1141+J1149","v":0}]
[null,"Obs."]
[]
[{"$f":"A1111+1","v":57},"1ª/GRD",{"$nulls":8},{"$f":"J1210","v":0}]
[null,"OBRA:",0]
[null,"Custo Unitário de Referência",null,null,"Minas Gerais"]
[{"$nulls":4}," Janeiro/2025 ",null,null,"Produção da equipe ",1,{"$f":"VLOOKUP(A1162,ORÇAMENTO!$A$10:$L$42,5,1)","v":"PINTURA DE FAIXA DE PEDESTRE OU ZEBRADA TINTA RETRORREFLETIVA A BASE DE RESINA ACRÍLICA COM MICROESFERAS DE VIDRO, APLICAÇÃO MANUAL"}]
[null,"SICRO",5213405,{"$nulls":5},"Valores em reais (R$)"]
[null,"A - EQUIPAMENTOS",null,"Quantidade","Utilização",null,"Custo Horário",null,null,"Custo"]
[{"$nulls":4},"Operativa","Improdutiva","Produtivo","Improdutivo",null,"Horário Total"]
[null,"-",0,null,null,null,0,0,null,{"$f":"D1169*(E1169*G1169+F1169*H1169)","v":0}]
[null,"-",0,null,null,null,0,0,null,{"$f":"D1170*(E1170*G1170+F1170*H1170)","v":0}]
[{"$nulls":7},"Custo horário total de equipamentos",null,{"$f":"SUM(J1169:J1170)","v":0}]
[null,"B - MÃO DE OBRA",null,"Quantidade","Unidade",null,"Custo Horário","Custo Horário Total"]
[null,"-",0,null,0,null,0,null,null,{"$f":"D1173*G1173","v":0}]
[null,"-",0,null,0,null,0,null,null,{"$f":"D1174*G1174","v":0}]
[null,null,null,"Custo horário total de mão de obra",{"$nulls":5},{"$f":"SUM(J1173:J1174)","v":0}]
[null,null,null,"Custo horário total de execução",{"$nulls":5},{"$f":"J1171+J1175","v":0}]
[null,null,null,"Custo unitário de execução",{"$nulls":5},{"$f":"J1176/I1165","v":0}]
[{"$nulls":7},"Custo do FIC",null,0]
[{"$nulls":7},"Custo do FIT",null,0]
[null,"C - MATERIAL",null,"Quantidade","Unidade",null,"Preço Unitário","Custo Unitário"]
[null,"-",0,null,0,null,0,null,null,{"$f":"D1181*G1181","v":0}]
[null,"-",0,null,0,null,0,null,null,{"$f":"D1182*G1182","v":0}]
[null,"-",0,null,0,null,0,null,null,0]
[null,"-",0,null,0,null,0,null,null,0]
[null,"-",0,null,0,null,0,null,null,0]
[null,null,null,"Custo unitário total de material",{"$nulls":5},{"$f":"SUM(J1181:J1185)","v":0}]
[null,"D - ATIVIDADES AUXILIARES",null,"Quantidade","Unidade",null,"Custo Unitário","Custo Unitário"]
[null,"-",0,null,0,null,0,null,null,{"$f":"D1188*G1188","v":0}]
[null,"-",0,null,0,null,0,null,null,{"$f":"D1189*G1189","v":0}]
[null,"-",0,null,0,null,0,null,null,{"$f":"D1190*G1190","v":0}]
[null,null,null,"Custo total de atividades auxiliares",{"$nulls":5},{"$f":"SUM(J1188:J1190)","v":0}]
[{"$nulls":7},"Subtotal",null,{"$f":"J1177+J1186+J1191+J1178+J1179","v":0}]
[null,"E - TEMPO FIXO",null,"Código","Quantidade","Unidade",null,"Custo Unitário","Custo Unitário"]
[null,"-",0,"-",null,"t",null,0,null,{"$f":"ROUNDDOWN(E1194*H1194,4)","v":0}]
[null,"-",0,"-",null,"t",null,0,null,{"$f":"ROUNDDOWN(E1195*H1195,4)","v":0}]
[null,"-",0,"-",null,"t",null,0,null,0]
[null,"-",0,"-",null,"t",null,0,null,0]
[null,"-",0,"-",null,"t",null,0,null,0]
[null,"-",0,"-",null,"t",null,0,null,0]
[null,null,null,"Custo unitário total de tempo fixo",{"$nulls":5},{"$f":"SUM(J1194:J1199)","v":0}]
[null,"F - MOMENTO DE TRANSPORTE",null,"Quantidade","Unidade","DMT",null,null,null,"Custo Unitário"]
[{"$nulls":5},"LN","RP","P"]
[null,"-",0,null,"tkm"]
[null,"-",0,null,"tkm"]
[null,"-",0,null,"tkm"]
[null,"-",0,null,"tkm"]
[null,"-",0,null,"tkm"]
[null,"-",0,null,"tkm"]
[null,null,null,"Custo unitário total de transporte"]
[{"$nulls":5},"Custo unitário direto total",null,null,null,{"$f":"J1192+J1200","v":0}]
[null,"Obs."]
[]
[{"$f":"A1162+1","v":58},"1ª/GRD",{"$nulls":8},{"$f":"J1261","v":0}]
[null,"OBRA:",0]
[null,"Custo Unitário de Referência",null,null,"Minas Gerais"]
[{"$nulls":4}," Janeiro/2025 ",null,null,"Produção da equipe ",1,{"$f":"VLOOKUP(A1213,ORÇAMENTO!$A$10:$L$42,5,1)","v":"PINTURA DE FAIXA DE PEDESTRE OU ZEBRADA TINTA RETRORREFLETIVA A BASE DE RESINA ACRÍLICA COM MICROESFERAS DE VIDRO, APLICAÇÃO MANUAL"}]
[null,"SICRO",5213405,{"$nulls":5},"Valores em reais (R$)"]
[null,"A - EQUIPAMENTOS",null,"Quantidade","Utilização",null,"Custo Horário",null,null,"Custo"]
[{"$nulls":4},"Operativa","Improdutiva","Produtivo","Improdutivo",null,"Horário Total"]
[null,"-",0,null,null,null,0,0,null,{"$f":"D1220*(E1220*G1220+F1220*H1220)","v":0}]
[null,"-",0,null,null,null,0,0,null,{"$f":"D1221*(E1221*G1221+F1221*H1221)","v":0}]
[{"$nulls":7},"Custo horário total de equipamentos",null,{"$f":"SUM(J1220:J1221)","v":0}]
[null,"B - MÃO DE OBRA",null,"Quantidade","Unidade",null,"Custo Horário","Custo Horário Total"]
[null,"-",0,null,0,null,0,null,null,{"$f":"D1224*G1224","v":0}]
[null,"-",0,null,0,null,0,null,null,{"$f":"D1225*G1225","v":0}]
[null,null,null,"Custo horário total de mão de obra",{"$nulls":5},{"$f":"SUM(J1224:J1225)","v":0}]
[null,null,null,"Custo horário total de execução",{"$nulls":5},{"$f":"J1222+J1226","v":0}]
[null,null,null,"Custo unitário de execução",{"$nulls":5},{"$f":"J1227/I1216","v":0}]
[{"$nulls":7},"Custo do FIC",null,0]
[{"$nulls":7},"Custo do FIT",null,0]
[null,"C - MATERIAL",null,"Quantidade","Unidade",null,"Preço Unitário","Custo Unitário"]
[null,"-",0,null,0,null,0,null,null,{"$f":"D1232*G1232","v":0}]
[null,"-",0,null,0,null,0,null,null,{"$f":"D1233*G1233","v":0}]
[null,"-",0,null,0,null,0,null,null,0]
[null,"-",0,null,0,null,0,null,null,0]
[null,"-",0,null,0,null,0,null,null,0]
[null,null,null,"Custo unitário total de material",{"$nulls":5},{"$f":"SUM(J1232:J1236)","v":0}]
[null,"D - ATIVIDADES AUXILIARES",null,"Quantidade","Unidade",null,"Custo Unitário","Custo Unitário"]
[null,"-",0,null,0,null,0,null,null,{"$f":"D1239*G1239","v":0}]
[null,"-",0,null,0,null,0,null,null,{"$f":"D1240*G1240","v":0}]
[null,"-",0,null,0,null,0,null,null,{"$f":"D1241*G1241","v":0}]
[null,null,null,"Custo total de atividades auxiliares",{"$nulls":5},{"$f":"SUM(J1239:J1241)","v":0}]
[{"$nulls":7},"Subtotal",null,{"$f":"J1228+J1237+J1242+J1229+J1230","v":0}]
[null,"E - TEMPO FIXO",null,"Código","Quantidade","Unidade",null,"Custo Unitário","Custo Unitário"]
[null,"-",0,"-",null,"t",null,0,null,{"$f":"ROUNDDOWN(E1245*H1245,4)","v":0}]
[null,"-",0,"-",null,"t",null,0,null,{"$f":"ROUNDDOWN(E1246*H1246,4)","v":0}]
[null,"-",0,"-",null,"t",null,0,null,0]
[null,"-",0,"-",null,"t",null,0,null,0]
[null,"-",0,"-",null,"t",null,0,null,0]
[null,"-",0,"-",null,"t",null,0,null,0]
[null,null,null,"Custo unitário total de tempo fixo",{"$nulls":5},{"$f":"SUM(J1245:J1250)","v":0}]
[null,"F - MOMENTO DE TRANSPORTE",null,"Quantidade","Unidade","DMT",null,null,null,"Custo Unitário"]
[{"$nulls":5},"LN","RP","P"]
[null,"-",0,null,"tkm"]
[null,"-",0,null,"tkm"]
[null,"-",0,null,"tkm"]
[null,"-",0,null,"tkm"]
[null,"-",0,null,"tkm"]
[null,"-",0,null,"tkm"]
[null,null,null,"Custo unitário total de transporte"]
[{"$nulls":5},"Custo unitário direto total",null,null,null,{"$f":"J1243+J1251","v":0}]
[null,"Obs."]
[]
[{"$f":"A1213+1","v":59},"1ª/GRD",{"$nulls":8},{"$f":"J1312","v":0}]
[null,"OBRA:",0]
[null,"Custo Unitário de Referência",null,null,"Minas Gerais"]
[{"$nulls":4}," Janeiro/2025 ",null,null,"Produção da equipe ",1,{"$f":"VLOOKUP(A1264,ORÇAMENTO!$A$10:$L$42,5,1)","v":"PINTURA DE FAIXA DE PEDESTRE OU ZEBRADA TINTA RETRORREFLETIVA A BASE DE RESINA ACRÍLICA COM MICROESFERAS DE VIDRO, APLICAÇÃO MANUAL"}]
[null,"SICRO",5213405,{"$nulls":5},"Valores em reais (R$)"]
[null,"A - EQUIPAMENTOS",null,"Quantidade","Utilização",null,"Custo Horário",null,null,"Custo"]
[{"$nulls":4},"Operativa","Improdutiva","Produtivo","Improdutivo",null,"Horário Total"]
[null,"-",0,null,null,null,0,0,null,{"$f":"D1271*(E1271*G1271+F1271*H1271)","v":0}]
[null,"-",0,null,null,null,0,0,null,{"$f":"D1272*(E1272*G1272+F1272*H1272)","v":0}]
[{"$nulls":7},"Custo horário total de equipamentos",null,{"$f":"SUM(J1271:J1272)","v":0}]
[null,"B - MÃO DE OBRA",null,"Quantidade","Unidade",null,"Custo Horário","Custo Horário Total"]
[null,"-",0,null,0,null,0,null,null,{"$f":"D1275*G1275","v":0}]
[null,"-",0,null,0,null,0,null,null,{"$f":"D1276*G1276","v":0}]
[null,null,null,"Custo horário total de mão de obra",{"$nulls":5},{"$f":"SUM(J1275:J1276)","v":0}]
[null,null,null,"Custo horário total de execução",{"$nulls":5},{"$f":"J1273+J1277","v":0}]
[null,null,null,"Custo unitário de execução",{"$nulls":5},{"$f":"J1278/I1267","v":0}]
[{"$nulls":7},"Custo do FIC",null,0]
[{"$nulls":7},"Custo do FIT",null,0]
[null,"C - MATERIAL",null,"Quantidade","Unidade",null,"Preço Unitário","Custo Unitário"]
[null,"-",0,null,0,null,0,null,null,{"$f":"D1283*G1283","v":0}]
[null,"-",0,null,0,null,0,null,null,{"$f":"D1284*G1284","v":0}]
[null,"-",0,null,0,null,0,null,null,0]
[null,"-",0,null,0,null,0,null,null,0]
[null,"-",0,null,0,null,0,null,null,0]
[null,null,null,"Custo unitário total de material",{"$nulls":5},{"$f":"SUM(J1283:J1287)","v":0}]
[null,"D - ATIVIDADES AUXILIARES",null,"Quantidade","Unidade",null,"Custo Unitário","Custo Unitário"]
[null,"-",0,null,0,null,0,null,null,{"$f":"D1290*G1290","v":0}]
[null,"-",0,null,0,null,0,null,null,{"$f":"D1291*G1291","v":0}]
[null,"-",0,null,0,null,0,null,null,{"$f":"D1292*G1292","v":0}]
[null,null,null,"Custo total de atividades auxiliares",{"$nulls":5},{"$f":"SUM(J1290:J1292)","v":0}]
[{"$nulls":7},"Subtotal",null,{"$f":"J1279+J1288+J1293+J1280+J1281","v":0}]
[null,"E - TEMPO FIXO",null,"Código","Quantidade","Unidade",null,"Custo Unitário","Custo Unitário"]
[null,"-",0,"-",null,"t",null,0,null,{"$f":"ROUNDDOWN(E1296*H1296,4)","v":0}]
[null,"-",0,"-",null,"t",null,0,null,{"$f":"ROUNDDOWN(E1297*H1297,4)","v":0}]
[null,"-",0,"-",null,"t",null,0,null,0]
[null,"-",0,"-",null,"t",null,0,null,0]
[null,"-",0,"-",null,"t",null,0,null,0]
[null,"-",0,"-",null,"t",null,0,null,0]
[null,null,null,"Custo unitário total de tempo fixo",{"$nulls":5},{"$f":"SUM(J1296:J1301)","v":0}]
[null,"F - MOMENTO DE TRANSPORTE",null,"Quantidade","Unidade","DMT",null,null,null,"Custo Unitário"]
[{"$nulls":5},"LN","RP","P"]
[null,"-",0,null,"tkm"]
[null,"-",0,null,"tkm"]
[null,"-",0,null,"tkm"]
[null,"-",0,null,"tkm"]
[null,"-",0,null,"tkm"]
[null,"-",0,null,"tkm"]
[null,null,null,"Custo unitário total de transporte"]
[{"$nulls":5},"Custo unitário direto total",null,null,null,{"$f":"J1294+J1302","v":0}]
[null,"Obs."]
[]
[{"$f":"A1264+1","v":60},"1ª/GRD",{"$nulls":8},{"$f":"J1363","v":0}]
[null,"OBRA:",0]
[null,"Custo Unitário de Referência",null,null,"Minas Gerais"]
[{"$nulls":4}," Janeiro/2025 ",null,null,"Produção da equipe ",1,{"$f":"VLOOKUP(A1315,ORÇAMENTO!$A$10:$L$42,5,1)","v":"PINTURA DE FAIXA DE PEDESTRE OU ZEBRADA TINTA RETRORREFLETIVA A BASE DE RESINA ACRÍLICA COM MICROESFERAS DE VIDRO, APLICAÇÃO MANUAL"}]
[null,"SICRO",5213405,{"$nulls":5},"Valores em reais (R$)"]
[null,"A - EQUIPAMENTOS",null,"Quantidade","Utilização",null,"Custo Horário",null,null,"Custo"]
[{"$nulls":4},"Operativa","Improdutiva","Produtivo","Improdutivo",null,"Horário Total"]
[null,"-",0,null,null,null,0,0,null,{"$f":"D1322*(E1322*G1322+F1322*H1322)","v":0}]
[null,"-",0,null,null,null,0,0,null,{"$f":"D1323*(E1323*G1323+F1323*H1323)","v":0}]
[{"$nulls":7},"Custo horário total de equipamentos",null,{"$f":"SUM(J1322:J1323)","v":0}]
[null,"B - MÃO DE OBRA",null,"Quantidade","Unidade",null,"Custo Horário","Custo Horário Total"]
[null,"-",0,null,0,null,0,null,null,{"$f":"D1326*G1326","v":0}]
[null,"-",0,null,0,null,0,null,null,{"$f":"D1327*G1327","v":0}]
[null,null,null,"Custo horário total de mão de obra",{"$nulls":5},{"$f":"SUM(J1326:J1327)","v":0}]
[null,null,null,"Custo horário total de execução",{"$nulls":5},{"$f":"J1324+J1328","v":0}]
[null,null,null,"Custo unitário de execução",{"$nulls":5},{"$f":"J1329/I1318","v":0}]
[{"$nulls":7},"Custo do FIC",null,0]
[{"$nulls":7},"Custo do FIT",null,0]
[null,"C - MATERIAL",null,"Quantidade","Unidade",null,"Preço Unitário","Custo Unitário"]
[null,"-",0,null,0,null,0,null,null,{"$f":"D1334*G1334","v":0}]
[null,"-",0,null,0,null,0,null,null,{"$f":"D1335*G1335","v":0}]
[null,"-",0,null,0,null,0,null,null,0]
[null,"-",0,null,0,null,0,null,null,0]
[null,"-",0,null,0,null,0,null,null,0]
[null,null,null,"Custo unitário total de material",{"$nulls":5},{"$f":"SUM(J1334:J1338)","v":0}]
[null,"D - ATIVIDADES AUXILIARES",null,"Quantidade","Unidade",null,"Custo Unitário","Custo Unitário"]
[null,"-",0,null,0,null,0,null,null,{"$f":"D1341*G1341","v":0}]
[null,"-",0,null,0,null,0,null,null,{"$f":"D1342*G1342","v":0}]
[null,"-",0,null,0,null,0,null,null,{"$f":"D1343*G1343","v":0}]
[null,null,null,"Custo total de atividades auxiliares",{"$nulls":5},{"$f":"SUM(J1341:J1343)","v":0}]
[{"$nulls":7},"Subtotal",null,{"$f":"J1330+J1339+J1344+J1331+J1332","v":0}]
[null,"E - TEMPO FIXO",null,"Código","Quantidade","Unidade",null,"Custo Unitário","Custo Unitário"]
[null,"-",0,"-",null,"t",null,0,null,{"$f":"ROUNDDOWN(E1347*H1347,4)","v":0}]
[null,"-",0,"-",null,"t",null,0,null,{"$f":"ROUNDDOWN(E1348*H1348,4)","v":0}]
[null,"-",0,"-",null,"t",null,0,null,0]
[null,"-",0,"-",null,"t",null,0,null,0]
[null,"-",0,"-",null,"t",null,0,null,0]
[null,"-",0,"-",null,"t",null,0,null,0]
[null,null,null,"Custo unitário total de tempo fixo",{"$nulls":5},{"$f":"SUM(J1347:J1352)","v":0}]
[null,"F - MOMENTO DE TRANSPORTE",null,"Quantidade","Unidade","DMT",null,null,null,"Custo Unitário"]
[{"$nulls":5},"LN","RP","P"]
[null,"-",0,null,"tkm"]
[null,"-",0,null,"tkm"]
[null,"-",0,null,"tkm"]
[null,"-",0,null,"tkm"]
[null,"-",0,null,"tkm"]
[null,"-",0,null,"tkm"]
[null,null,null,"Custo unitário total de transporte"]
[{"$nulls":5},"Custo unitário direto total",null,null,null,{"$f":"J1345+J1353","v":0}]
[null,"Obs."]
[]
[{"$f":"A1315+1","v":61},"1ª/GRD",{"$nulls":8},{"$f":"J1414","v":0}]
[null,"OBRA:",0]
[null,"Custo Unitário de Referência",null,null,"Minas Gerais"]
[{"$nulls":4}," Janeiro/2025 ",null,null,"Produção da equipe ",1,{"$f":"VLOOKUP(A1366,ORÇAMENTO!$A$10:$L$42,5,1)","v":"PINTURA DE FAIXA DE PEDESTRE OU ZEBRADA TINTA RETRORREFLETIVA A BASE DE RESINA ACRÍLICA COM MICROESFERAS DE VIDRO, APLICAÇÃO MANUAL"}]
[null,"SICRO",5213405,{"$nulls":5},"Valores em reais (R$)"]
[null,"A - EQUIPAMENTOS",null,"Quantidade","Utilização",null,"Custo Horário",null,null,"Custo"]
[{"$nulls":4},"Operativa","Improdutiva","Produtivo","Improdutivo",null,"Horário Total"]
[null,"-",0,null,null,null,0,0,null,{"$f":"D1373*(E1373*G1373+F1373*H1373)","v":0}]
[null,"-",0,null,null,null,0,0,null,{"$f":"D1374*(E1374*G1374+F1374*H1374)","v":0}]
[{"$nulls":7},"Custo horário total de equipamentos",null,{"$f":"SUM(J1373:J1374)","v":0}]
[null,"B - MÃO DE OBRA",null,"Quantidade","Unidade",null,"Custo Horário","Custo Horário Total"]
[null,"-",0,null,0,null,0,null,null,{"$f":"D1377*G1377","v":0}]
[null,"-",0,null,0,null,0,null,null,{"$f":"D1378*G1378","v":0}]
[null,null,null,"Custo horário total de mão de obra",{"$nulls":5},{"$f":"SUM(J1377:J1378)","v":0}]
[null,null,null,"Custo horário total de execução",{"$nulls":5},{"$f":"J1375+J1379","v":0}]
[null,null,null,"Custo unitário de execução",{"$nulls":5},{"$f":"J1380/I1369","v":0}]
[{"$nulls":7},"Custo do FIC",null,0]
[{"$nulls":7},"Custo do FIT",null,0]
[null,"C - MATERIAL",null,"Quantidade","Unidade",null,"Preço Unitário","Custo Unitário"]
[null,"-",0,null,0,null,0,null,null,{"$f":"D1385*G1385","v":0}]
[null,"-",0,null,0,null,0,null,null,{"$f":"D1386*G1386","v":0}]
[null,"-",0,null,0,null,0,null,null,0]
[null,"-",0,null,0,null,0,null,null,0]
[null,"-",0,null,0,null,0,null,null,0]
[null,null,null,"Custo unitário total de material",{"$nulls":5},{"$f":"SUM(J1385:J1389)","v":0}]
[null,"D - ATIVIDADES AUXILIARES",null,"Quantidade","Unidade",null,"Custo Unitário","Custo Unitário"]
[null,"-",0,null,0,null,0,null,null,{"$f":"D1392*G1392","v":0}]
[null,"-",0,null,0,null,0,null,null,{"$f":"D1393*G1393","v":0}]
[null,"-",0,null,0,null,0,null,null,{"$f":"D1394*G1394","v":0}]
[null,null,null,"Custo total de atividades auxiliares",{"$nulls":5},{"$f":"SUM(J1392:J1394)","v":0}]
[{"$nulls":7},"Subtotal",null,{"$f":"J1381+J1390+J1395+J1382+J1383","v":0}]
[null,"E - TEMPO FIXO",null,"Código","Quantidade","Unidade",null,"Custo Unitário","Custo Unitário"]
[null,"-",0,"-",null,"t",null,0,null,{"$f":"ROUNDDOWN(E1398*H1398,4)","v":0}]
[null,"-",0,"-",null,"t",null,0,null,{"$f":"ROUNDDOWN(E1399*H1399,4)","v":0}]
[null,"-",0,"-",null,"t",null,0,null,0]
[null,"-",0,"-",null,"t",null,0,null,0]
[null,"-",0,"-",null,"t",null,0,null,0]
[null,"-",0,"-",null,"t",null,0,null,0]
[null,null,null,"Custo unitário total de tempo fixo",{"$nulls":5},{"$f":"SUM(J1398:J1403)","v":0}]
[null,"F - MOMENTO DE TRANSPORTE",null,"Quantidade","Unidade","DMT",null,null,null,"Custo Unitário"]
[{"$nulls":5},"LN","RP","P"]
[null,"-",0,null,"tkm"]
[null,"-",0,null,"tkm"]
[null,"-",0,null,"tkm"]
[null,"-",0,null,"tkm"]
[null,"-",0,null,"tkm"]
[null,"-",0,null,"tkm"]
[null,null,null,"Custo unitário total de transporte"]
[{"$nulls":5},"Custo unitário direto total",null,null,null,{"$f":"J1396+J1404","v":0}]
[null,"Obs."]
[]
[{"$f":"A1366+1","v":62},"1ª/GRD",{"$nulls":8},{"$f":"J1465","v":0}]
[null,"OBRA:",0]
[null,"Custo Unitário de Referência",null,null,"Minas Gerais"]
[{"$nulls":4}," Janeiro/2025 ",null,null,"Produção da equipe ",1,{"$f":"VLOOKUP(A1417,ORÇAMENTO!$A$10:$L$42,5,1)","v":"PINTURA DE FAIXA DE PEDESTRE OU ZEBRADA TINTA RETRORREFLETIVA A BASE DE RESINA ACRÍLICA COM MICROESFERAS DE VIDRO, APLICAÇÃO MANUAL"}]
[null,"SICRO",5213405,{"$nulls":5},"Valores em reais (R$)"]
[null,"A - EQUIPAMENTOS",null,"Quantidade","Utilização",null,"Custo Horário",null,null,"Custo"]
[{"$nulls":4},"Operativa","Improdutiva","Produtivo","Improdutivo",null,"Horário Total"]
[null,"-",0,null,null,null,0,0,null,{"$f":"D1424*(E1424*G1424+F1424*H1424)","v":0}]
[null,"-",0,null,null,null,0,0,null,{"$f":"D1425*(E1425*G1425+F1425*H1425)","v":0}]
[{"$nulls":7},"Custo horário total de equipamentos",null,{"$f":"SUM(J1424:J1425)","v":0}]
[null,"B - MÃO DE OBRA",null,"Quantidade","Unidade",null,"Custo Horário","Custo Horário Total"]
[null,"-",0,null,0,null,0,null,null,{"$f":"D1428*G1428","v":0}]
[null,"-",0,null,0,null,0,null,null,{"$f":"D1429*G1429","v":0}]
[null,null,null,"Custo horário total de mão de obra",{"$nulls":5},{"$f":"SUM(J1428:J1429)","v":0}]
[null,null,null,"Custo horário total de execução",{"$nulls":5},{"$f":"J1426+J1430","v":0}]
[null,null,null,"Custo unitário de execução",{"$nulls":5},{"$f":"J1431/I1420","v":0}]
[{"$nulls":7},"Custo do FIC",null,0]
[{"$nulls":7},"Custo do FIT",null,0]
[null,"C - MATERIAL",null,"Quantidade","Unidade",null,"Preço Unitário","Custo Unitário"]
[null,"-",0,null,0,null,0,null,null,{"$f":"D1436*G1436","v":0}]
[null,"-",0,null,0,null,0,null,null,{"$f":"D1437*G1437","v":0}]
[null,"-",0,null,0,null,0,null,null,0]
[null,"-",0,null,0,null,0,null,null,0]
[null,"-",0,null,0,null,0,null,null,0]
[null,null,null,"Custo unitário total de material",{"$nulls":5},{"$f":"SUM(J1436:J1440)","v":0}]
[null,"D - ATIVIDADES AUXILIARES",null,"Quantidade","Unidade",null,"Custo Unitário","Custo Unitário"]
[null,"-",0,null,0,null,0,null,null,{"$f":"D1443*G1443","v":0}]
[null,"-",0,null,0,null,0,null,null,{"$f":"D1444*G1444","v":0}]
[null,"-",0,null,0,null,0,null,null,{"$f":"D1445*G1445","v":0}]
[null,null,null,"Custo total de atividades auxiliares",{"$nulls":5},{"$f":"SUM(J1443:J1445)","v":0}]
[{"$nulls":7},"Subtotal",null,{"$f":"J1432+J1441+J1446+J1433+J1434","v":0}]
[null,"E - TEMPO FIXO",null,"Código","Quantidade","Unidade",null,"Custo Unitário","Custo Unitário"]
[null,"-",0,"-",null,"t",null,0,null,{"$f":"ROUNDDOWN(E1449*H1449,4)","v":0}]
[null,"-",0,"-",null,"t",null,0,null,{"$f":"ROUNDDOWN(E1450*H1450,4)","v":0}]
[null,"-",0,"-",null,"t",null,0,null,0]
[null,"-",0,"-",null,"t",null,0,null,0]
[null,"-",0,"-",null,"t",null,0,null,0]
[null,"-",0,"-",null,"t",null,0,null,0]
[null,null,null,"Custo unitário total de tempo fixo",{"$nulls":5},{"$f":"SUM(J1449:J1454)","v":0}]
[null,"F - MOMENTO DE TRANSPORTE",null,"Quantidade","Unidade","DMT",null,null,null,"Custo Unitário"]
[{"$nulls":5},"LN","RP","P"]
[null,"-",0,null,"tkm"]
[null,"-",0,null,"tkm"]
[null,"-",0,null,"tkm"]
[null,"-",0,null,"tkm"]
[null,"-",0,null,"tkm"]
[null,"-",0,null,"tkm"]
[null,null,null,"Custo unitário total de transporte"]
[{"$nulls":5},"Custo unitário direto total",null,null,null,{"$f":"J1447+J1455","v":0}]
[null,"Obs."]
[]
[{"$f":"A1417+1","v":63},"1ª/GRD",{"$nulls":8},{"$f":"J1516","v":0}]
[null,"OBRA:",0]
[null,"Custo Unitário de Referência",null,null,"Minas Gerais"]
[{"$nulls":4}," Janeiro/2025 ",null,null,"Produção da equipe ",1,{"$f":"VLOOKUP(A1468,ORÇAMENTO!$A$10:$L$42,5,1)","v":"PINTURA DE FAIXA DE PEDESTRE OU ZEBRADA TINTA RETRORREFLETIVA A BASE DE RESINA ACRÍLICA COM MICROESFERAS DE VIDRO, APLICAÇÃO MANUAL"}]
[null,"SICRO",5213405,{"$nulls":5},"Valores em reais (R$)"]
[null,"A - EQUIPAMENTOS",null,"Quantidade","Utilização",null,"Custo Horário",null,null,"Custo"]
[{"$nulls":4},"Operativa","Improdutiva","Produtivo","Improdutivo",null,"Horário Total"]
[null,"-",0,null,null,null,0,0,null,{"$f":"D1475*(E1475*G1475+F1475*H1475)","v":0}]
[null,"-",0,null,null,null,0,0,null,{"$f":"D1476*(E1476*G1476+F1476*H1476)","v":0}]
[{"$nulls":7},"Custo horário total de equipamentos",null,{"$f":"SUM(J1475:J1476)","v":0}]
[null,"B - MÃO DE OBRA",null,"Quantidade","Unidade",null,"Custo Horário","Custo Horário Total"]
[null,"-",0,null,0,null,0,null,null,{"$f":"D1479*G1479","v":0}]
[null,"-",0,null,0,null,0,null,null,{"$f":"D1480*G1480","v":0}]
[null,null,null,"Custo horário total de mão de obra",{"$nulls":5},{"$f":"SUM(J1479:J1480)","v":0}]
[null,null,null,"Custo horário total de execução",{"$nulls":5},{"$f":"J1477+J1481","v":0}]
[null,null,null,"Custo unitário de execução",{"$nulls":5},{"$f":"J1482/I1471","v":0}]
[{"$nulls":7},"Custo do FIC",null,0]
[{"$nulls":7},"Custo do FIT",null,0]
[null,"C - MATERIAL",null,"Quantidade","Unidade",null,"Preço Unitário","Custo Unitário"]
[null,"-",0,null,0,null,0,null,null,{"$f":"D1487*G1487","v":0}]
[null,"-",0,null,0,null,0,null,null,{"$f":"D1488*G1488","v":0}]
[null,"-",0,null,0,null,0,null,null,0]
[null,"-",0,null,0,null,0,null,null,0]
[null,"-",0,null,0,null,0,null,null,0]
[null,null,null,"Custo unitário total de material",{"$nulls":5},{"$f":"SUM(J1487:J1491)","v":0}]
[null,"D - ATIVIDADES AUXILIARES",null,"Quantidade","Unidade",null,"Custo Unitário","Custo Unitário"]
[null,"-",0,null,0,null,0,null,null,{"$f":"D1494*G1494","v":0}]
[null,"-",0,null,0,null,0,null,null,{"$f":"D1495*G1495","v":0}]
[null,"-",0,null,0,null,0,null,null,{"$f":"D1496*G1496","v":0}]
[null,null,null,"Custo total de atividades auxiliares",{"$nulls":5},{"$f":"SUM(J1494:J1496)","v":0}]
[{"$nulls":7},"Subtotal",null,{"$f":"J1483+J1492+J1497+J1484+J1485","v":0}]
[null,"E - TEMPO FIXO",null,"Código","Quantidade","Unidade",null,"Custo Unitário","Custo Unitário"]
[null,"-",0,"-",null,"t",null,0,null,{"$f":"ROUNDDOWN(E1500*H1500,4)","v":0}]
[null,"-",0,"-",null,"t",null,0,null,{"$f":"ROUNDDOWN(E1501*H1501,4)","v":0}]
[null,"-",0,"-",null,"t",null,0,null,0]
[null,"-",0,"-",null,"t",null,0,null,0]
[null,"-",0,"-",null,"t",null,0,null,0]
[null,"-",0,"-",null,"t",null,0,null,0]
[null,null,null,"Custo unitário total de tempo fixo",{"$nulls":5},{"$f":"SUM(J1500:J1505)","v":0}]
[null,"F - MOMENTO DE TRANSPORTE",null,"Quantidade","Unidade","DMT",null,null,null,"Custo Unitário"]
[{"$nulls":5},"LN","RP","P"]
[null,"-",0,null,"tkm"]
[null,"-",0,null,"tkm"]
[null,"-",0,null,"tkm"]
[null,"-",0,null,"tkm"]
[null,"-",0,null,"tkm"]
[null,"-",0,null,"tkm"]
[null,null,null,"Custo unitário total de transporte"]
[{"$nulls":5},"Custo unitário direto total",null,null,null,{"$f":"J1498+J1506","v":0}]
[null,"Obs."]
[]
[{"$f":"A1468+1","v":64},"1ª/GRD",{"$nulls":8},{"$f":"J1567","v":0}]
[null,"OBRA:",0]
[null,"Custo Unitário de Referência",null,null,"Minas Gerais"]
[{"$nulls":4}," Janeiro/2025 ",null,null,"Produção da equipe ",1,{"$f":"VLOOKUP(A1519,ORÇAMENTO!$A$10:$L$42,5,1)","v":"PINTURA DE FAIXA DE PEDESTRE OU ZEBRADA TINTA RETRORREFLETIVA A BASE DE RESINA ACRÍLICA COM MICROESFERAS DE VIDRO, APLICAÇÃO MANUAL"}]
[null,"SICRO",5213405,{"$nulls":5},"Valores em reais (R$)"]
[null,"A - EQUIPAMENTOS",null,"Quantidade","Utilização",null,"Custo Horário",null,null,"Custo"]
[{"$nulls":4},"Operativa","Improdutiva","Produtivo","Improdutivo",null,"Horário Total"]
[null,"-",0,null,null,null,0,0,null,{"$f":"D1526*(E1526*G1526+F1526*H1526)","v":0}]
[null,"-",0,null,null,null,0,0,null,{"$f":"D1527*(E1527*G1527+F1527*H1527)","v":0}]
[{"$nulls":7},"Custo horário total de equipamentos",null,{"$f":"SUM(J1526:J1527)","v":0}]
[null,"B - MÃO DE OBRA",null,"Quantidade","Unidade",null,"Custo Horário","Custo Horário Total"]
[null,"-",0,null,0,null,0,null,null,{"$f":"D1530*G1530","v":0}]
[null,"-",0,null,0,null,0,null,null,{"$f":"D1531*G1531","v":0}]
[null,null,null,"Custo horário total de mão de obra",{"$nulls":5},{"$f":"SUM(J1530:J1531)","v":0}]
[null,null,null,"Custo horário total de execução",{"$nulls":5},{"$f":"J1528+J1532","v":0}]
[null,null,null,"Custo unitário de execução",{"$nulls":5},{"$f":"J1533/I1522","v":0}]
[{"$nulls":7},"Custo do FIC",null,0]
[{"$nulls":7},"Custo do FIT",null,0]
[null,"C - MATERIAL",null,"Quantidade","Unidade",null,"Preço Unitário","Custo Unitário"]
[null,"-",0,null,0,null,0,null,null,{"$f":"D1538*G1538","v":0}]
[null,"-",0,null,0,null,0,null,null,{"$f":"D1539*G1539","v":0}]
[null,"-",0,null,0,null,0,null,null,0]
[null,"-",0,null,0,null,0,null,null,0]
[null,"-",0,null,0,null,0,null,null,0]
[null,null,null,"Custo unitário total de material",{"$nulls":5},{"$f":"SUM(J1538:J1542)","v":0}]
[null,"D - ATIVIDADES AUXILIARES",null,"Quantidade","Unidade",null,"Custo Unitário","Custo Unitário"]
[null,"-",0,null,0,null,0,null,null,{"$f":"D1545*G1545","v":0}]
[null,"-",0,null,0,null,0,null,null,{"$f":"D1546*G1546","v":0}]
[null,"-",0,null,0,null,0,null,null,{"$f":"D1547*G1547","v":0}]
[null,null,null,"Custo total de atividades auxiliares",{"$nulls":5},{"$f":"SUM(J1545:J1547)","v":0}]
[{"$nulls":7},"Subtotal",null,{"$f":"J1534+J1543+J1548+J1535+J1536","v":0}]
[null,"E - TEMPO FIXO",null,"Código","Quantidade","Unidade",null,"Custo Unitário","Custo Unitário"]
[null,"-",0,"-",null,"t",null,0,null,{"$f":"ROUNDDOWN(E1551*H1551,4)","v":0}]
[null,"-",0,"-",null,"t",null,0,null,{"$f":"ROUNDDOWN(E1552*H1552,4)","v":0}]
[null,"-",0,"-",null,"t",null,0,null,0]
[null,"-",0,"-",null,"t",null,0,null,0]
[null,"-",0,"-",null,"t",null,0,null,0]
[null,"-",0,"-",null,"t",null,0,null,0]
[null,null,null,"Custo unitário total de tempo fixo",{"$nulls":5},{"$f":"SUM(J1551:J1556)","v":0}]
[null,"F - MOMENTO DE TRANSPORTE",null,"Quantidade","Unidade","DMT",null,null,null,"Custo Unitário"]
[{"$nulls":5},"LN","RP","P"]
[null,"-",0,null,"tkm"]
[null,"-",0,null,"tkm"]
[null,"-",0,null,"tkm"]
[null,"-",0,null,"tkm"]
[null,"-",0,null,"tkm"]
[null,"-",0,null,"tkm"]
[null,null,null,"Custo unitário total de transporte"]
[{"$nulls":5},"Custo unitário direto total",null,null,null,{"$f":"J1549+J1557","v":0}]
[null,"Obs."]
[]
[{"$f":"A1519+1","v":65},"1ª/GRD",{"$nulls":8},{"$f":"J1618","v":0}]
[null,"OBRA:",0]
[null,"Custo Unitário de Referência",null,null,"Minas Gerais"]
[{"$nulls":4}," Janeiro/2025 ",null,null,"Produção da equipe ",1,{"$f":"VLOOKUP(A1570,ORÇAMENTO!$A$10:$L$42,5,1)","v":"PINTURA DE FAIXA DE PEDESTRE OU ZEBRADA TINTA RETRORREFLETIVA A BASE DE RESINA ACRÍLICA COM MICROESFERAS DE VIDRO, APLICAÇÃO MANUAL"}]
[null,"SICRO",5213405,{"$nulls":5},"Valores em reais (R$)"]
[null,"A - EQUIPAMENTOS",null,"Quantidade","Utilização",null,"Custo Horário",null,null,"Custo"]
[{"$nulls":4},"Operativa","Improdutiva","Produtivo","Improdutivo",null,"Horário Total"]
[null,"-",0,null,null,null,0,0,null,{"$f":"D1577*(E1577*G1577+F1577*H1577)","v":0}]
[null,"-",0,null,null,null,0,0,null,{"$f":"D1578*(E1578*G1578+F1578*H1578)","v":0}]
[{"$nulls":7},"Custo horário total de equipamentos",null,{"$f":"SUM(J1577:J1578)","v":0}]
[null,"B - MÃO DE OBRA",null,"Quantidade","Unidade",null,"Custo Horário","Custo Horário Total"]
[null,"-",0,null,0,null,0,null,null,{"$f":"D1581*G1581","v":0}]
[null,"-",0,null,0,null,0,null,null,{"$f":"D1582*G1582","v":0}]
[null,null,null,"Custo horário total de mão de obra",{"$nulls":5},{"$f":"SUM(J1581:J1582)","v":0}]
[null,null,null,"Custo horário total de execução",{"$nulls":5},{"$f":"J1579+J1583","v":0}]
[null,null,null,"Custo unitário de execução",{"$nulls":5},{"$f":"J1584/I1573","v":0}]
[{"$nulls":7},"Custo do FIC",null,0]
[{"$nulls":7},"Custo do FIT",null,0]
[null,"C - MATERIAL",null,"Quantidade","Unidade",null,"Preço Unitário","Custo Unitário"]
[null,"-",0,null,0,null,0,null,null,{"$f":"D1589*G1589","v":0}]
[null,"-",0,null,0,null,0,null,null,{"$f":"D1590*G1590","v":0}]
[null,"-",0,null,0,null,0,null,null,0]
[null,"-",0,null,0,null,0,null,null,0]
[null,"-",0,null,0,null,0,null,null,0]
[null,null,null,"Custo unitário total de material",{"$nulls":5},{"$f":"SUM(J1589:J1593)","v":0}]
[null,"D - ATIVIDADES AUXILIARES",null,"Quantidade","Unidade",null,"Custo Unitário","Custo Unitário"]
[null,"-",0,null,0,null,0,null,null,{"$f":"D1596*G1596","v":0}]
[null,"-",0,null,0,null,0,null,null,{"$f":"D1597*G1597","v":0}]
[null,"-",0,null,0,null,0,null,null,{"$f":"D1598*G1598","v":0}]
[null,null,null,"Custo total de atividades auxiliares",{"$nulls":5},{"$f":"SUM(J1596:J1598)","v":0}]
[{"$nulls":7},"Subtotal",null,{"$f":"J1585+J1594+J1599+J1586+J1587","v":0}]
[null,"E - TEMPO FIXO",null,"Código","Quantidade","Unidade",null,"Custo Unitário","Custo Unitário"]
[null,"-",0,"-",null,"t",null,0,null,{"$f":"ROUNDDOWN(E1602*H1602,4)","v":0}]
[null,"-",0,"-",null,"t",null,0,null,{"$f":"ROUNDDOWN(E1603*H1603,4)","v":0}]
[null,"-",0,"-",null,"t",null,0,null,0]
[null,"-",0,"-",null,"t",null,0,null,0]
[null,"-",0,"-",null,"t",null,0,null,0]
[null,"-",0,"-",null,"t",null,0,null,0]
[null,null,null,"Custo unitário total de tempo fixo",{"$nulls":5},{"$f":"SUM(J1602:J1607)","v":0}]
[null,"F - MOMENTO DE TRANSPORTE",null,"Quantidade","Unidade","DMT",null,null,null,"Custo Unitário"]
[{"$nulls":5},"LN","RP","P"]
[null,"-",0,null,"tkm"]
[null,"-",0,null,"tkm"]
[null,"-",0,null,"tkm"]
[null,"-",0,null,"tkm"]
[null,"-",0,null,"tkm"]
[null,"-",0,null,"tkm"]
[null,null,null,"Custo unitário total de transporte"]
[{"$nulls":5},"Custo unitário direto total",null,null,null,{"$f":"J1600+J1608","v":0}]
[null,"Obs."]
[]
[{"$f":"A1570+1","v":66},"1ª/GRD",{"$nulls":8},{"$f":"J1669","v":0}]
[null,"OBRA:",0]
[null,"Custo Unitário de Referência",null,null,"Minas Gerais"]
[{"$nulls":4}," Janeiro/2025 ",null,null,"Produção da equipe ",1,{"$f":"VLOOKUP(A1621,ORÇAMENTO!$A$10:$L$42,5,1)","v":"PINTURA DE FAIXA DE PEDESTRE OU ZEBRADA TINTA RETRORREFLETIVA A BASE DE RESINA ACRÍLICA COM MICROESFERAS DE VIDRO, APLICAÇÃO MANUAL"}]
[null,"SICRO",5213405,{"$nulls":5},"Valores em reais (R$)"]
[null,"A - EQUIPAMENTOS",null,"Quantidade","Utilização",null,"Custo Horário",null,null,"Custo"]
[{"$nulls":4},"Operativa","Improdutiva","Produtivo","Improdutivo",null,"Horário Total"]
[null,"-",0,null,null,null,0,0,null,{"$f":"D1628*(E1628*G1628+F1628*H1628)","v":0}]
[null,"-",0,null,null,null,0,0,null,{"$f":"D1629*(E1629*G1629+F1629*H1629)","v":0}]
[{"$nulls":7},"Custo horário total de equipamentos",null,{"$f":"SUM(J1628:J1629)","v":0}]
[null,"B - MÃO DE OBRA",null,"Quantidade","Unidade",null,"Custo Horário","Custo Horário Total"]
[null,"-",0,null,0,null,0,null,null,{"$f":"D1632*G1632","v":0}]
[null,"-",0,null,0,null,0,null,null,{"$f":"D1633*G1633","v":0}]
[null,null,null,"Custo horário total de mão de obra",{"$nulls":5},{"$f":"SUM(J1632:J1633)","v":0}]
[null,null,null,"Custo horário total de execução",{"$nulls":5},{"$f":"J1630+J1634","v":0}]
[null,null,null,"Custo unitário de execução",{"$nulls":5},{"$f":"J1635/I1624","v":0}]
[{"$nulls":7},"Custo do FIC",null,0]
[{"$nulls":7},"Custo do FIT",null,0]
[null,"C - MATERIAL",null,"Quantidade","Unidade",null,"Preço Unitário","Custo Unitário"]
[null,"-",0,null,0,null,0,null,null,{"$f":"D1640*G1640","v":0}]
[null,"-",0,null,0,null,0,null,null,{"$f":"D1641*G1641","v":0}]
[null,"-",0,null,0,null,0,null,null,0]
[null,"-",0,null,0,null,0,null,null,0]
[null,"-",0,null,0,null,0,null,null,0]
[null,null,null,"Custo unitário total de material",{"$nulls":5},{"$f":"SUM(J1640:J1644)","v":0}]
[null,"D - ATIVIDADES AUXILIARES",null,"Quantidade","Unidade",null,"Custo Unitário","Custo Unitário"]
[null,"-",0,null,0,null,0,null,null,{"$f":"D1647*G1647","v":0}]
[null,"-",0,null,0,null,0,null,null,{"$f":"D1648*G1648","v":0}]
[null,"-",0,null,0,null,0,null,null,{"$f":"D1649*G1649","v":0}]
[null,null,null,"Custo total de atividades auxiliares",{"$nulls":5},{"$f":"SUM(J1647:J1649)","v":0}]
[{"$nulls":7},"Subtotal",null,{"$f":"J1636+J1645+J1650+J1637+J1638","v":0}]
[null,"E - TEMPO FIXO",null,"Código","Quantidade","Unidade",null,"Custo Unitário","Custo Unitário"]
[null,"-",0,"-",null,"t",null,0,null,{"$f":"ROUNDDOWN(E1653*H1653,4)","v":0}]
[null,"-",0,"-",null,"t",null,0,null,{"$f":"ROUNDDOWN(E1654*H1654,4)","v":0}]
[null,"-",0,"-",null,"t",null,0,null,0]
[null,"-",0,"-",null,"t",null,0,null,0]
[null,"-",0,"-",null,"t",null,0,null,0]
[null,"-",0,"-",null,"t",null,0,null,0]
[null,null,null,"Custo unitário total de tempo fixo",{"$nulls":5},{"$f":"SUM(J1653:J1658)","v":0}]
[null,"F - MOMENTO DE TRANSPORTE",null,"Quantidade","Unidade","DMT",null,null,null,"Custo Unitário"]
[{"$nulls":5},"LN","RP","P"]
[null,"-",0,null,"tkm"]
[null,"-",0,null,"tkm"]
[null,"-",0,null,"tkm"]
[null,"-",0,null,"tkm"]
[null,"-",0,null,"tkm"]
[null,"-",0,null,"tkm"]
[null,null,null,"Custo unitário total de transporte"]
[{"$nulls":5},"Custo unitário direto total",null,null,null,{"$f":"J1651+J1659","v":0}]
[null,"Obs."]
[]
[{"$f":"A1621+1","v":67},"1ª/GRD",{"$nulls":8},{"$f":"J1720","v":0}]
[null,"OBRA:",0]
[null,"Custo Unitário de Referência",null,null,"Minas Gerais"]
[{"$nulls":4}," Janeiro/2025 ",null,null,"Produção da equipe ",1,{"$f":"VLOOKUP(A1672,ORÇAMENTO!$A$10:$L$42,5,1)","v":"PINTURA DE FAIXA DE PEDESTRE OU ZEBRADA TINTA RETRORREFLETIVA A BASE DE RESINA ACRÍLICA COM MICROESFERAS DE VIDRO, APLICAÇÃO MANUAL"}]
[null,"SICRO",5213405,{"$nulls":5},"Valores em reais (R$)"]
[null,"A - EQUIPAMENTOS",null,"Quantidade","Utilização",null,"Custo Horário",null,null,"Custo"]
[{"$nulls":4},"Operativa","Improdutiva","Produtivo","Improdutivo",null,"Horário Total"]
[null,"-",0,null,null,null,0,0,null,{"$f":"D1679*(E1679*G1679+F1679*H1679)","v":0}]
[null,"-",0,null,null,null,0,0,null,{"$f":"D1680*(E1680*G1680+F1680*H1680)","v":0}]
[{"$nulls":7},"Custo horário total de equipamentos",null,{"$f":"SUM(J1679:J1680)","v":0}]
[null,"B - MÃO DE OBRA",null,"Quantidade","Unidade",null,"Custo Horário","Custo Horário Total"]
[null,"-",0,null,0,null,0,null,null,{"$f":"D1683*G1683","v":0}]
[null,"-",0,null,0,null,0,null,null,{"$f":"D1684*G1684","v":0}]
[null,null,null,"Custo horário total de mão de obra",{"$nulls":5},{"$f":"SUM(J1683:J1684)","v":0}]
[null,null,null,"Custo horário total de execução",{"$nulls":5},{"$f":"J1681+J1685","v":0}]
[null,null,null,"Custo unitário de execução",{"$nulls":5},{"$f":"J1686/I1675","v":0}]
[{"$nulls":7},"Custo do FIC",null,0]
[{"$nulls":7},"Custo do FIT",null,0]
[null,"C - MATERIAL",null,"Quantidade","Unidade",null,"Preço Unitário","Custo Unitário"]
[null,"-",0,null,0,null,0,null,null,{"$f":"D1691*G1691","v":0}]
[null,"-",0,null,0,null,0,null,null,{"$f":"D1692*G1692","v":0}]
[null,"-",0,null,0,null,0,null,null,0]
[null,"-",0,null,0,null,0,null,null,0]
[null,"-",0,null,0,null,0,null,null,0]
[null,null,null,"Custo unitário total de material",{"$nulls":5},{"$f":"SUM(J1691:J1695)","v":0}]
[null,"D - ATIVIDADES AUXILIARES",null,"Quantidade","Unidade",null,"Custo Unitário","Custo Unitário"]
[null,"-",0,null,0,null,0,null,null,{"$f":"D1698*G1698","v":0}]
[null,"-",0,null,0,null,0,null,null,{"$f":"D1699*G1699","v":0}]
[null,"-",0,null,0,null,0,null,null,{"$f":"D1700*G1700","v":0}]
[null,null,null,"Custo total de atividades auxiliares",{"$nulls":5},{"$f":"SUM(J1698:J1700)","v":0}]
[{"$nulls":7},"Subtotal",null,{"$f":"J1687+J1696+J1701+J1688+J1689","v":0}]
[null,"E - TEMPO FIXO",null,"Código","Quantidade","Unidade",null,"Custo Unitário","Custo Unitário"]
[null,"-",0,"-",null,"t",null,0,null,{"$f":"ROUNDDOWN(E1704*H1704,4)","v":0}]
[null,"-",0,"-",null,"t",null,0,null,{"$f":"ROUNDDOWN(E1705*H1705,4)","v":0}]
[null,"-",0,"-",null,"t",null,0,null,0]
[null,"-",0,"-",null,"t",null,0,null,0]
[null,"-",0,"-",null,"t",null,0,null,0]
[null,"-",0,"-",null,"t",null,0,null,0]
[null,null,null,"Custo unitário total de tempo fixo",{"$nulls":5},{"$f":"SUM(J1704:J1709)","v":0}]
[null,"F - MOMENTO DE TRANSPORTE",null,"Quantidade","Unidade","DMT",null,null,null,"Custo Unitário"]
[{"$nulls":5},"LN","RP","P"]
[null,"-",0,null,"tkm"]
[null,"-",0,null,"tkm"]
[null,"-",0,null,"tkm"]
[null,"-",0,null,"tkm"]
[null,"-",0,null,"tkm"]
[null,"-",0,null,"tkm"]
[null,null,null,"Custo unitário total de transporte"]
[{"$nulls":5},"Custo unitário direto total",null,null,null,{"$f":"J1702+J1710","v":0}]
[null,"Obs."]

{"sheet":"CPU-FORNEC","index":2,"n_rows":92,"n_cols":14,"rows_kept":92,"cut":false,"hidden":false,"merged":[[81,1,81,7],[82,0,91,0],[82,1,82,3],[82,4,82,7],[83,2,83,5],[84,2,84,3],[85,1,85,7],[88,1,88,3],[88,5,88,6],[89,1,89,6],[90,1,90,6],[91,1,91,6],[60,0,69,0],[60,1,60,3],[60,4,60,7],[61,2,61,5],[62,2,62,3],[63,1,63,7],[66,1,66,3],[66,5,66,6],[67,1,67,6],[68,1,68,6],[69,1,69,6],[38,0,47,0],[38,1,38,3],[38,4,38,7],[39,2,39,5],[40,2,40,3],[41,1,41,7],[44,1,44,3],[44,5,44,6],[45,1,45,6],[46,1,46,6],[47,1,47,6],[22,5,22,6],[23,1,23,6],[24,1,24,6],[25,1,25,6],[5,1,5,7],[9,1,9,7],[13,1,13,7],[17,1,17,7],[0,10,0,11],[1,2,1,5],[1,10,1,11],[2,2,2,3],[3,1,3,7],[27,4,27,7],[28,2,28,5],[27,0,36,0],[29,2,29,3],[30,1,30,7],[33,1,33,3],[33,5,33,6],[34,1,34,6],[35,1,35,6],[36,1,36,6],[0,0,26,0],[0,1,0,3],[0,4,0,7],[22,1,22,3],[49,0,58,0],[49,1,49,3],[49,4,49,7],[50,2,50,5],[51,2,51,3],[52,1,52,7],[55,1,55,3],[55,5,55,6],[56,1,56,6],[57,1,57,6],[58,1,58,6],[27,1,27,3],[71,0,80,0],[71,1,71,3],[71,4,71,7],[72,2,72,5],[73,2,73,3],[74,1,74,7],[77,1,77,3],[77,5,77,6],[78,1,78,6],[79,1,79,6],[80,1,80,6]]}
[1,"CODEVASF",null,null," COMPOSIÇÃO DE PREÇO UNITÁRIO",null,null,null,{"$f":"H24","v":0},{"$f":"H26","v":0},"BDI CALCULADO:",null,{"$f":"ORÇAMENTO!L5","v":24.67}]
[null,"OBRA:  "," PAVIMENTAÇÃO ASFÁLTICA EM CBUQ - VIAS URBANAS DIVERSAS - DISTRITO  DE CONCEIÇÃO DE TEIXEIRAS (AUGUSTO DE LIMA / MG)",null,null,null,"DATA: ",{"$f":"ORÇAMENTO!C6","v":" ABRIL / 2025"},null,null,"BDI DIFERENCIADO:",null,{"$f":"'BDI FORN'!D31/100","v":0.15}]
[null,"SERVIÇO:  ","CPU.1",null,"Referência:","CODEVASF","UNIDADE: ",{"$f":"VLOOKUP(A1,ORÇAMENTO!A11:L30,5)","v":"MOBILIZAÇÃO E DESMOBILIZAÇÃO"}]
[]
[null,"TIPO ITEM","CODIGO ITEM","DESCRIÇÃO ITEM","UNIDADE ITEM","COEFICIENTE","PRECO UNITARIO","CUSTO TOTAL",null,"distancia =",90,"B.DESPACHO"]
[null,"EQUIPAMENTOS",{"$nulls":7},"Pá carregadeira ",null,null,10.1," ton"]
[null,null,"E9001","E9001","E9001",null,"E9001"]
[]
[]
[null,"MÃO DE OBRA"]
[]
[]
[]
[null,"MATERIAIS"]
[]
[]
[{"$nulls":7},{"$f":"ROUNDDOWN(F17*G17,2)","v":0},null,"Motoniveladora ",null,null,12.47," ton"]
[null,"ATIVIDADES AUXILIARES",{"$nulls":7},"Trator de pneus",null,null,2.8," ton"]
[{"$nulls":7},{"$f":"ROUNDDOWN(F19*G19,2)","v":0}]
[{"$nulls":7},0]
[{"$nulls":7},0]
[{"$nulls":7},{"$f":"ROUNDDOWN(F22*G22,2)","v":0},null,"Rolo Compactador ",null,null,15.33," ton"]
[null,"PRODUÇÃO DA EQUIPE",null,null,1,"CUSTO ",null,{"$f":"SUM(H6:H22)","v":0},null,"Grade de disco",null,null,1," ton"]
[null,"TOTAL",{"$nulls":5},{"$f":"H23/E23","v":0},"OK","RETROESCAVADEIRA",null,null,6.67," ton"]
[null,"BDI                %",{"$nulls":5},{"$f":"1+$M$1","v":25.67}]
[null,"TOTAL DO SERVIÇO - R$",{"$nulls":5},{"$f":"ROUND(H24*H25,2)","v":0}]
[]
["F1","CODEVASF",null,null," COMPOSIÇÃO DE PREÇO UNITÁRIO",null,null,null,{"$f":"H35","v":3189.94},{"$f":"H37","v":3668.43}]
[null,"OBRA:  "," PAVIMENTAÇÃO ASFÁLTICA EM CBUQ - VIAS URBANAS DIVERSAS - DISTRITO  DE CONCEIÇÃO DE TEIXEIRAS (AUGUSTO DE LIMA / MG)",null,null,null,"DATA: ",{"$f":"$H$2","v":" ABRIL / 2025"}]
[null,"SERVIÇO:  ","AQUISIÇÃO DE EMULSÃO ASFÁLTICA PARA IMPRIMAÇÃO (EAI) - EXCLUSIVE TRANSPORTE",null,"Referência:","CPU.7","UNIDADE: ",{"$f":"VLOOKUP(A28,ORÇAMENTO!$A$11:$L$49,7)","v":"T"}]
[]
[null,"TIPO ITEM","CODIGO ITEM","DESCRIÇÃO ITEM","UNIDADE ITEM","COEFICIENTE","PRECO UNITARIO","CUSTO TOTAL"]
[null,"INSUMO","ANP","EMULSÃO ASFÁLTICA PARA SERVIÇO DE IMPRIMAÇÃO (MEMÓRIA EM ANEXO)","T",1,3189.9460041300972,{"$f":"ROUNDDOWN(F33*G33,2)","v":3189.94}]
[null,"PRODUÇÃO DA EQUIPE",null,null,1,"CUSTO ",null,{"$f":"SUM(H33:H33)","v":3189.94}]
[null,"TOTAL",{"$nulls":5},{"$f":"H34/E34","v":3189.94}]
[null,"BDI                %",{"$nulls":5},{"$f":"1+$M$2","v":1.1499999999999999}]
[null,"TOTAL DO SERVIÇO - R$",{"$nulls":5},{"$f":"ROUND(H35*H36,2)","v":3668.43},"OK"]
[]
["F2","CODEVASF",null,null," COMPOSIÇÃO DE PREÇO UNITÁRIO",null,null,null,{"$f":"H46","v":198.11},{"$f":"H48","v":227.83}]
[null,"OBRA:  "," PAVIMENTAÇÃO ASFÁLTICA EM CBUQ - VIAS URBANAS DIVERSAS - DISTRITO  DE CONCEIÇÃO DE TEIXEIRAS (AUGUSTO DE LIMA / MG)",null,null,null,"DATA: ",{"$f":"$H$2","v":" ABRIL / 2025"}]
[null,"SERVIÇO:  ","TRANSPORTE DE EMULSÃO ASFÁLTICA PARA IMPRIMAÇÃO (EAI)",null,"Referência:","CPU.8","UNIDADE: ",{"$f":"VLOOKUP(A39,ORÇAMENTO!$A$11:$L$49,7)","v":"T"}]
[]
[null,"TIPO ITEM","CODIGO ITEM","DESCRIÇÃO ITEM","UNIDADE ITEM","COEFICIENTE","PRECO UNITARIO","CUSTO TOTAL"]
[null,"INSUMO"," - ","TRANSPORTE DE EMULSÃO ASFÁLTICA PARA IMPRIMAÇÃO (EAI), INCLUINDO CUSTO TOTAL DO TRANSPORTE (COMBUSTÍVEL, PEDÁGIOS, ETC.) E ICMS - MEMÓRIA ANEXA","T",1,198.1121052631579,{"$f":"ROUNDDOWN(F44*G44,2)","v":198.11}]
[null,"PRODUÇÃO DA EQUIPE",null,null,1,"CUSTO ",null,{"$f":"SUM(H44:H44)","v":198.11}]
[null,"TOTAL",{"$nulls":5},{"$f":"H45/E45","v":198.11}]
[null,"BDI                %",{"$nulls":5},{"$f":"1+$M$2","v":1.1499999999999999}]
[null,"TOTAL DO SERVIÇO - R$",{"$nulls":5},{"$f":"ROUND(H46*H47,2)","v":227.83},"OK"]
[]
["F3","CODEVASF",null,null," COMPOSIÇÃO DE PREÇO UNITÁRIO",null,null,null,{"$f":"H57","v":3510.21},{"$f":"H59","v":4036.74}]
[null,"OBRA:  "," PAVIMENTAÇÃO ASFÁLTICA EM CBUQ - VIAS URBANAS DIVERSAS - DISTRITO  DE CONCEIÇÃO DE TEIXEIRAS (AUGUSTO DE LIMA / MG)",null,null,null,"DATA: ",{"$f":"$H$2","v":" ABRIL / 2025"}]
[null,"SERVIÇO:  ","AQUISIÇÃO DE EMULSAO ASFALTICA CATIONICA RR-1C - EXCLUSIVE TRANSPORTE",null,"Referência:","CPU.9","UNIDADE: ",{"$f":"VLOOKUP(A50,ORÇAMENTO!$A$11:$L$49,7)","v":"T"}]
[]
[null,"TIPO ITEM","CODIGO ITEM","DESCRIÇÃO ITEM","UNIDADE ITEM","COEFICIENTE","PRECO UNITARIO","CUSTO TOTAL"]
[null,"INSUMO","ANP","EMULSÃO ASFÁLTICA CATIÔNICA RR-1C(MEMÓRIA EM ANEXO)","T",1,3510.2129251456049,{"$f":"ROUNDDOWN(F55*G55,2)","v":3510.21}]
[null,"PRODUÇÃO DA EQUIPE",null,null,1,"CUSTO ",null,{"$f":"SUM(H55:H55)","v":3510.21}]
[null,"TOTAL",{"$nulls":5},{"$f":"H56/E56","v":3510.21},"OK"]
[null,"BDI                %",{"$nulls":5},{"$f":"1+$M$2","v":1.1499999999999999}]
[null,"TOTAL DO SERVIÇO - R$",{"$nulls":5},{"$f":"ROUND(H57*H58,2)","v":4036.74}]
[]
["F4","CODEVASF",null,null," COMPOSIÇÃO DE PREÇO UNITÁRIO",null,null,null,{"$f":"H68","v":224.56},{"$f":"H70","v":258.24}]
[null,"OBRA:  "," PAVIMENTAÇÃO ASFÁLTICA EM CBUQ - VIAS URBANAS DIVERSAS - DISTRITO  DE CONCEIÇÃO DE TEIXEIRAS (AUGUSTO DE LIMA / MG)",null,null,null,"DATA: ",{"$f":"$H$2","v":" ABRIL / 2025"}]
[null,"SERVIÇO:  ","TRANSPORTE DE EMULSÃO ASFÁLTICA CATIONICA RR-1C",null,"Referência:","CPU.10","UNIDADE: ",{"$f":"VLOOKUP(A61,ORÇAMENTO!$A$11:$L$49,7)","v":"T"}]
[]
[null,"TIPO ITEM","CODIGO ITEM","DESCRIÇÃO ITEM","UNIDADE ITEM","COEFICIENTE","PRECO UNITARIO","CUSTO TOTAL"]
[null,"INSUMO"," - ","TRANSPORTE DE EMULSÃO ASFÁLTICA CATIONICA TIPO RR-1C, INCLUINDO CUSTO TOTAL DO TRANSPORTE (COMBUSTÍVEL, PEDÁGIOS, ETC.) E ICMS - MEMÓRIA ANEXA","T",1,224.56,{"$f":"ROUNDDOWN(F66*G66,2)","v":224.56}]
[null,"PRODUÇÃO DA EQUIPE",null,null,1,"CUSTO ",null,{"$f":"SUM(H66:H66)","v":224.56}]
[null,"TOTAL",{"$nulls":5},{"$f":"H67/E67","v":224.56},"OK"]
[null,"BDI                %",{"$nulls":5},{"$f":"1+$M$2","v":1.1499999999999999}]
[null,"TOTAL DO SERVIÇO - R$",{"$nulls":5},{"$f":"ROUND(H68*H69,2)","v":258.24}]
[]
["F5","CODEVASF",null,null," COMPOSIÇÃO DE PREÇO UNITÁRIO",null,null,null,{"$f":"H79","v":4816.4799999999996},{"$f":"H81","v":5538.95}]
[null,"OBRA:  "," PAVIMENTAÇÃO ASFÁLTICA EM CBUQ - VIAS URBANAS DIVERSAS - DISTRITO  DE CONCEIÇÃO DE TEIXEIRAS (AUGUSTO DE LIMA / MG)",null,null,null,"DATA: ",{"$f":"$H$2","v":" ABRIL / 2025"}]
[null,"SERVIÇO:  ","AQUISIÇÃO DE CONCRETO ASFÁLTICO DE PETRÓLEO - CAP 50/70 - EXCLUSIVE TRANSPORTE",null,"Referência:","CPU.11","UNIDADE: ",{"$f":"VLOOKUP(A72,ORÇAMENTO!$A$11:$L$49,7)","v":"T"}]
[]
[null,"TIPO ITEM","CODIGO ITEM","DESCRIÇÃO ITEM","UNIDADE ITEM","COEFICIENTE","PRECO UNITARIO","CUSTO TOTAL"]
[null,"INSUMO",1518,"CIMENTOS ASFÁLTICO DE PETRÓLEO TIPO CAP 50/70 (MEMÓRIA EM ANEXO)","T",1,4816.4872247825624,{"$f":"ROUNDDOWN(F77*G77,2)","v":4816.4799999999996}]
[null,"PRODUÇÃO DA EQUIPE",null,null,1,"CUSTO ",null,{"$f":"SUM(H77:H77)","v":4816.4799999999996}]
[null,"TOTAL",{"$nulls":5},{"$f":"H78/E78","v":4816.4799999999996}]
[null,"BDI                %",{"$nulls":5},{"$f":"1+$M$2","v":1.1499999999999999}]
[null,"TOTAL DO SERVIÇO - R$",{"$nulls":5},{"$f":"ROUND(H79*H80,2)","v":5538.95}]
[]
["F6","CODEVASF",null,null," COMPOSIÇÃO DE PREÇO UNITÁRIO",null,null,null,{"$f":"H90","v":388.33},{"$f":"H92","v":446.58}]
[null,"OBRA:  "," PAVIMENTAÇÃO ASFÁLTICA EM CBUQ - VIAS URBANAS DIVERSAS - DISTRITO  DE CONCEIÇÃO DE TEIXEIRAS (AUGUSTO DE LIMA / MG)",null,null,null,"DATA: ",{"$f":"$H$2","v":" ABRIL / 2025"}]
[null,"SERVIÇO:  ","TRANSPORTE DE CONCRETO ASFÁLTICO DE PETRÓLEO - CAP 50/70",null,"Referência:","CPU.12","UNIDADE: ",{"$f":"VLOOKUP(A83,ORÇAMENTO!$A$11:$L$49,7)","v":"T"}]
[]
[null,"TIPO ITEM","CODIGO ITEM","DESCRIÇÃO ITEM","UNIDADE ITEM","COEFICIENTE","PRECO UNITARIO","CUSTO TOTAL"]
[null,"INSUMO"," - ","TRANSPORTE DE CIMENTO ASFÁLTICO DE PETRÓLEO TIPO CAP 50-70, INCLUINDO CUSTO TOTAL DO TRANSPORTE (COMBUSTÍVEL, PEDÁGIOS, ETC.) E ICMS - MEMÓRIA ANEXA","T",1,388.33571428571423,{"$f":"ROUNDDOWN(F88*G88,2)","v":388.33}]
[null,"PRODUÇÃO DA EQUIPE",null,null,1,"CUSTO ",null,{"$f":"SUM(H88:H88)","v":388.33}]
[null,"TOTAL",{"$nulls":5},{"$f":"H89/E89","v":388.33}]
[null,"BDI                %",{"$nulls":5},{"$f":"1+$M$2","v":1.1499999999999999}]
[null,"TOTAL DO SERVIÇO - R$",{"$nulls":5},{"$f":"ROUND(H90*H91,2)","v":446.58}]

{"sheet":"BDI SERV","index":3,"n_rows":60,"n_cols":5,"rows_kept":60,"cut":false,"hidden":false,"merged":[[35,0,35,5],[36,0,36,5],[38,1,38,4],[39,2,39,3],[0,1,2,4],[25,1,25,3],[26,1,26,2],[26,3,26,4],[27,3,27,4]]}
[null,"DETALHAMENTO DO BDI - SERVIÇOS"]
[]
[]
[null,"Item","Descrição dos Serviços","% - PV","% - CD"]
[]
[null,1,"ADMINISTRAÇÃO CENTRAL"," ",{"$f":"SUM(E7:E9)","v":4.01}]
[null,"1.1","ESCRITÓRIO CENTRAL",null,4.01]
[null,"1.2","VIAGENS"]
[null,"1.3","OUTROS"]
[null," "," "," "," "]
[null,2,"IMPOSTOS E TAXAS",{"$f":"SUM(D12:D15)","v":8.65},{"$f":"SUM(E12:E15)","v":0}]
[null,"2.1","ISS - Proposta",{"$f":"D34*100","v":5}]
[null,"2.2","PIS",0.65]
[null,"2.3","Cofins",3]
[null,"2.4","Contribuição Previdenciaria (CPRB)"]
[]
[null,3,"TAXA DE RISCO",null,{"$f":"SUM(E18:E20)","v":0.96}]
[null,"3.1","SEGURO",null,0.2]
[null,"3.2","RISCO",null,0.56000000000000005]
[null,"3.3","GARANTIA",null,0.2]
[]
[null,4,"DESPESAS FINANCEIRAS",null,1.1100000000000001]
[]
[null,5,"LUCRO",null,7.3]
[]
[null,"BDI APRESENTADO:",null,null,{"$f":"IF($D$41=$C$43,$D$43,IF($D$41=$C$44,$D$44,IF($D$41=$C$44,$D$44,IF($D$41=$C$45,$D$45,0))))","v":24.67}]
[]
[null,null,"Legislação Municipal:","Lei Complementar nº 30/2019"]
[null,null,"Município:","Augusto de Lima"]
[null,null,"Alíquota ISSQN:",0.05,"Município"]
[null,null,"Base de Cálculo:",1,"Art.252"]
[null,null,"Valor Serviço:",1189110.05]
[null,null,"Dedução - Material (estimado):",0,{"$f":"D33/D32","v":0}]
[null,null,"ISSQN BDI:",{"$f":"IF(D32=\"\",0,ROUND(IF(D31=D49,((1-(D33/D32))*D30),D30*D31),4))","v":0.05},"(*)"]
[]
["Acórdão nº 2.622/2013 - TCU Plenário"]
["BDI = ARRED((((((1+(AC+TR)/100)*(1+DF/100)*(1+L/100))/(1-IMP/100))-1)*100);2)"]
[]
[null,"(*) É obrigação da licitante a verificação da Legislação Tributária vigente no município, bem como o cálculo dos valores totais de serviços e materiais estimados, para apresentação de sua proposta."]
[]
[null,null,"Forma de Cálculo do BDI:","BDI - Acórdão nº 2.622/2013 - TCU"]
[]
[null,null,"BDI - Digitado",{"$f":"ROUND(E6+E11+E17+E22+E24,2)","v":13.38}]
[null,null,"BDI - Calculado",{"$f":"ROUND((((1+(E6/100+E22/100+E17/100))/(1-(D11/100+E24/100)))-1)*100,2)","v":26.21}]
[null,null,"BDI - Acórdão nº 2.622/2013 - TCU",{"$f":"ROUND((((((1+(E6+E17)/100)*(1+E22/100)*(1+E24/100))/(1-D11/100))-1)*100),2)","v":24.67}]
[]
[]
[]
[null,null,null,"Dedução - Material","Município"]
[null,null,null,0.1,"Simples Nacional"]
[null,null,null,0.2,"Municípios Indefinidos"]
[null,null,null,0.3]
[null,null,null,0.4]
[null,null,null,0.5]
[null,null,null,0.6]
[null,null,null,0.7]
[null,null,null,0.8]
[null,null,null,0.9]
[null,null,null,1]
[null,null,null,{"$f":"E31","v":"Art.252"}]

{"sheet":"BDI FORN","index":4,"n_rows":37,"n_cols":5,"rows_kept":37,"cut":false,"hidden":false,"merged":[[31,1,31,2],[32,0,34,5],[36,0,36,5],[0,1,2,4],[3,1,4,1],[3,2,4,2],[28,0,28,5],[30,1,30,2]]}
[null,"DETALHAMENTO DO BDI - FORNECIMENTO \n(MATERIAL ASFÁLTICO)"]
[]
[]
[null,"Item","Descrição dos Serviços","%","%"]
[null,null,null,"PV","CD"]
[]
[null,1,"ADMINISTRAÇÃO CENTRAL"," ",3.45]
[null,"1.1","ESCRITÓRIO CENTRAL"," "," "]
[null,"1.2","VIAGENS"," "," "]
[null,"1.3","OUTROS"," "," "]
[null," "," "," "," "]
[null,2,"IMPOSTOS E TAXAS",{"$f":"SUM(D13:D16)","v":3.65},{"$f":"SUM(E13:E16)","v":4.5600000000000005}]
[null,"2.1","ISS (*)",null,{"$f":"ROUND(D13*1.2515,2)","v":0}]
[null,"2.2","PIS",0.65,{"$f":"ROUND(D14*1.2515,2)","v":0.81}]
[null,"2.3","Cofins",3,{"$f":"ROUND(D15*1.2515,2)","v":3.75}]
[null,"2.4","CONTRIBUIÇÃO PREVIDENCIÁRIA SOBRE A RENDA BRUTA",0,{"$f":"ROUND(D16*1.2515,2)","v":0}]
[]
[null,3,"TAXA DE RISCO"," ",{"$f":"SUM(E19:E22)","v":1.08}]
[null,"3.1","SEGURO",null,0.24]
[null,"3.2","RISCO",null,0.6]
[null,"3.3","GARANTIA",null,0.24]
[]
[null,4,"DESPESAS FINANCEIRAS"," ",0.85]
[]
[null,5,"LUCRO",null,5.1100000000000003]
[]
[null," ","BDI - CALCULADO"," ",{"$f":"ROUND((((1+(E7+E18)/100)*(1+E23/100)*(1+E25/100)/(1-D12/100)-1)*100),2)","v":15}]
[]
["BDI = ((1+((AC+S+R+G)/100))x(1+DF/100)x(1+L/100)/(1-I/100)-1)*100"]
[]
[null,"BDI (CALCULADO):",null,{"$f":"ROUND((((1+((E7+E18)/100))*(1+E23/100)*(1+E25/100))/(1-D12/100)-1)*100,2)","v":15},"%"]
[null," "]
[]
[]
[]
[]
["BDI EM CONFORMIDADE COM OS ACÓRDÃOS Nº 2369/2011 e ACÓRDÃO Nº 2.622/2013 - TCU - PLENÁRIO"]

{"sheet":"CRONOGRAMA","index":5,"n_rows":19,"n_cols":12,"rows_kept":19,"cut":false,"hidden":false,"merged":[[0,1,0,11],[1,1,2,1],[1,2,2,4],[1,6,1,11],[2,6,2,11],[9,0,10,0],[9,1,10,1],[9,2,10,2],[3,1,3,10],[5,0,6,0],[5,1,6,1],[5,2,6,2],[7,0,8,0],[7,1,8,1],[7,2,8,2],[15,1,16,2],[18,1,22,11],[11,0,12,0],[11,1,12,1],[11,2,12,2],[13,0,14,0],[13,1,14,1],[13,2,14,2]]}
[null,"CRONOGRAMA FÍSICO-FINANCEIRO"]
[null,"OBRA: ",{"$f":"ORÇAMENTO!C5","v":" PAVIMENTAÇÃO ASFÁLTICA EM CBUQ - VIAS URBANAS DIVERSAS - DISTRITO  DE CONCEIÇÃO DE TEIXEIRAS (AUGUSTO DE LIMA / MG)"},null,null,"VALOR:",{"$f":"ORÇAMENTO!L42","v":1999276.8}]
[{"$nulls":5},"PRAZO: ","180 DIAS "]
[]
[null,"ITEM","ETAPAS/DESCRIÇAO","FISICO/  FINANCEIRO","TOTAL    ETAPAS","MÊS 1","MÊS 2","MÊS 3","MÊS 4","MÊS 5","MÊS 6","TOTAL"]
["A",{"$f":"VLOOKUP(A6,ORÇAMENTO!$A$10:$L$42,2)","v":1},{"$f":"VLOOKUP(A6,ORÇAMENTO!$A$10:$L$42,5)","v":"SERVIÇOS PRELIMINARES "},"FISICO ",{"$f":"ROUND(E7/$G$2,4)","v":9.2799999999999994E-2},0.25,0.15,0.15,0.15,0.15,0.15,{"$f":"SUM(F6:K6)","v":1}]
[null,null,null,"FINANCEIRO",{"$f":"ORÇAMENTO!L10","v":185550.09000000003},{"$f":"ROUND($E$7*F6,2)","v":46387.519999999997},{"$f":"ROUND($E$7*G6,2)","v":27832.51},{"$f":"ROUND($E$7*H6,2)","v":27832.51},{"$f":"ROUND($E$7*I6,2)","v":27832.51},27832.51,27832.51,{"$f":"SUM(F7:K7)","v":185550.07}]
["B",{"$f":"VLOOKUP(A8,ORÇAMENTO!$A$10:$L$42,2)","v":2},{"$f":"VLOOKUP(A8,ORÇAMENTO!$A$10:$L$42,5)","v":"TERRAPLANAGEM E PAVIMENTAÇÃO"},"FISICO ",{"$f":"ROUND(E9/$G$2,4)","v":0.19919999999999999},0.1,0.2,0.2,0.2,0.2,0.1,{"$f":"SUM(F8:K8)","v":0.99999999999999989}]
[null,null,null,"FINANCEIRO",{"$f":"ORÇAMENTO!L16","v":398255.9},{"$f":"ROUND($E$9*F8,2)","v":39825.589999999997},{"$f":"ROUND($E$9*G8,2)","v":79651.179999999993},{"$f":"ROUND($E$9*H8,2)","v":79651.179999999993},{"$f":"ROUND($E$9*I8,2)","v":79651.179999999993},79651.179999999993,39825.589999999997,{"$f":"SUM(F9:K9)","v":398255.9}]
["C",{"$f":"VLOOKUP(A10,ORÇAMENTO!$A$10:$L$42,2)","v":3},{"$f":"VLOOKUP(A10,ORÇAMENTO!$A$10:$L$42,5)","v":"TRANSPORTE DE MATERIAIS"},"FISICO ",{"$f":"ROUND(E11/$G$2,4)","v":0.21740000000000001},0.25,0.5,0.25,null,null,null,{"$f":"SUM(F10:K10)","v":1}]
[null,null,null,"FINANCEIRO",{"$f":"ORÇAMENTO!L23","v":434708},{"$f":"ROUND($E$11*F10,2)","v":108677},{"$f":"ROUND($E$11*G10,2)","v":217354},{"$f":"ROUND($E$11*H10,2)","v":108677},{"$f":"ROUND($E$11*I10,2)","v":0},0,0,{"$f":"SUM(F11:K11)-0.04","v":434707.96}]
["E",{"$f":"VLOOKUP(A12,ORÇAMENTO!$A$10:$L$42,2)","v":4},{"$f":"VLOOKUP(A12,ORÇAMENTO!$A$10:$L$42,5)","v":"DRENAGEM E OBRAS COMPLEMENTARES"},"FISICO ",{"$f":"ROUND(E13/$G$2,4)","v":0.2311},0.1,0.2,0.2,0.2,0.2,0.1,{"$f":"SUM(F12:K12)","v":0.99999999999999989}]
[null,null,null,"FINANCEIRO",{"$f":"ORÇAMENTO!L29","v":461977.77999999997},{"$f":"ROUND($E$13*F12,2)","v":46197.78},{"$f":"ROUND($E$13*G12,2)","v":92395.56},{"$f":"ROUND($E$13*H12,2)","v":92395.56},{"$f":"ROUND($E$13*I12,2)","v":92395.56},92395.56,46197.78,{"$f":"SUM(F13:K13)-0.02","v":461977.77999999991}]
["F",{"$f":"VLOOKUP(A14,ORÇAMENTO!$A$10:$L$42,2)","v":5},{"$f":"VLOOKUP(A14,ORÇAMENTO!$A$10:$L$42,5)","v":"FORNECIMENTOS - MATERIAL ASFÁLTICO (BDI DIFERENCIADO)"},"FISICO ",{"$f":"ROUND(E15/$G$2,4)","v":0.25950000000000001},null,0.2,0.2,0.2,0.2,0.2,{"$f":"SUM(F14:K14)","v":1}]
[null,null,null,"FINANCEIRO",{"$f":"ORÇAMENTO!L35","v":518785.03},{"$f":"ROUND($E$15*F14,2)","v":0},103757.01,103757.01,103757.01,103757.01,103757.01,{"$f":"SUM(F15:K15)-0.02","v":518785.02999999997}]
[null,"TOTAL",null,"FISICO ",{"$f":"SUM(F16:K16)","v":1.0000000100036173},{"$f":"F17/$E$17","v":0.12058754945788396},{"$f":"G17/$E$17","v":0.260589359112255},{"$f":"H17/$E$17","v":0.20623120320307822},{"$f":"I17/$E$17","v":0.15187304729390147},0.15187304729390147,0.10884580364259715,{"$f":"SUM(F16:K16)","v":1.0000000100036173}]
[null,null,null,"FINANCEIRO",{"$f":"E11+E9+E7+E15+E13","v":1999276.8},{"$f":"F11+F9+F7+F15+F13","v":241087.88999999998},{"$f":"G11+G9+G7+G15+G13","v":520990.26},412313.26,303636.26,303636.26,217612.88999999998,{"$f":"SUM(F17:K17)-0.02","v":1999276.8}]
[]
[null,"OBSERVAÇÕES:"]