{"text_format":"2","workbook":"xlsx","n_sheets":6,"sheets":["ORÇAMENTO","CPU-SERV","CPU-FORNEC","BDI SERV","BDI FORN","CRONOGRAMA"],"not_rendered":{"charts":0,"images":4,"macros":0,"external_links":0,"defined_names":7,"comments":2,"pivot_tables":0},"unopened":[],"bounds":{"document_bytes":16777216,"sheet_cells":100000,"run_cost":"one","rows_first":2000,"rows_last":500,"rows_between":2000,"halvings":0,"cell_chars":16384,"cell_head_chars":4096},"cells_cut":0,"cells_raw":0,"read":"whole","date_system":"1900"}

{"sheet":"ORÇAMENTO","index":0,"n_rows":48,"n_cols":12,"rows_kept":48,"cut":false,"hidden":false,"merged":[[5,8,5,10],[6,8,6,10],[9,16,9,18],[47,1,47,4],[0,0,8,0],[0,4,0,11],[1,4,1,11],[2,4,2,11],[6,1,6,4],[9,14,9,15],[7,1,7,11],[4,2,4,7],[5,2,5,7],[4,8,4,10]]}
["<---- NUMERAR SERVIÇOS PARA CPU",null,null,null,"Ministério do Desenvolvimento Regional"]
[{"$nulls":4},"Companhia de Desenvolvimento dos Vales do São Francisco e do Parnaíba"]
[{"$nulls":4},"1ª Superintendência Regional"]
[]
[null,"OBRA: "," PAVIMENTAÇÃO ASFÁLTICA EM CBUQ - AV. MILITÃO JOSÉ DOS SANTOS E AV. VEREADOR JOSÉ PRATES (JANAÚBA / MG)",{"$nulls":5},"BDI Serviços (%):",null,null,{"$f":"'BDI SERV'!E26","v":22.14}]
[null,"DATA:"," ABRIL / 2025",{"$nulls":5},"BDI Diferenciado Serviços (%):",null,null,{"$f":"'BDI FORN'!D31","v":15}]
[null,"PRAZO DE EXECUÇÃO:     240 DIAS",{"$nulls":6},"BDI Fornecimentos (%):",null,null,{"$f":"L6","v":15}]
[null,"PLANILHA DE ORÇAMENTAÇÃO"]
[null,"ITEM","CÓDIGO","FONTE","DISCRIMINAÇÃO","TIPO","UNID.","QUANT.","VR.UNIT.S/BDI","PR. UNIT.C/BDI","C. TOT.S/BDI","P. TOT.C/BDI"]
["A",1,null,null,"SERVIÇOS PRELIMINARES ",{"$nulls":5},{"$f":"SUM(K11:K15)","v":290905.13000000006},{"$f":"SUM(L11:L15)","v":354870.19999999995}]
[1,"1.1","CPU.1","CODEVASF","MOBILIZAÇÃO E DESMOBILIZAÇÃO","SERV","GL",1,{"$f":"VLOOKUP(A11,'CPU-SERV'!A:K,11,0)","v":13613.23},{"$f":"TRUNC(_xlfn.IFS(F11=\"SERV\",I11*(1+$L$5/100),F11=\"SERV DIF\",I11*(1+$L$6/100),F11=\"FORN\",I11*(1+$L$7/100)),2)","v":16627.189999999999},{"$f":"TRUNC(H11*I11,2)","v":13613.23},{"$f":"TRUNC(H11*J11,2)","v":16627.189999999999}]
[2,"1.2","CPU.2","CODEVASF","ADMINISTRAÇÃO LOCAL ","SERV","GL",1,{"$f":"VLOOKUP(A12,'CPU-SERV'!A:K,11,0)","v":230359.32},{"$f":"TRUNC(_xlfn.IFS(F12=\"SERV\",I12*(1+$L$5/100),F12=\"SERV DIF\",I12*(1+$L$6/100),F12=\"FORN\",I12*(1+$L$7/100)),2)","v":281360.87},{"$f":"TRUNC(H12*I12,2)","v":230359.32},{"$f":"TRUNC(H12*J12,2)","v":281360.87}]
[3,"1.3","CPU.3","CODEVASF","CANTEIRO DE OBRAS ","SERV","GL",1,{"$f":"VLOOKUP(A13,'CPU-SERV'!A:K,11,0)","v":18289.8},{"$f":"TRUNC(_xlfn.IFS(F13=\"SERV\",I13*(1+$L$5/100),F13=\"SERV DIF\",I13*(1+$L$6/100),F13=\"FORN\",I13*(1+$L$7/100)),2)","v":22339.16},18289.8,22339.16]
[4,"1.4",103689,"SINAPI","PLACA DE OBRA EM CHAPA DE AÇO GALVANIZADO","SERV","M2",9,{"$f":"VLOOKUP(A14,'CPU-SERV'!A:K,11,0)","v":351.42},{"$f":"TRUNC(_xlfn.IFS(F14=\"SERV\",I14*(1+$L$5/100),F14=\"SERV DIF\",I14*(1+$L$6/100),F14=\"FORN\",I14*(1+$L$7/100)),2)","v":429.22},3162.78,3862.98]
[6,"1.5",78472,"SINAPI","SERVIÇOS TOPOGRÁFICOS PARA PAVIMENTAÇÃO, INCLUSIVE LEVANTAMENTO PLANIALTIMÉTRICO CADASTRAL, GERAÇÃO DE NOTAS DE SERVIÇO, SEÇÕES TRANSVERSAIS E GREIDE, ESTAQUEAMENTO E ACOMPANHAMENTO EXECUTIVO","SERV","M2",52000,{"$f":"VLOOKUP(A15,'CPU-SERV'!A:K,11,0)","v":0.49},{"$f":"TRUNC(_xlfn.IFS(F15=\"SERV\",I15*(1+$L$5/100),F15=\"SERV DIF\",I15*(1+$L$6/100),F15=\"FORN\",I15*(1+$L$7/100)),2)","v":0.59},25480,30680]
["B",2,null,null,"TERRAPLANAGEM E PAVIMENTAÇÃO",{"$nulls":5},{"$f":"SUM(K17:K24)","v":1636039},{"$f":"SUM(L17:L24)","v":1997462}]
[7,"2.1",5502140,"SICRO","ESCAVAÇÃO, CARGA E TRANSPORTE DE MATERIAL DE 1ª CATEGORIA - DMT 1.000 A 1.200M, CAMINHO DE SERVIÇO EM REVESTIMENTO PRIMÁRIO","SERV","M3",7200,{"$f":"VLOOKUP(A17,'CPU-SERV'!A:K,11,0)","v":6.74},{"$f":"TRUNC(_xlfn.IFS(F17=\"SERV\",I17*(1+$L$5/100),F17=\"SERV DIF\",I17*(1+$L$6/100),F17=\"FORN\",I17*(1+$L$7/100)),2)","v":8.23},{"$f":"TRUNC(H17*I17,2)","v":48528},{"$f":"TRUNC(H17*J17,2)","v":59256}]
[8,"2.2",4413942,"SICRO","ESPALHAMENTO DE MATERIAL EM BOTA FORA","SERV","M3",3400,{"$f":"VLOOKUP(A18,'CPU-SERV'!A:K,11,0)","v":1.44},{"$f":"TRUNC(_xlfn.IFS(F18=\"SERV\",I18*(1+$L$5/100),F18=\"SERV DIF\",I18*(1+$L$6/100),F18=\"FORN\",I18*(1+$L$7/100)),2)","v":1.75},4896,5950]
[9,"2.3",5502978,"SICRO","COMPACTAÇÃO DE ATERROS A 100% DO PROCTOR NORMAL","SERV","M3",3800,{"$f":"VLOOKUP(A19,'CPU-SERV'!A:K,11,0)","v":5.03},{"$f":"TRUNC(_xlfn.IFS(F19=\"SERV\",I19*(1+$L$5/100),F19=\"SERV DIF\",I19*(1+$L$6/100),F19=\"FORN\",I19*(1+$L$7/100)),2)","v":6.14},19114,23332]
[10,"2.4",4011209,"SICRO","REGULARIZAÇÃO E COMPACTAÇÃO DO SUBLEITO ","SERV","M2",35800,{"$f":"VLOOKUP(A20,'CPU-SERV'!A:K,11,0)","v":1.54},{"$f":"TRUNC(_xlfn.IFS(F20=\"SERV\",I20*(1+$L$5/100),F20=\"SERV DIF\",I20*(1+$L$6/100),F20=\"FORN\",I20*(1+$L$7/100)),2)","v":1.88},55132,67304]
[11,"2.5",4011276,"SICRO","EXECUÇÃO E COMPACTAÇÃO DE BASE E OU SUB BASE PARA PAVIMENTAÇÃO DE BICA CORRIDA - EXCLUSIVE TRANSPORTE","SERV","M3",6900,{"$f":"VLOOKUP(A21,'CPU-SERV'!A:K,11,0)","v":129.22},{"$f":"TRUNC(_xlfn.IFS(F21=\"SERV\",I21*(1+$L$5/100),F21=\"SERV DIF\",I21*(1+$L$6/100),F21=\"FORN\",I21*(1+$L$7/100)),2)","v":157.82},891618,1088958]
[12,"2.6",4011352,"SICRO","IMPRIMAÇÃO COM EMULSÃO ASFÁLTICA (EAI)","SERV","M2",34400,{"$f":"VLOOKUP(A22,'CPU-SERV'!A:K,11,0)","v":0.4},{"$f":"TRUNC(_xlfn.IFS(F22=\"SERV\",I22*(1+$L$5/100),F22=\"SERV DIF\",I22*(1+$L$6/100),F22=\"FORN\",I22*(1+$L$7/100)),2)","v":0.48},13760,16512]
[13,"2.7",4011353,"SICRO","PINTURA DE LIGAÇÃO COM EMULSÃO ASFÁLTICA RR-1C","SERV","M2",34400,{"$f":"VLOOKUP(A23,'CPU-SERV'!A:K,11,0)","v":0.27},{"$f":"TRUNC(_xlfn.IFS(F23=\"SERV\",I23*(1+$L$5/100),F23=\"SERV DIF\",I23*(1+$L$6/100),F23=\"FORN\",I23*(1+$L$7/100)),2)","v":0.32},9288,11008]
[14,"2.8",4011463,"SICRO","EXECUÇÃO DE PAVIMENTO COM APLICAÇÃO DE CONCRETO ASFÁLTICO USINADO A QUENTE (CBUQ), CAMADA DE ROLAMENTO - EXCLUSIVE TRANSPORTE","SERV","T",3300,{"$f":"VLOOKUP(A24,'CPU-SERV'!A:K,11,0)","v":179.91},{"$f":"TRUNC(_xlfn.IFS(F24=\"SERV\",I24*(1+$L$5/100),F24=\"SERV DIF\",I24*(1+$L$6/100),F24=\"FORN\",I24*(1+$L$7/100)),2)","v":219.74},593703,725142]
["C",3,null,null,"TRANSPORTE DE MATERIAIS",{"$nulls":5},{"$f":"SUM(K26:K29)","v":541670},{"$f":"SUM(L26:L29)","v":656816}]
[15,"3.1",5915321,"SICRO","TRANSPORTE COM CAMINHÃO BASCULANTE, EM VIA URBANA PAVIMENTADA","SERV","TXKM",220000,{"$f":"VLOOKUP(A26,'CPU-SERV'!A:K,11,0)","v":0.54},{"$f":"TRUNC(_xlfn.IFS(F26=\"SERV\",I26*(1+$L$5/100),F26=\"SERV DIF\",I26*(1+$L$6/100),F26=\"FORN\",I26*(1+$L$7/100)),2)","v":0.65},{"$f":"TRUNC(H26*I26,2)","v":118800},{"$f":"TRUNC(H26*J26,2)","v":143000}]
[16,"3.2",5914434,"SICRO","TRANSPORTE COM CAMINHÃO CARROCERIA 9T, EM VIA URBANA PAVIMENTADA","SERV","TXKM",5200,{"$f":"VLOOKUP(A27,'CPU-SERV'!A:K,11,0)","v":0.74},{"$f":"TRUNC(_xlfn.IFS(F27=\"SERV\",I27*(1+$L$5/100),F27=\"SERV DIF\",I27*(1+$L$6/100),F27=\"FORN\",I27*(1+$L$7/100)),2)","v":0.9},3848,4680]
[17,"3.3",5914612,"SICRO","TRNASPORTE DE MISTURA BETUMINOSA A QUENTE COM CAMINHÃO CAÇAMBA TÉRMICA","SERV","TXKM",450000,{"$f":"VLOOKUP(A28,'CPU-SERV'!A:K,11,0)","v":0.93},{"$f":"TRUNC(_xlfn.IFS(F28=\"SERV\",I28*(1+$L$5/100),F28=\"SERV DIF\",I28*(1+$L$6/100),F28=\"FORN\",I28*(1+$L$7/100)),2)","v":1.1299999999999999},418500,508500]
[18,"3.4",5914622,"SICRO","TRANSPORTE COM CAMINHÃO TANQUE DE TRANSPORTE DE MATERIAL ASFÁLTICO DE 30000 L, EM VIA URBANA PAVIMENTADA","SERV","TXKM",300,{"$f":"VLOOKUP(A29,'CPU-SERV'!A:K,11,0)","v":1.74},{"$f":"TRUNC(_xlfn.IFS(F29=\"SERV\",I29*(1+$L$5/100),F29=\"SERV DIF\",I29*(1+$L$6/100),F29=\"FORN\",I29*(1+$L$7/100)),2)","v":2.12},522,636]
["E",4,null,null,"DRENAGEM E OBRAS COMPLEMENTARES",{"$nulls":5},{"$f":"SUM(K31:K40)","v":1076331.7600000002},{"$f":"SUM(L31:L40)","v":1314504.82}]
[19,"4.1",94273,"SINAPI","ASSENTAMENTO DE GUIA (MEIO-FIO) PRÉ-MOLDADO DE CONCRETO - 100X15X13X30 CM (COMPRIMENTO X BASE INFERIOR X BASE SUPERIOR X ALTURA) - USO VIÁRIO","SERV","M",8800,{"$f":"VLOOKUP(A31,'CPU-SERV'!A:K,11,0)","v":53.22},{"$f":"TRUNC(_xlfn.IFS(F31=\"SERV\",I31*(1+$L$5/100),F31=\"SERV DIF\",I31*(1+$L$6/100),F31=\"FORN\",I31*(1+$L$7/100)),2)","v":65},{"$f":"TRUNC(H31*I31,2)","v":468336},{"$f":"TRUNC(H31*J31,2)","v":572000}]
[20,"4.2",94287,"SINAPI","EXECUÇÃO DE SARJETA EM CONCRETO USINADO, MOLDADO IN LOCO - 30CM DE BASE X 5CM DE ALTURA","SERV","M",8800,{"$f":"VLOOKUP(A32,'CPU-SERV'!A:K,11,0)","v":25.19},{"$f":"TRUNC(_xlfn.IFS(F32=\"SERV\",I32*(1+$L$5/100),F32=\"SERV DIF\",I32*(1+$L$6/100),F32=\"FORN\",I32*(1+$L$7/100)),2)","v":30.76},221672,270688]
[21,"4.3",4915724,"SICRO","CAIAÇÃO COM FIXADOR DE CAL","SERV","M2",4840,{"$f":"VLOOKUP(A33,'CPU-SERV'!A:K,11,0)","v":1.86},{"$f":"TRUNC(_xlfn.IFS(F33=\"SERV\",I33*(1+$L$5/100),F33=\"SERV DIF\",I33*(1+$L$6/100),F33=\"FORN\",I33*(1+$L$7/100)),2)","v":2.27},9002.4,10986.8]
[42,"4.4",94990,"SINAPI","EXECUÇÃO DE PASSEIO (CALÇADA) OU PISO DE CONCRETO MOLDADO IN LOCO, ACABAMENTO CONVENCIONAL, NÃO ARMADO","SERV","M3",250,{"$f":"VLOOKUP(A34,'CPU-SERV'!A:K,11,0)","v":740.64},{"$f":"TRUNC(_xlfn.IFS(F34=\"SERV\",I34*(1+$L$5/100),F34=\"SERV DIF\",I34*(1+$L$6/100),F34=\"FORN\",I34*(1+$L$7/100)),2)","v":904.61},185160,226152.5]
[43,"4.5","ED-51148a","SETOP","RAMPA PARA ACESSO DE DEFICIENTES EM CONCRETO SIMPLES, DESEMPENADA ","SERV","UN.",72,{"$f":"VLOOKUP(A35,'CPU-SERV'!A:K,11,0)","v":198.9},{"$f":"TRUNC(_xlfn.IFS(F35=\"SERV\",I35*(1+$L$5/100),F35=\"SERV DIF\",I35*(1+$L$6/100),F35=\"FORN\",I35*(1+$L$7/100)),2)","v":242.93},14320.8,17490.96]
[45,"4.6",5213440,"SICRO","PLACA DE REGULAMENTAÇÃO EM AÇO, D=60CM - PELÍCULA RETRORREFLETIVA - FORNECIMENTO E INSTALAÇÃO, INCLUSIVE  SUPORTE","SERV","UN.",24,{"$f":"VLOOKUP(A36,'CPU-SERV'!A:K,11,0)","v":361.25},{"$f":"TRUNC(_xlfn.IFS(F36=\"SERV\",I36*(1+$L$5/100),F36=\"SERV DIF\",I36*(1+$L$6/100),F36=\"FORN\",I36*(1+$L$7/100)),2)","v":441.23},8670,10589.52]
[46,"4.7","5213440a","SICRO","PLACA DE IDENTIFICAÇÃO DE VIAS EM AÇO, 0,64 X 0,30M - PELÍCULA RETRORREFLETIVA - FORNECIMENTO E IMPLANTAÇÃO","SERV","UN.",48,{"$f":"VLOOKUP(A37,'CPU-SERV'!A:K,11,0)","v":106.22},{"$f":"TRUNC(_xlfn.IFS(F37=\"SERV\",I37*(1+$L$5/100),F37=\"SERV DIF\",I37*(1+$L$6/100),F37=\"FORN\",I37*(1+$L$7/100)),2)","v":129.72999999999999},5098.5600000000004,6227.04]
[48,"4.8",5213401,"SICRO","PINTURA DE EIXO VIÁRIO SOBRE ASFALTO COM TINTA RETRORREFLETIVA A BASE DE RESINA ACRÍLICA COM MICROESFERAS DE VIDRO, APLICAÇÃO MECÂNICA COM DEMARCADORA AUTOPROPELIDA","SERV","M2",1800,{"$f":"VLOOKUP(A38,'CPU-SERV'!A:K,11,0)","v":29.17},{"$f":"TRUNC(_xlfn.IFS(F38=\"SERV\",I38*(1+$L$5/100),F38=\"SERV DIF\",I38*(1+$L$6/100),F38=\"FORN\",I38*(1+$L$7/100)),2)","v":35.619999999999997},52506,64116]
[49,"4.9",5213360,"SICRO","TACHA REFLETIVA EM PLÁSTICO INJETADO - BIDIRECIONAL COM UM PINO - FORNECIMENTO E COLOCAÇÃO","SERV","UNID.",1700,{"$f":"VLOOKUP(A39,'CPU-SERV'!A:K,11,0)","v":31.08},{"$f":"TRUNC(_xlfn.IFS(F39=\"SERV\",I39*(1+$L$5/100),F39=\"SERV DIF\",I39*(1+$L$6/100),F39=\"FORN\",I39*(1+$L$7/100)),2)","v":37.96},52836,64532]
[50,"4.10",5213405,"SICRO","PINTURA DE FAIXA DE PEDESTRE OU ZEBRADA TINTA RETRORREFLETIVA A BASE DE RESINA ACRÍLICA COM MICROESFERAS DE VIDRO, APLICAÇÃO MANUAL","SERV","M2",1400,{"$f":"VLOOKUP(A40,'CPU-SERV'!A:K,11,0)","v":41.95},{"$f":"TRUNC(_xlfn.IFS(F40=\"SERV\",I40*(1+$L$5/100),F40=\"SERV DIF\",I40*(1+$L$6/100),F40=\"FORN\",I40*(1+$L$7/100)),2)","v":51.23},58730,71722]
["F",5,null,null,"FORNECIMENTOS - MATERIAL ASFÁLTICO (BDI DIFERENCIADO)",{"$nulls":5},{"$f":"SUM(K42:K47)","v":1195772.92},{"$f":"SUM(L42:L47)","v":1375137.59}]
["F1","5.1","CPU.7","CODEVASF","AQUISIÇÃO DE EMULSÃO ASFÁLTICA PARA IMPRIMAÇÃO (EAI) - EXCLUSIVE TRANSPORTE","FORN","T",45,{"$f":"VLOOKUP(A42,'CPU-FORNEC'!A:J,9,0)","v":3532.13},{"$f":"TRUNC(_xlfn.IFS(F42=\"SERV\",I42*(1+$L$5/100),F42=\"SERV DIF\",I42*(1+$L$6/100),F42=\"FORN\",I42*(1+$L$7/100)),2)","v":4061.94},{"$f":"TRUNC(H42*I42,2)","v":158945.85},{"$f":"TRUNC(H42*J42,2)","v":182787.3}]
["F2","5.2","CPU.8","CODEVASF","TRANSPORTE DE EMULSÃO ASFÁLTICA PARA IMPRIMAÇÃO (EAI)","SERV DIF","T",45,{"$f":"VLOOKUP(A43,'CPU-FORNEC'!A:J,9,0)","v":477},{"$f":"TRUNC(_xlfn.IFS(F43=\"SERV\",I43*(1+$L$5/100),F43=\"SERV DIF\",I43*(1+$L$6/100),F43=\"FORN\",I43*(1+$L$7/100)),2)","v":548.54999999999995},{"$f":"TRUNC(H43*I43,2)","v":21465},{"$f":"TRUNC(H43*J43,2)","v":24684.75}]
["F3","5.3","CPU.9","CODEVASF","AQUISIÇÃO DE EMULSAO ASFALTICA CATIONICA RR-1C - EXCLUSIVE TRANSPORTE","FORN","T",16,{"$f":"VLOOKUP(A44,'CPU-FORNEC'!A:J,9,0)","v":3480.79},{"$f":"TRUNC(_xlfn.IFS(F44=\"SERV\",I44*(1+$L$5/100),F44=\"SERV DIF\",I44*(1+$L$6/100),F44=\"FORN\",I44*(1+$L$7/100)),2)","v":4002.9},55692.639999999999,64046.400000000001]
["F4","5.4","CPU.10","CODEVASF","TRANSPORTE DE EMULSÃO ASFÁLTICA CATIONICA RR-1C","SERV DIF","T",16,{"$f":"VLOOKUP(A45,'CPU-FORNEC'!A:J,9,0)","v":494.16},{"$f":"TRUNC(_xlfn.IFS(F45=\"SERV\",I45*(1+$L$5/100),F45=\"SERV DIF\",I45*(1+$L$6/100),F45=\"FORN\",I45*(1+$L$7/100)),2)","v":568.28},7906.56,9092.48]
["F5","5.5","CPU.11","CODEVASF","AQUISIÇÃO DE CONCRETO ASFÁLTICO DE PETRÓLEO - CAP 50/70 - EXCLUSIVE TRANSPORTE","FORN","T",183,{"$f":"VLOOKUP(A46,'CPU-FORNEC'!A:J,9,0)","v":4815.2},{"$f":"TRUNC(_xlfn.IFS(F46=\"SERV\",I46*(1+$L$5/100),F46=\"SERV DIF\",I46*(1+$L$6/100),F46=\"FORN\",I46*(1+$L$7/100)),2)","v":5537.48},881181.6,1013358.84]
["F6","5.6","CPU.12","CODEVASF","TRANSPORTE DE CONCRETO ASFÁLTICO DE PETRÓLEO - CAP 50/70","SERV DIF","T",183,{"$f":"VLOOKUP(A47,'CPU-FORNEC'!A:J,9,0)","v":385.69},{"$f":"TRUNC(_xlfn.IFS(F47=\"SERV\",I47*(1+$L$5/100),F47=\"SERV DIF\",I47*(1+$L$6/100),F47=\"FORN\",I47*(1+$L$7/100)),2)","v":443.54},70581.27,81167.820000000007]
[null,"TOTAL GERAL DA OBRA COM BDI ",{"$nulls":8},{"$f":"SUM(K10,K16,K25,K30,K41)","v":4740718.8100000005},{"$f":"SUM(L10,L16,L25,L30,L41)","v":5698790.6100000003}]

{"sheet":"CPU-SERV","index":1,"n_rows":1228,"n_cols":11,"rows_kept":1228,"cut":false,"hidden":false,"merged":[[1211,3,1211,7],[1213,8,1213,9],[1218,3,1218,7],[1219,1,1220,2],[1219,3,1220,3],[1219,4,1220,4],[1219,5,1219,7],[1219,9,1220,9],[1196,3,1196,7],[1197,3,1197,7],[1198,3,1198,7],[1201,7,1201,9],[1207,3,1207,7],[1208,7,1208,9],[1187,8,1187,9],[1188,1,1189,2],[1188,3,1189,3],[1188,4,1188,5],[1188,6,1188,7],[1193,7,1193,9],[1179,3,1179,7],[1180,5,1180,7],[1183,0,1227,0],[1184,2,1184,9],[1185,1,1186,3],[1185,4,1185,5],[1186,4,1186,5],[1187,2,1187,7],[1225,3,1225,7],[1226,5,1226,7],[1142,0,1181,0],[1143,2,1143,9],[1144,1,1145,3],[1144,4,1144,5],[1145,4,1145,5],[1146,2,1146,7],[1132,3,1133,3],[1132,4,1133,4],[1132,5,1132,7],[1132,9,1133,9],[1169,3,1169,7],[1171,8,1171,9],[1174,3,1174,7],[1175,1,1176,2],[1175,3,1176,3],[1175,4,1176,4],[1175,5,1175,7],[1175,9,1176,9],[1156,3,1156,7],[1157,3,1157,7],[1158,3,1158,7],[1161,7,1161,9],[1165,3,1165,7],[1166,7,1166,9],[1146,8,1146,9],[1147,1,1148,2],[1147,3,1148,3],[1147,4,1147,5],[1147,6,1147,7],[1153,7,1153,9],[1109,3,1109,7],[1110,3,1110,7],[1111,3,1111,7],[1114,7,1114,9],[1120,3,1120,7],[1121,7,1121,9],[1100,8,1100,9],[1101,1,1102,2],[1101,3,1102,3],[1101,4,1101,5],[1101,6,1101,7],[1106,7,1106,9],[1092,3,1092,7],[1093,5,1093,7],[1096,0,1140,0],[1097,2,1097,9],[1098,1,1099,3],[1098,4,1098,5],[1099,4,1099,5],[1100,2,1100,7],[1138,3,1138,7],[1139,5,1139,7],[1057,0,1094,0],[1058,2,1058,9],[1059,1,1060,3],[1059,4,1059,5],[1060,4,1060,5],[1061,2,1061,7],[1124,3,1124,7],[1126,8,1126,9],[1131,3,1131,7],[1132,1,1133,2],[1049,3,1050,3],[1049,4,1050,4],[1049,5,1049,7],[1049,9,1050,9],[1082,3,1082,7],[1084,8,1084,9],[1087,3,1087,7],[1088,1,1089,2],[1088,3,1089,3],[1088,4,1089,4],[1088,5,1088,7],[1088,9,1089,9],[1070,3,1070,7],[1071,3,1071,7],[1072,3,1072,7],[1075,7,1075,9],[1078,3,1078,7],[1079,7,1079,9],[1061,8,1061,9],[1062,1,1063,2],[1062,3,1063,3],[1062,4,1062,5],[1062,6,1062,7],[1067,7,1067,9],[1031,3,1031,7],[1032,3,1032,7],[1033,3,1033,7],[1036,7,1036,9],[1039,3,1039,7],[1040,7,1040,9],[1022,8,1022,9],[1023,1,1024,2],[1023,3,1024,3],[1023,4,1023,5],[1023,6,1023,7],[1028,7,1028,9],[1014,3,1014,7],[1015,5,1015,7],[1018,0,1055,0],[1019,2,1019,9],[1020,1,1021,3],[1020,4,1020,5],[1021,4,1021,5],[1022,2,1022,7],[1053,3,1053,7],[1054,5,1054,7],[978,0,1016,0],[979,2,979,9],[980,1,981,3],[980,4,980,5],[981,4,981,5],[982,2,982,7],[1043,3,1043,7],[1045,8,1045,9],[1048,3,1048,7],[1049,1,1050,2],[970,3,971,3],[970,4,971,4],[970,5,970,7],[970,9,971,9],[1004,3,1004,7],[1006,8,1006,9],[1009,3,1009,7],[1010,1,1011,2],[1010,3,1011,3],[1010,4,1011,4],[1010,5,1010,7],[1010,9,1011,9],[991,3,991,7],[992,3,992,7],[993,3,993,7],[996,7,996,9],[999,3,999,7],[1000,7,1000,9],[982,8,982,9],[983,1,984,2],[983,3,984,3],[983,4,983,5],[983,6,983,7],[988,7,988,9],[952,3,952,7],[953,3,953,7],[954,3,954,7],[957,7,957,9],[960,3,960,7],[961,7,961,9],[943,8,943,9],[944,1,945,2],[944,3,945,3],[944,4,944,5],[944,6,944,7],[949,7,949,9],[935,3,935,7],[936,5,936,7],[939,0,976,0],[940,2,940,9],[941,1,942,3],[941,4,941,5],[942,4,942,5],[943,2,943,7],[974,3,974,7],[975,5,975,7],[900,0,937,0],[901,2,901,9],[902,1,903,3],[902,4,902,5],[903,4,903,5],[904,2,904,7],[964,3,964,7],[966,8,966,9],[969,3,969,7],[970,1,971,2],[925,3,925,7],[927,8,927,9],[930,3,930,7],[931,1,932,2],[931,3,932,3],[931,4,932,4],[931,5,931,7],[931,9,932,9],[913,3,913,7],[914,3,914,7],[915,3,915,7],[918,7,918,9],[921,3,921,7],[922,7,922,9],[904,8,904,9],[905,1,906,2],[905,3,906,3],[905,4,905,5],[905,6,905,7],[910,7,910,9],[871,3,871,7],[872,3,872,7],[873,3,873,7],[876,7,876,9],[882,3,882,7],[883,7,883,9],[861,8,861,9],[862,1,863,2],[862,3,863,3],[862,4,862,5],[862,6,862,7],[867,7,867,9],[857,0,898,0],[858,2,858,9],[859,1,860,3],[859,4,859,5],[860,4,860,5],[861,2,861,7],[896,3,896,7],[897,5,897,7],[886,3,886,7],[888,8,888,9],[891,3,891,7],[892,1,893,2],[892,3,893,3],[892,4,893,4],[892,5,892,7],[892,9,893,9],[853,3,853,7],[854,5,854,7],[816,0,855,0],[817,2,817,9],[818,1,819,3],[818,4,818,5],[819,4,819,5],[820,2,820,7],[808,3,809,3],[808,4,809,4],[808,5,808,7],[808,9,809,9],[843,3,843,7],[845,8,845,9],[848,3,848,7],[849,1,850,2],[849,3,850,3],[849,4,850,4],[849,5,849,7],[849,9,850,9],[830,3,830,7],[831,3,831,7],[832,3,832,7],[835,7,835,9],[839,3,839,7],[840,7,840,9],[820,8,820,9],[821,1,822,2],[821,3,822,3],[821,4,821,5],[821,6,821,7],[827,7,827,9],[788,3,788,7],[789,3,789,7],[790,3,790,7],[793,7,793,9],[798,3,798,7],[799,7,799,9],[779,8,779,9],[780,1,781,2],[780,3,781,3],[780,4,780,5],[780,6,780,7],[785,7,785,9],[771,3,771,7],[772,5,772,7],[775,0,814,0],[776,2,776,9],[777,1,778,3],[777,4,777,5],[778,4,778,5],[779,2,779,7],[812,3,812,7],[813,5,813,7],[736,0,773,0],[737,2,737,9],[738,1,739,3],[738,4,738,5],[739,4,739,5],[740,2,740,7],[802,3,802,7],[804,8,804,9],[807,3,807,7],[808,1,809,2],[728,3,729,3],[728,4,729,4],[728,5,728,7],[728,9,729,9],[761,3,761,7],[763,8,763,9],[766,3,766,7],[767,1,768,2],[767,3,768,3],[767,4,768,4],[767,5,767,7],[767,9,768,9],[749,3,749,7],[750,3,750,7],[751,3,751,7],[754,7,754,9],[757,3,757,7],[758,7,758,9],[740,8,740,9],[741,1,742,2],[741,3,742,3],[741,4,741,5],[741,6,741,7],[746,7,746,9],[710,3,710,7],[711,3,711,7],[712,3,712,7],[715,7,715,9],[718,3,718,7],[719,7,719,9],[701,8,701,9],[702,1,703,2],[702,3,703,3],[702,4,702,5],[702,6,702,7],[707,7,707,9],[693,3,693,7],[694,5,694,7],[697,0,734,0],[698,2,698,9],[699,1,700,3],[699,4,699,5],[700,4,700,5],[701,2,701,7],[732,3,732,7],[733,5,733,7],[658,0,695,0],[659,2,659,9],[660,1,661,3],[660,4,660,5],[661,4,661,5],[662,2,662,7],[722,3,722,7],[724,8,724,9],[727,3,727,7],[728,1,729,2],[683,3,683,7],[685,8,685,9],[688,3,688,7],[689,1,690,2],[689,3,690,3],[689,4,690,4],[689,5,689,7],[689,9,690,9],[671,3,671,7],[672,3,672,7],[673,3,673,7],[676,7,676,9],[679,3,679,7],[680,7,680,9],[662,8,662,9],[663,1,664,2],[663,3,664,3],[663,4,663,5],[663,6,663,7],[668,7,668,9],[641,7,641,9],[623,8,623,9],[624,1,625,2],[624,3,625,3],[624,4,624,5],[624,6,624,7],[629,7,629,9],[615,3,615,7],[616,5,616,7],[619,0,656,0],[620,2,620,9],[621,1,622,3],[621,4,621,5],[622,4,622,5],[623,2,623,7],[654,3,654,7],[655,5,655,7],[580,0,617,0],[581,2,581,9],[582,1,583,3],[582,4,582,5],[583,4,583,5],[644,3,644,7],[646,8,646,9],[649,3,649,7],[650,1,651,2],[650,3,651,3],[650,4,651,4],[650,5,650,7],[650,9,651,9],[594,3,594,7],[595,3,595,7],[598,7,598,9],[601,3,601,7],[602,7,602,9],[584,8,584,9],[585,1,586,2],[585,3,586,3],[585,4,585,5],[585,6,585,7],[590,7,590,9],[632,3,632,7],[633,3,633,7],[634,3,634,7],[637,7,637,9],[640,3,640,7],[584,2,584,7],[514,8,514,9],[517,3,517,7],[518,1,519,2],[518,3,519,3],[518,4,519,4],[518,5,518,7],[518,9,519,9],[568,1,569,2],[568,3,569,3],[568,4,569,4],[568,5,568,7],[568,9,569,9],[576,3,576,7],[558,3,558,7],[560,8,560,9],[567,3,567,7],[593,3,593,7],[551,7,551,8],[577,5,577,7],[605,3,605,7],[607,8,607,9],[610,3,610,7],[611,1,612,2],[611,3,612,3],[611,4,612,4],[611,5,611,7],[611,9,612,9],[452,6,452,7],[457,7,457,9],[500,3,500,7],[501,3,501,7],[502,3,502,7],[505,7,505,9],[508,3,508,7],[509,7,509,9],[490,8,490,9],[491,1,492,2],[491,3,492,3],[491,4,491,5],[491,6,491,7],[497,7,497,9],[482,3,482,7],[483,5,483,7],[461,3,461,7],[462,3,462,7],[465,7,465,9],[468,3,468,7],[469,7,469,9],[556,7,556,9],[512,3,512,7],[486,0,524,0],[487,2,487,9],[488,1,489,3],[488,4,488,5],[489,4,489,5],[490,2,490,7],[522,3,522,7],[523,5,523,7],[466,7,466,8],[447,0,484,0],[448,2,448,9],[449,1,450,3],[449,4,449,5],[450,4,450,5],[451,2,451,7],[433,3,433,7],[435,8,435,9],[438,3,438,7],[439,1,440,2],[439,3,440,3],[439,4,440,4],[439,5,439,7],[439,9,440,9],[472,3,472,7],[474,8,474,9],[477,3,477,7],[478,1,479,2],[478,3,479,3],[478,4,479,4],[478,5,478,7],[478,9,479,9],[460,3,460,7],[451,8,451,9],[452,1,453,2],[452,3,453,3],[452,4,452,5],[372,6,372,7],[379,7,379,9],[421,3,421,7],[422,3,422,7],[423,3,423,7],[426,7,426,9],[429,3,429,7],[430,7,430,9],[412,8,412,9],[413,1,414,2],[413,3,414,3],[413,4,413,5],[413,6,413,7],[418,7,418,9],[404,3,404,7],[405,5,405,7],[383,3,383,7],[384,3,384,7],[387,7,387,9],[390,3,390,7],[391,7,391,9],[408,0,445,0],[409,2,409,9],[410,1,411,3],[410,4,410,5],[411,4,411,5],[412,2,412,7],[443,3,443,7],[444,5,444,7],[427,7,427,8],[367,0,406,0],[368,2,368,9],[369,1,370,3],[369,4,369,5],[370,4,370,5],[371,2,371,7],[353,3,353,7],[355,8,355,9],[358,3,358,7],[359,1,360,2],[359,3,360,3],[359,4,360,4],[359,5,359,7],[359,9,360,9],[394,3,394,7],[396,8,396,9],[399,3,399,7],[400,1,401,2],[400,3,401,3],[400,4,401,4],[400,5,400,7],[400,9,401,9],[382,3,382,7],[371,8,371,9],[372,1,373,2],[372,3,373,3],[372,4,372,5],[287,6,287,7],[295,7,295,9],[341,3,341,7],[342,3,342,7],[343,3,343,7],[346,7,346,9],[349,3,349,7],[350,7,350,9],[328,8,328,9],[329,1,330,2],[329,3,330,3],[329,4,329,5],[329,6,329,7],[338,7,338,9],[320,3,320,7],[321,5,321,7],[300,3,300,7],[303,7,303,9],[306,3,306,7],[307,7,307,9],[324,0,365,0],[325,2,325,9],[326,1,327,3],[326,4,326,5],[327,4,327,5],[328,2,328,7],[363,3,363,7],[364,5,364,7],[282,0,322,0],[283,2,283,9],[284,1,285,3],[284,4,284,5],[285,4,285,5],[286,2,286,7],[268,3,268,7],[270,8,270,9],[273,3,273,7],[274,1,275,2],[274,3,275,3],[274,4,275,4],[274,5,274,7],[274,9,275,9],[310,3,310,7],[312,8,312,9],[315,3,315,7],[316,1,317,2],[316,3,317,3],[316,4,317,4],[316,5,316,7],[316,9,317,9],[298,3,298,7],[299,3,299,7],[286,8,286,9],[287,1,288,2],[287,3,288,3],[287,4,287,5],[209,6,209,7],[214,7,214,9],[256,3,256,7],[257,3,257,7],[258,3,258,7],[261,7,261,9],[264,3,264,7],[265,7,265,9],[247,8,247,9],[248,1,249,2],[248,3,249,3],[248,4,248,5],[248,6,248,7],[253,7,253,9],[239,3,239,7],[240,5,240,7],[219,3,219,7],[222,7,222,9],[225,3,225,7],[226,7,226,9],[243,0,280,0],[244,2,244,9],[245,1,246,3],[245,4,245,5],[246,4,246,5],[247,2,247,7],[278,3,278,7],[279,5,279,7],[204,0,241,0],[205,2,205,9],[206,1,207,3],[206,4,206,5],[207,4,207,5],[208,2,208,7],[190,3,190,7],[192,8,192,9],[195,3,195,7],[196,1,197,2],[196,3,197,3],[196,4,197,4],[196,5,196,7],[196,9,197,9],[229,3,229,7],[231,8,231,9],[234,3,234,7],[235,1,236,2],[235,3,236,3],[235,4,236,4],[235,5,235,7],[235,9,236,9],[217,3,217,7],[218,3,218,7],[208,8,208,9],[209,1,210,2],[209,3,210,3],[209,4,209,5],[178,3,178,7],[179,3,179,7],[180,3,180,7],[183,7,183,9],[186,3,186,7],[187,7,187,9],[167,8,167,9],[168,1,169,2],[168,3,169,3],[168,4,168,5],[168,6,168,7],[173,7,173,9],[163,0,202,0],[164,2,164,9],[165,1,166,3],[165,4,165,5],[166,4,166,5],[167,2,167,7],[200,3,200,7],[201,5,201,7],[151,8,151,9],[154,3,154,7],[155,1,156,2],[155,3,156,3],[155,4,156,4],[155,5,155,7],[155,9,156,9],[136,3,136,7],[137,3,137,7],[140,7,140,9],[145,3,145,7],[146,7,146,9],[149,3,149,7],[127,1,128,2],[127,3,128,3],[127,4,127,5],[127,6,127,7],[132,7,132,9],[135,3,135,7],[119,5,119,7],[122,0,161,0],[123,2,123,9],[124,1,125,3],[124,4,124,5],[125,4,125,5],[126,2,126,7],[126,8,126,9],[159,3,159,7],[160,5,160,7],[114,1,115,2],[114,3,115,3],[114,4,115,4],[114,5,114,7],[114,9,115,9],[118,3,118,7],[93,7,93,9],[98,3,98,7],[101,7,101,9],[104,3,104,7],[105,7,105,9],[108,3,108,7],[83,0,120,0],[84,2,84,9],[85,1,86,3],[86,4,86,5],[87,2,87,7],[87,8,87,9],[88,1,89,2],[110,8,110,9],[113,3,113,7],[96,3,96,7],[97,3,97,7],[88,3,89,3],[88,4,88,5],[88,6,88,7],[79,3,79,7],[80,5,80,7],[85,4,85,5],[74,3,74,7],[75,1,76,2],[75,3,76,3],[75,4,76,4],[75,5,75,7],[75,9,76,9],[57,3,57,7],[60,7,60,9],[63,3,63,7],[64,7,64,9],[69,3,69,7],[71,8,71,9],[44,3,45,3],[44,4,44,5],[44,6,44,7],[49,7,49,9],[55,3,55,7],[56,3,56,7],[41,1,42,3],[41,4,41,5],[42,4,42,5],[43,2,43,7],[43,8,43,9],[44,1,45,2],[0,0,37,0],[3,4,3,5],[2,4,2,5],[1,2,1,9],[2,1,3,3],[31,3,32,3],[31,4,32,4],[31,5,31,7],[31,9,32,9],[35,3,35,7],[36,5,36,7],[10,7,10,9],[13,3,13,7],[14,3,14,7],[15,3,15,7],[18,7,18,9],[30,3,30,7],[31,1,32,2],[22,7,22,9],[25,3,25,7],[27,8,27,9],[21,3,21,7],[4,2,4,7],[4,8,4,9],[5,1,6,2],[5,3,6,3],[5,4,5,5],[5,6,5,7],[526,0,578,0],[527,2,527,9],[528,1,529,3],[528,4,528,5],[529,4,529,5],[530,2,530,7],[530,8,530,9],[531,1,532,2],[531,3,532,3],[531,4,531,5],[531,6,531,7],[539,7,539,9],[541,3,541,7],[542,3,542,7],[543,3,543,7],[546,7,546,9],[555,3,555,7],[39,0,81,0],[40,2,40,9]]}
[1,"1ª/GRD",{"$nulls":8},{"$f":"J37","v":13613.23}]
[null,"OBRA:"," PAVIMENTAÇÃO ASFÁLTICA EM CBUQ - AV. MILITÃO JOSÉ DOS SANTOS E AV. VEREADOR JOSÉ PRATES (JANAÚBA / MG)"]
[null,"Custo Unitário de Referência",null,null,"Minas Gerais"]
[{"$nulls":4}," Janeiro/2025 ",null,null,"Produção da equipe ",0.5,{"$f":"VLOOKUP(A1,ORÇAMENTO!$A$10:$L$48,7,1)","v":"GL"}]
[null,"CPU.1","MOBILIZAÇÃO E DESMOBILIZAÇÃO",{"$nulls":5},"Valores em reais (R$)"]
[null,"A - EQUIPAMENTOS",null,"Quantidade","Utilização",null,"Custo Horário",null,null,"Custo"]
[{"$nulls":4},"Operativa","Improdutiva","Produtivo","Improdutivo",null,"Horário Total"]
[null,"E9687","Caminhão carroceria com capacidade de 5 t - 115 kW",8,0.5,0.5,146.88079999999999,57.423099999999998,null,{"$f":"D8*(E8*G8+F8*H8)","v":817.21559999999999}]
[null,"E9575","Caminhão basculante com caçamba estanque com capacidade de 14 m³ - 210 kW",12,1,0,309.83940000000001,90.412199999999999,null,{"$f":"D9*(E9*G9+F9*H9)","v":3718.0727999999999}]
[{"$nulls":7},"Custo horário total de equipamentos",null,{"$f":"SUM(J8:J9)","v":4535.2883999999995}]
[null,"B - MÃO DE OBRA",null,"Quantidade","Unidade",null,"Custo Horário","Custo Horário Total"]
[null,"P9824","Servente",16,"h",null,21.3355,null,null,{"$f":"D12*G12","v":341.36799999999999}]
[{"$nulls":9},{"$f":"D13*G13","v":0}]
[null,null,null,"Custo horário total de mão de obra",{"$nulls":5},{"$f":"SUM(J12:J13)","v":341.36799999999999}]
[null,null,null,"Custo horário total de execução",{"$nulls":5},{"$f":"J10+J14","v":4876.6563999999998}]
[null,null,null,"Custo unitário de execução",{"$nulls":5},{"$f":"J15/I4","v":9753.3127999999997}]
[{"$nulls":7},"Custo do FIC",null,0]
[{"$nulls":7},"Custo do FIT",null,0]
[null,"C - MATERIAL",null,"Quantidade","Unidade",null,"Preço Unitário","Custo Unitário"]
[null,"-",0,null,0,null,0,null,null,{"$f":"D20*G20","v":0}]
[null,"-",0,null,0,null,0,null,null,{"$f":"D21*G21","v":0}]
[null,null,null,"Custo unitário total de material",{"$nulls":5},{"$f":"SUM(J20:J21)","v":0}]
[null,"D - ATIVIDADES AUXILIARES",null,"Quantidade","Unidade",null,"Custo Unitário","Custo Unitário"]
[null,5914640,"Transporte com cavalo mecânico com semirreboque com capacidade de 30 t - rodovia pavimentada",6771.8000000000011,"tkm",null,0.56999999999999995,null,null,{"$f":"D24*G24","v":3859.9260000000004}]
[null,"-",0,0,0,null,0,null,null,{"$f":"D25*G25","v":0}]
[null,null,null,"Custo total de atividades auxiliares",{"$nulls":5},{"$f":"SUM(J24:J25)","v":3859.9260000000004}]
[{"$nulls":7},"Subtotal",null,{"$f":"J16+J22+J26+J17+J18","v":13613.238799999999}]
[null,"E - TEMPO FIXO",null,"Código","Quantidade","Unidade",null,"Custo Unitário","Custo Unitário"]
[null,"-",0,"-",null,0,null,0,null,{"$f":"ROUNDDOWN(E29*H29,4)","v":0}]
[null,"-",0,"-",null,0,null,0,null,{"$f":"ROUNDDOWN(E30*H30,4)","v":0}]
[null,null,null,"Custo unitário total de tempo fixo",{"$nulls":5},{"$f":"SUM(J29:J30)","v":0}]
[null,"F - MOMENTO DE TRANSPORTE",null,"Quantidade","Unidade","DMT",null,null,null,"Custo Unitário"]
[{"$nulls":5},"LN","RP","P"]
[null,"-",0,null,"tkm"]
[null,"-",0,null,"tkm"]
[null,null,null,"Custo unitário total de transporte"]
[{"$nulls":5},"Custo unitário direto total",null,null,null,{"$f":"TRUNC(J27+J31,2)","v":13613.23}]
[null,"Obs."]
[]
[{"$f":"A1+1","v":2},"1ª/GRD",{"$nulls":8},{"$f":"J81","v":230359.32}]
[null,"OBRA:"," PAVIMENTAÇÃO ASFÁLTICA EM CBUQ - AV. MILITÃO JOSÉ DOS SANTOS E AV. VEREADOR JOSÉ PRATES (JANAÚBA / MG)"]
[null,"Custo Unitário de Referência",null,null,"Minas Gerais"]
[{"$nulls":4}," Janeiro/2025 ",null,null,"Produção da equipe ",0.125,{"$f":"VLOOKUP(A40,ORÇAMENTO!$A$10:$L$48,7,1)","v":"GL"},"8 MESES"]
[null,"CPU.2","ADMINISTRAÇÃO LOCAL ",{"$nulls":5},"Valores em reais (R$)"]
[null,"A - EQUIPAMENTOS",null,"Quantidade","Utilização",null,"Custo Horário",null,null,"Custo"]
[{"$nulls":4},"Operativa","Improdutiva","Produtivo","Improdutivo",null,"Horário Total"]
[null,"-",0,null,null,null,0,0,null,{"$f":"D47*(E47*G47+F47*H47)","v":0}]
[null,"-",0,null,null,null,0,0,null,{"$f":"D48*(E48*G48+F48*H48)","v":0}]
[{"$nulls":7},"Custo horário total de equipamentos",null,{"$f":"SUM(J47:J48)","v":0}]
[null,"B - MÃO DE OBRA",null,"Quantidade","Unidade",null,"Custo Horário","Custo Horário Total"]
[null,"P9812","Engenheiro",0.21589364066339911,"mês",null,26055.551500000001,null,null,{"$f":"D51*G51","v":5625.2278728276897}]
[null,"P9840","Encarregado geral",1,"mês",null,11986.486649999999,null,null,{"$f":"D52*G52","v":11986.486649999999}]
[null,"P9876","Técnico de segurança do trabalho",1,"mês",null,6276.4316800000006,null,null,6276.4316800000006]
[null,"P9858","Laboratorista",0.5,"mês",null,5101.8165600000002,null,null,2550.9082800000001]
[null,"P9806","Auxiliar administrativo",0.5,"mês",null,3577.6424800000004,null,null,1788.8212400000002]
[null,null,null,"Custo horário total de mão de obra",{"$nulls":5},{"$f":"SUM(J51:J55)","v":28227.875722827692}]
[null,null,null,"Custo horário total de execução",{"$nulls":5},{"$f":"J49+J56","v":28227.875722827692}]
[null,null,null,"Custo unitário de execução",{"$nulls":5},{"$f":"J57/I43","v":225823.00578262153}]
[{"$nulls":7},"Custo do FIC"]
[{"$nulls":7},"Custo do FIT",null,"-"]
[null,"C - MATERIAL",null,"Quantidade","Unidade",null,"Preço Unitário","Custo Unitário"]
[null,"-",0,0,0,null,0,null,null,{"$f":"D62*G62","v":0}]
[null,"-",0,0,0,null,0,null,null,0]
[null,null,null,"Custo unitário total de material",{"$nulls":5},{"$f":"SUM(J62:J63)","v":0}]
[null,"D - ATIVIDADES AUXILIARES",null,"Quantidade","Unidade",null,"Custo Unitário","Custo Unitário"]
[null,14250,"Energia Elétrica",480,"kwh",null,0.95,null,null,{"$f":"D66*G66","v":456}]
[null,44480,"Tarifa A - Água e Esgoto",48,"m³",null,17.97,null,null,{"$f":"D67*G67","v":862.56}]
[null,5212560,"Placa de advertência para sinalização de obras montada em suporte metálico móvel, lado 1,00 m - utilização de 600 ciclos - fornecimento, 01 implantação e 01 retirada diária",704,"un.dia",null,3.89,null,null,{"$f":"D68*G68","v":2738.56}]
[null,"Cotação","Telefone",8,"mês",null,59.9,null,null,{"$f":"D69*G69","v":479.2}]
[null,null,null,"Custo total de atividades auxiliares",{"$nulls":5},{"$f":"SUM(J66:J69)","v":4536.32}]
[{"$nulls":7},"Subtotal",null,{"$f":"J58+J64+J70","v":230359.32578262154}]
[null,"E - TEMPO FIXO",null,"Código","Quantidade","Unidade",null,"Custo Unitário","Custo Unitário"]
[null,"-",0,"-",0,"t",null,0,null,{"$f":"ROUNDDOWN(E73*H73,4)","v":0}]
[null,"-",0,"-",0,"t",null,0,null,{"$f":"ROUNDDOWN(E74*H74,4)","v":0}]
[null,null,null,"Custo unitário total de tempo fixo",{"$nulls":5},{"$f":"SUM(J73:J74)","v":0}]
[null,"F - MOMENTO DE TRANSPORTE",null,"Quantidade","Unidade","DMT",null,null,null,"Custo Unitário"]
[{"$nulls":5},"LN","RP","P"]
[null,"-",0,null,"tkm"]
[null,"-",0,null,"tkm"]
[null,null,null,"Custo unitário total de transporte"]
[{"$nulls":5},"Custo unitário direto total",null,null,null,{"$f":"TRUNC(J71+J75,2)","v":230359.32}]
[null,"Obs."]
[]
[{"$f":"A40+1","v":3},"1ª/GRD",{"$nulls":8},{"$f":"J120","v":18289.8}]
[null,"OBRA:"," PAVIMENTAÇÃO ASFÁLTICA EM CBUQ - AV. MILITÃO JOSÉ DOS SANTOS E AV. VEREADOR JOSÉ PRATES (JANAÚBA / MG)"]
[null,"Custo Unitário de Referência",null,null,"Minas Gerais"]
[{"$nulls":4}," Janeiro/2025 ",null,null,"Produção da equipe ",1,{"$f":"VLOOKUP(A84,ORÇAMENTO!$A$10:$L$48,7,1)","v":"GL"}]
[null,"CPU.3","CANTEIRO DE OBRAS ",{"$nulls":5},"Valores em reais (R$)"]
[null,"A - EQUIPAMENTOS",null,"Quantidade","Utilização",null,"Custo Horário",null,null,"Custo"]
[{"$nulls":4},"Operativa","Improdutiva","Produtivo","Improdutivo",null,"Horário Total"]
[null,"-",0,null,null,null,0,0,null,{"$f":"D91*(E91*G91+F91*H91)","v":0}]
[null,"-",0,null,null,null,0,0,null,{"$f":"D92*(E92*G92+F92*H92)","v":0}]
[{"$nulls":7},"Custo horário total de equipamentos",null,{"$f":"SUM(J91:J92)","v":0}]
[null,"B - MÃO DE OBRA",null,"Quantidade","Unidade",null,"Custo Horário","Custo Horário Total"]
[null,"P9824","Servente",8,"h",null,21.3355,null,null,{"$f":"D95*G95","v":170.684}]
[null,"P9808","Carpinteiro",8,"h",null,26.4529,null,null,{"$f":"D96*G96","v":211.6232}]
[null,null,null,"Custo horário total de mão de obra",{"$nulls":5},{"$f":"SUM(J95:J96)","v":382.30719999999997}]
[null,null,null,"Custo horário total de execução",{"$nulls":5},{"$f":"J93+J97","v":382.30719999999997}]
[null,null,null,"Custo unitário de execução",{"$nulls":5},{"$f":"J98/I87","v":382.30719999999997}]
[{"$nulls":7},"Custo do FIC",null,"-"]
[{"$nulls":7},"Custo do FIT",null,"-"]
[null,"C - MATERIAL",null,"Quantidade","Unidade",null,"Preço Unitário","Custo Unitário"]
[null,"M0053","Tela plástica em polipropileno na cor laranja para tapume - L = 1,2 m",100,"m",null,1.7749999999999999,null,null,{"$f":"D103*G103","v":177.5}]
[null,"-",0,0,0,null,0,null,null,{"$f":"D104*G104","v":0}]
[null,null,null,"Custo unitário total de material",{"$nulls":5},{"$f":"SUM(J103:J104)","v":177.5}]
[null,"D - ATIVIDADES AUXILIARES",null,"Quantidade","Unidade",null,"Custo Unitário","Custo Unitário"]
[null,10775,"Locação de container 2,30 X 6,00 m, alt. 2,50 m, com 1 sanitário, para escritório, completo, sem divisórias internas",8,"mês",null,985,null,null,{"$f":"D107*G107","v":7880}]
[null,10779,"Locação de container 2,30 X 4,30 m, alt. 2,50 M, p/ sanitário, c/ 5 bacias, 1 lavatório e 4 mictórios",8,"mês",null,1231.25,null,null,{"$f":"D108*G108","v":9850}]
[null,null,null,"Custo total de atividades auxiliares",{"$nulls":5},{"$f":"SUM(J107:J108)","v":17730}]
[{"$nulls":7},"Subtotal",null,{"$f":"J99+J105+J109","v":18289.807199999999}]
[null,"E - TEMPO FIXO",null,"Código","Quantidade","Unidade",null,"Custo Unitário","Custo Unitário"]
[null,"-",0,"-",0,"t",null,0,null,{"$f":"ROUNDDOWN(E112*H112,4)","v":0}]
[null,"-",0,"-",0,"t",null,0,null,{"$f":"ROUNDDOWN(E113*H113,4)","v":0}]
[null,null,null,"Custo unitário total de tempo fixo",{"$nulls":5},{"$f":"SUM(J112:J113)","v":0}]
[null,"F - MOMENTO DE TRANSPORTE",null,"Quantidade","Unidade","DMT",null,null,null,"Custo Unitário"]
[{"$nulls":5},"LN","RP","P"]
[null,"-",0,0,"tkm"]
[null,"-",0,0,"tkm"]
[null,null,null,"Custo unitário total de transporte"]
[{"$nulls":5},"Custo unitário direto total",null,null,null,{"$f":"TRUNC(J110+J114,2)","v":18289.8}]
[null,"Obs."]
[]
[{"$f":"A84+1","v":4},"1ª/GRD",{"$nulls":8},{"$f":"J161","v":351.42}]
[null,"OBRA:"," PAVIMENTAÇÃO ASFÁLTICA EM CBUQ - AV. MILITÃO JOSÉ DOS SANTOS E AV. VEREADOR JOSÉ PRATES (JANAÚBA / MG)"]
[null,"Custo Unitário de Referência",null,null,"Minas Gerais"]
[{"$nulls":4}," Janeiro/2025 ",null,null,"Produção da equipe ",1,{"$f":"VLOOKUP(A123,ORÇAMENTO!$A$10:$L$48,7,1)","v":"M2"}]
[null,103689,"PLACA DE OBRA EM CHAPA DE AÇO GALVANIZADO",{"$nulls":5},"Valores em reais (R$)"]
[null,"A - EQUIPAMENTOS",null,"Quantidade","Utilização",null,"Custo Horário",null,null,"Custo"]
[{"$nulls":4},"Operativa","Improdutiva","Produtivo","Improdutivo",null,"Horário Total"]
[null,"-",0,null,null,null,0,0,null,{"$f":"D130*(E130*G130+F130*H130)","v":0}]
[null,"-",0,null,null,null,0,0,null,{"$f":"D131*(E131*G131+F131*H131)","v":0}]
[{"$nulls":7},"Custo horário total de equipamentos",null,{"$f":"SUM(J130:J131)","v":0}]
[null,"B - MÃO DE OBRA",null,"Quantidade","Unidade",null,"Custo Horário","Custo Horário Total"]
[null,"P9824","Servente",1.1186,"h",null,21.3355,null,null,{"$f":"D134*G134","v":23.8658903}]
[null,"P9808","Carpinteiro",0.37290000000000001,"h",null,26.4529,null,null,{"$f":"D135*G135","v":9.8642864100000001}]
[null,null,null,"Custo horário total de mão de obra",{"$nulls":5},{"$f":"SUM(J134:J135)","v":33.730176710000002}]
[null,null,null,"Custo horário total de execução",{"$nulls":5},{"$f":"J132+J136","v":33.730176710000002}]
[null,null,null,"Custo unitário de execução",{"$nulls":5},{"$f":"J137/I126","v":33.730176710000002}]
[{"$nulls":7},"Custo do FIC",null,"-"]
[{"$nulls":7},"Custo do FIT",null,"-"]
[null,"C - MATERIAL",null,"Quantidade","Unidade",null,"Preço Unitário","Custo Unitário"]
[null,"M1358","Sarrafo em madeira de terceira - E = 2,5 cm e L = 5 cm",6.4165999999999999,"m",null,1.9665999999999999,null,null,{"$f":"D142*G142","v":12.618885559999999}]
[null,"M1205","Prego de ferro",2.4500000000000001E-2,"kg",null,16.544499999999999,null,null,{"$f":"D143*G143","v":0.40534025000000001}]
[null,"M0998","Madeira estrutural de eucalipto",2.2608E-2,"m³",null,2418.0391,null,null,{"$f":"D144*G144","v":54.6670279728}]
[null,4813,"Placa de obra (para construção civil) em chapa galvanizada *N. 22*, adesivada, de *2,4 X 1,2* m (sem postes para fixação)",1,"m²",null,250,null,null,250]
[null,null,null,"Custo unitário total de material",{"$nulls":5},{"$f":"SUM(J142:J145)","v":317.6912537828}]
[null,"D - ATIVIDADES AUXILIARES",null,"Quantidade","Unidade",null,"Custo Unitário","Custo Unitário"]
[null,"-",0,0,0,null,0,null,null,{"$f":"D148*G148","v":0}]
[null,"-",0,0,0,null,0,null,null,{"$f":"D149*G149","v":0}]
[null,null,null,"Custo total de atividades auxiliares",{"$nulls":5},{"$f":"SUM(J148:J149)","v":0}]
[{"$nulls":7},"Subtotal",null,{"$f":"J138+J146+J150","v":351.42143049280003}]
[null,"E - TEMPO FIXO",null,"Código","Quantidade","Unidade",null,"Custo Unitário","Custo Unitário"]
[null,"-",0,"-",0,"t",null,0,null,{"$f":"ROUNDDOWN(E153*H153,4)","v":0}]
[null,"-",0,"-",0,"t",null,0,null,{"$f":"ROUNDDOWN(E154*H154,4)","v":0}]
[null,null,null,"Custo unitário total de tempo fixo",{"$nulls":5},{"$f":"SUM(J153:J154)","v":0}]
[null,"F - MOMENTO DE TRANSPORTE",null,"Quantidade","Unidade","DMT",null,null,null,"Custo Unitário"]
[{"$nulls":5},"LN","RP","P"]
[null,"-",0,0,"tkm"]
[null,"-",0,0,"tkm"]
[null,null,null,"Custo unitário total de transporte"]
[{"$nulls":5},"Custo unitário direto total",null,null,null,{"$f":"TRUNC(J151+J155,2)","v":351.42}]
[null,"Obs."]
[]
[6,"1ª/GRD",{"$nulls":8},{"$f":"J202","v":0.49}]
[null,"OBRA:"," PAVIMENTAÇÃO ASFÁLTICA EM CBUQ - AV. MILITÃO JOSÉ DOS SANTOS E AV. VEREADOR JOSÉ PRATES (JANAÚBA / MG)"]
[null,"Custo Unitário de Referência",null,null,"Minas Gerais"]
[{"$nulls":4}," Janeiro/2025 ",null,null,"Produção da equipe ",1,{"$f":"VLOOKUP(A164,ORÇAMENTO!$A$10:$L$48,7,1)","v":"M2"}]
[null,78472,"SERVIÇOS TOPOGRÁFICOS PARA PAVIMENTAÇÃO, INCLUSIVE LEVANTAMENTO PLANIALTIMÉTRICO CADASTRAL, GERAÇÃO DE NOTAS DE SERVIÇO, SEÇÕES TRANSVERSAIS E GREIDE, ESTAQUEAMENTO E ACOMPANHAMENTO EXECUTIVO",{"$nulls":5},"Valores em reais (R$)"]
[null,"A - EQUIPAMENTOS",null,"Quantidade","Utilização",null,"Custo Horário",null,null,"Custo"]
[{"$nulls":4},"Operativa","Improdutiva","Produtivo","Improdutivo",null,"Horário Total"]
[null,92145,"Caminhonete cabine simples com motor 1.6 flex, câmbio manual, potência 101/104 cv, 2 portas",5.0000000000000001E-4,1,0,76.5,0,null,{"$f":"D171*(E171*G171+F171*H171)","v":3.8249999999999999E-2}]
[null,"-",0,0,1,0,0,0,null,{"$f":"D172*(E172*G172+F172*H172)","v":0}]
[{"$nulls":7},"Custo horário total de equipamentos",null,{"$f":"SUM(J171:J172)","v":3.8249999999999999E-2}]
[null,"B - MÃO DE OBRA",null,"Quantidade","Unidade",null,"Custo Horário","Custo Horário Total"]
[null,"P9949","Topógrafo",1.590909090909091E-5,"mês",null,6816.9715999999999,null,null,{"$f":"D175*G175","v":0.10845182090909092}]
[null,"P9950","Auxiliar de topografia",1.590909090909091E-5,"mês",null,6157.8463000000002,null,null,{"$f":"D176*G176","v":9.7965736590909097E-2}]
[null,"P9824","Servente",7.4999999999999997E-3,"h",null,21.3355,null,null,{"$f":"D177*G177","v":0.16001625}]
[null,"P9848","Desenhista",9.090909090909091E-6,"mês",null,10307.748600000001,null,null,{"$f":"D178*G178","v":9.3706805454545461E-2}]
[null,null,null,"Custo horário total de mão de obra",{"$nulls":5},{"$f":"SUM(J175:J178)","v":0.46014061295454545}]
[null,null,null,"Custo horário total de execução",{"$nulls":5},{"$f":"J173+J179","v":0.49839061295454545}]
[null,null,null,"Custo unitário de execução",{"$nulls":5},{"$f":"J180/I167","v":0.49839061295454545}]
[{"$nulls":7},"Custo do FIC",null,"-"]
[{"$nulls":7},"Custo do FIT",null,"-"]
[null,"C - MATERIAL",null,"Quantidade","Unidade",null,"Preço Unitário","Custo Unitário"]
[null,"-",0,0,0,null,0,null,null,{"$f":"D185*G185","v":0}]
[null,"-",0,0,0,null,0,null,null,0]
[null,null,null,"Custo unitário total de material",{"$nulls":5},{"$f":"SUM(J185:J186)","v":0}]
[null,"D - ATIVIDADES AUXILIARES",null,"Quantidade","Unidade",null,"Custo Unitário","Custo Unitário"]
[null,"-",0,0,0,null,0,null,null,{"$f":"D189*G189","v":0}]
[null,"-",0,0,0,null,0,null,null,{"$f":"D190*G190","v":0}]
[null,null,null,"Custo total de atividades auxiliares",{"$nulls":5},{"$f":"SUM(J189:J190)","v":0}]
[{"$nulls":7},"Subtotal",null,{"$f":"J181+J187+J191","v":0.49839061295454545}]
[null,"E - TEMPO FIXO",null,"Código","Quantidade","Unidade",null,"Custo Unitário","Custo Unitário"]
[null,"-",0,"-",0,"t",null,0,null,{"$f":"ROUNDDOWN(E194*H194,4)","v":0}]
[null,"-",0,"-",0,"t",null,0,null,{"$f":"ROUNDDOWN(E195*H195,4)","v":0}]
[null,null,null,"Custo unitário total de tempo fixo",{"$nulls":5},{"$f":"SUM(J194:J195)","v":0}]
[null,"F - MOMENTO DE TRANSPORTE",null,"Quantidade","Unidade","DMT",null,null,null,"Custo Unitário"]
[{"$nulls":5},"LN","RP","P"]
[null,"-",0,0,"tkm"]
[null,"-",0,0,"tkm"]
[null,null,null,"Custo unitário total de transporte"]
[{"$nulls":5},"Custo unitário direto total",null,null,null,{"$f":"TRUNC(J192+J196,2)","v":0.49}]
[null,"Obs."]
[]
[{"$f":"A164+1","v":7},"1ª/GRD",{"$nulls":8},{"$f":"J241","v":6.74}]
[null,"OBRA:"," PAVIMENTAÇÃO ASFÁLTICA EM CBUQ - AV. MILITÃO JOSÉ DOS SANTOS E AV. VEREADOR JOSÉ PRATES (JANAÚBA / MG)"]
[null,"Custo Unitário de Referência",null,null,"Minas Gerais"]
[{"$nulls":4}," Janeiro/2025 ",null,null,"Produção da equipe ",230.19,{"$f":"VLOOKUP(A205,ORÇAMENTO!$A$10:$L$48,7,1)","v":"M3"}]
[null,5502140,"ESCAVAÇÃO, CARGA E TRANSPORTE DE MATERIAL DE 1ª CATEGORIA - DMT 1.000 A 1.200M, CAMINHO DE SERVIÇO EM REVESTIMENTO PRIMÁRIO",{"$nulls":5},"Valores em reais (R$)"]
[null,"A - EQUIPAMENTOS",null,"Quantidade","Utilização",null,"Custo Horário",null,null,"Custo"]
[{"$nulls":4},"Operativa","Improdutiva","Produtivo","Improdutivo",null,"Horário Total"]
[null,"E9667","Caminhão basculante com capacidade de 14 m³ - 210 kW",4,0.97,0.03,309.83940000000001,90.412199999999999,null,{"$f":"D212*(E212*G212+F212*H212)","v":1213.0263359999999}]
[null,"E9515","Escavadeira hidráulica sobre esteiras com caçamba com capacidade de 1,56 m³ - 118 kW",1,1,0,287.62189999999998,129.0472,null,{"$f":"D213*(E213*G213+F213*H213)","v":287.62189999999998}]
[{"$nulls":7},"Custo horário total de equipamentos",null,{"$f":"SUM(J212:J213)","v":1500.648236}]
[null,"B - MÃO DE OBRA",null,"Quantidade","Unidade",null,"Custo Horário","Custo Horário Total"]
[null,"P9824","Servente",1,"h",null,21.3355,null,null,{"$f":"D216*G216","v":21.3355}]
[{"$nulls":9},{"$f":"D217*G217","v":0}]
[null,null,null,"Custo horário total de mão de obra",{"$nulls":5},{"$f":"SUM(J216:J217)","v":21.3355}]
[null,null,null,"Custo horário total de execução",{"$nulls":5},{"$f":"J214+J218","v":1521.9837359999999}]
[null,null,null,"Custo unitário de execução",{"$nulls":5},{"$f":"J219/I208","v":6.6118586211390591}]
[{"$nulls":7},"Custo do FIC",null,0.1313]
[{"$nulls":7},"Custo do FIT",null,0]
[null,"C - MATERIAL",null,"Quantidade","Unidade",null,"Preço Unitário","Custo Unitário"]
[null,"-",0,null,0,null,0,null,null,{"$f":"D224*G224","v":0}]
[null,"-",0,null,0,null,0,null,null,{"$f":"D225*G225","v":0}]
[null,null,null,"Custo unitário total de material",{"$nulls":5},{"$f":"SUM(J224:J225)","v":0}]
[null,"D - ATIVIDADES AUXILIARES",null,"Quantidade","Unidade",null,"Custo Unitário","Custo Unitário"]
[null,"-",0,0,0,null,0,null,null,{"$f":"D228*G228","v":0}]
[null,"-",0,0,0,null,0,null,null,{"$f":"D229*G229","v":0}]
[null,null,null,"Custo total de atividades auxiliares",{"$nulls":5},{"$f":"SUM(J228:J229)","v":0}]
[{"$nulls":7},"Subtotal",null,{"$f":"J220+J226+J230+J221+J222","v":6.7431586211390595}]
[null,"E - TEMPO FIXO",null,"Código","Quantidade","Unidade",null,"Custo Unitário","Custo Unitário"]
[null,"-",0,"-",0,"t",null,0,null,{"$f":"ROUNDDOWN(E233*H233,4)","v":0}]
[null,"-",0,"-",0,"t",null,0,null,{"$f":"ROUNDDOWN(E234*H234,4)","v":0}]
[null,null,null,"Custo unitário total de tempo fixo",{"$nulls":5},{"$f":"SUM(J233:J234)","v":0}]
[null,"F - MOMENTO DE TRANSPORTE",null,"Quantidade","Unidade","DMT",null,null,null,"Custo Unitário"]
[{"$nulls":5},"LN","RP","P"]
[null,"-",0,null,"tkm","5914449","5914464","5914479"]
[null,"-",0,null,"tkm","5914449","5914464","5914479"]
[null,null,null,"Custo unitário total de transporte"]
[{"$nulls":5},"Custo unitário direto total",null,null,null,{"$f":"TRUNC(J231+J235,2)","v":6.74}]
[null,"Obs."]
[]
[{"$f":"A205+1","v":8},"1ª/GRD",{"$nulls":8},{"$f":"J280","v":1.44}]
[null,"OBRA:"," PAVIMENTAÇÃO ASFÁLTICA EM CBUQ - AV. MILITÃO JOSÉ DOS SANTOS E AV. VEREADOR JOSÉ PRATES (JANAÚBA / MG)"]
[null,"Custo Unitário de Referência",null,null,"Minas Gerais"]
[{"$nulls":4}," Janeiro/2025 ",null,null,"Produção da equipe ",176.81,{"$f":"VLOOKUP(A244,ORÇAMENTO!$A$10:$L$48,7,1)","v":"M3"}]
[null,4413942,"ESPALHAMENTO DE MATERIAL EM BOTA FORA",{"$nulls":5},"Valores em reais (R$)"]
[null,"A - EQUIPAMENTOS",null,"Quantidade","Utilização",null,"Custo Horário",null,null,"Custo"]
[{"$nulls":4},"Operativa","Improdutiva","Produtivo","Improdutivo",null,"Horário Total"]
[null,"E9540","Trator sobre esteiras com lâmina - 127 kW",1,0.5,0.5,323.26330000000002,130.7561,null,{"$f":"D251*(E251*G251+F251*H251)","v":227.00970000000001}]
[null,"-",0,0,0,0,0,0,null,{"$f":"D252*(E252*G252+F252*H252)","v":0}]
[{"$nulls":7},"Custo horário total de equipamentos",null,{"$f":"SUM(J251:J252)","v":227.00970000000001}]
[null,"B - MÃO DE OBRA",null,"Quantidade","Unidade",null,"Custo Horário","Custo Horário Total"]
[null,"P9824","Servente",1,"h",null,21.3355,null,null,{"$f":"D255*G255","v":21.3355}]
[{"$nulls":9},{"$f":"D256*G256","v":0}]
[null,null,null,"Custo horário total de mão de obra",{"$nulls":5},{"$f":"SUM(J255:J256)","v":21.3355}]
[null,null,null,"Custo horário total de execução",{"$nulls":5},{"$f":"J253+J257","v":248.34520000000001}]
[null,null,null,"Custo unitário de execução",{"$nulls":5},{"$f":"J258/I247","v":1.4045879757932245}]
[{"$nulls":7},"Custo do FIC",null,3.9800000000000002E-2]
[{"$nulls":7},"Custo do FIT",null,0]
[null,"C - MATERIAL",null,"Quantidade","Unidade",null,"Preço Unitário","Custo Unitário"]
[null,"-",0,0,0,null,0,null,null,{"$f":"D263*G263","v":0}]
[null,"-",0,0,0,null,0,null,null,0]
[null,null,null,"Custo unitário total de material",{"$nulls":5},{"$f":"SUM(J263:J264)","v":0}]
[null,"D - ATIVIDADES AUXILIARES",null,"Quantidade","Unidade",null,"Custo Unitário","Custo Unitário"]
[null,"-",0,0,0,null,0,null,null,{"$f":"D267*G267","v":0}]
[null,"-",0,0,0,null,0,null,null,{"$f":"D268*G268","v":0}]
[null,null,null,"Custo total de atividades auxiliares",{"$nulls":5},{"$f":"SUM(J267:J268)","v":0}]
[{"$nulls":7},"Subtotal",null,{"$f":"J259+J265+J269+J260+J261","v":1.4443879757932245}]
[null,"E - TEMPO FIXO",null,"Código","Quantidade","Unidade",null,"Custo Unitário","Custo Unitário"]
[null,"-",0,"-",0,"t",null,0,null,{"$f":"ROUNDDOWN(E272*H272,4)","v":0}]
[null,"-",0,"-",0,"t",null,0,null,{"$f":"ROUNDDOWN(E273*H273,4)","v":0}]
[null,null,null,"Custo unitário total de tempo fixo",{"$nulls":5},{"$f":"SUM(J272:J273)","v":0}]
[null,"F - MOMENTO DE TRANSPORTE",null,"Quantidade","Unidade","DMT",null,null,null,"Custo Unitário"]
[{"$nulls":5},"LN","RP","P"]
[null,"-",0,0,"tkm"]
[null,"-",0,0,"tkm"]
[null,null,null,"Custo unitário total de transporte"]
[{"$nulls":5},"Custo unitário direto total",null,null,null,{"$f":"TRUNC(J270+J274,2)","v":1.44}]
[null,"Obs."]
[]
[{"$f":"A244+1","v":9},"1ª/GRD",{"$nulls":8},{"$f":"J322","v":5.03}]
[null,"OBRA:"," PAVIMENTAÇÃO ASFÁLTICA EM CBUQ - AV. MILITÃO JOSÉ DOS SANTOS E AV. VEREADOR JOSÉ PRATES (JANAÚBA / MG)"]
[null,"Custo Unitário de Referência",null,null,"Minas Gerais"]
[{"$nulls":4}," Janeiro/2025 ",null,null,"Produção da equipe ",168.2,{"$f":"VLOOKUP(A283,ORÇAMENTO!$A$10:$L$48,7,1)","v":"M3"}]
[null,5502978,"COMPACTAÇÃO DE ATERROS A 100% DO PROCTOR NORMAL",{"$nulls":5},"Valores em reais (R$)"]
[null,"A - EQUIPAMENTOS",null,"Quantidade","Utilização",null,"Custo Horário",null,null,"Custo"]
[{"$nulls":4},"Operativa","Improdutiva","Produtivo","Improdutivo",null,"Horário Total"]
[null,"E9571","Caminhão tanque com capacidade de 10.000 l - 188 kW",1,0.9,0.1,323.59019999999998,80.173299999999998,null,{"$f":"D290*(E290*G290+F290*H290)","v":299.24851000000001}]
[null,"E9518","Grade de 24 discos rebocável de D = 60 cm (24\")",1,0.52,0.48,4.9436,3.4426000000000001,null,{"$f":"D291*(E291*G291+F291*H291)","v":4.2231199999999998}]
[null,"E9524","Motoniveladora - 93 kW",1,0.28999999999999998,0.71,288.51479999999998,125.7629,null,172.96095099999997]
[null,"E9685","Rolo compactador pé de carneiro vibratório autopropelido por pneus de 11,6 t - 82 kW",1,1,0,225.9264,101.55289999999999,null,225.9264]
[null,"E9577","Trator agrícola sobre pneus - 77 kW",1,0.52,0.48,152.69229999999999,55.394399999999997,null,{"$f":"D294*(E294*G294+F294*H294)","v":105.98930799999999}]
[{"$nulls":7},"Custo horário total de equipamentos",null,{"$f":"SUM(J290:J294)","v":808.34828900000002}]
[null,"B - MÃO DE OBRA",null,"Quantidade","Unidade",null,"Custo Horário","Custo Horário Total"]
[null,"P9824","Servente",1,"h",null,21.3355,null,null,{"$f":"D297*G297","v":21.3355}]
[null,"-",null,0,0,null,0,null,null,{"$f":"D298*G298","v":0}]
[null,null,null,"Custo horário total de mão de obra",{"$nulls":5},{"$f":"SUM(J297:J298)","v":21.3355}]
[null,null,null,"Custo horário total de execução",{"$nulls":5},{"$f":"J295+J299","v":829.68378900000005}]
[null,null,null,"Custo unitário de execução",{"$nulls":5},{"$f":"J300/I286","v":4.9327216944114154}]
[{"$nulls":7},"Custo do FIC",null,0.1008]
[{"$nulls":7},"Custo do FIT",null,0]
[null,"C - MATERIAL",null,"Quantidade","Unidade",null,"Preço Unitário","Custo Unitário"]
[null,"-",0,0,0,null,0,null,null,{"$f":"D305*G305","v":0}]
[null,"-",0,0,0,null,0,null,null,{"$f":"D306*G306","v":0}]
[null,null,null,"Custo unitário total de material",{"$nulls":5},{"$f":"SUM(J305:J306)","v":0}]
[null,"D - ATIVIDADES AUXILIARES",null,"Quantidade","Unidade",null,"Custo Unitário","Custo Unitário"]
[null,"-",0,0,0,null,0,null,null,{"$f":"D309*G309","v":0}]
[null,"-",0,0,0,null,0,null,null,{"$f":"D310*G310","v":0}]
[null,null,null,"Custo total de atividades auxiliares",{"$nulls":5},{"$f":"SUM(J309:J310)","v":0}]
[{"$nulls":7},"Subtotal",null,{"$f":"J301+J307+J311+J302+J303","v":5.0335216944114158}]
[null,"E - TEMPO FIXO",null,"Código","Quantidade","Unidade",null,"Custo Unitário","Custo Unitário"]
[null,"-",0,"-",0,"t",null,0,null,{"$f":"ROUNDDOWN(E314*H314,4)","v":0}]
[null,"-",0,"-",0,"t",null,0,null,{"$f":"ROUNDDOWN(E315*H315,4)","v":0}]
[null,null,null,"Custo unitário total de tempo fixo",{"$nulls":5},{"$f":"SUM(J314:J315)","v":0}]
[null,"F - MOMENTO DE TRANSPORTE",null,"Quantidade","Unidade","DMT",null,null,null,"Custo Unitário"]
[{"$nulls":5},"LN","RP","P"]
[null,"-",0,0,"tkm","5914449","5914464","5914479"]
[null,"-",0,0,"tkm","5914449","5914464","5914479"]
[null,null,null,"Custo unitário total de transporte"]
[{"$nulls":5},"Custo unitário direto total",null,null,null,{"$f":"TRUNC(J312+J316,2)","v":5.03}]
[null,"Obs."]
[]
[{"$f":"A283+1","v":10},"1ª/GRD",{"$nulls":8},{"$f":"J365","v":1.54}]
[null,"OBRA:"," PAVIMENTAÇÃO ASFÁLTICA EM CBUQ - AV. MILITÃO JOSÉ DOS SANTOS E AV. VEREADOR JOSÉ PRATES (JANAÚBA / MG)"]
[null,"Custo Unitário de Referência",null,null,"Minas Gerais"]
[{"$nulls":4}," Janeiro/2025 ",null,null,"Produção da equipe ",672.8,{"$f":"VLOOKUP(A325,ORÇAMENTO!$A$10:$L$48,7,1)","v":"M2"}]
[null,4011209,"REGULARIZAÇÃO E COMPACTAÇÃO DO SUBLEITO ",{"$nulls":5},"Valores em reais (R$)"]
[null,"A - EQUIPAMENTOS",null,"Quantidade","Utilização",null,"Custo Horário",null,null,"Custo"]
[{"$nulls":4},"Operativa","Improdutiva","Produtivo","Improdutivo",null,"Horário Total"]
[null,"E9571","Caminhão tanque com capacidade de 10.000 l - 188 kW",1,0.61,0.39,323.59019999999998,80.173299999999998,null,{"$f":"D332*(E332*G332+F332*H332)","v":228.65760899999998}]
[null,"E9518","Grade de 24 discos rebocável de D = 60 cm (24\")",1,0.41,0.59000000000000008,4.9436,3.4426000000000001,null,{"$f":"D333*(E333*G333+F333*H333)","v":4.0580099999999995}]
[null,"E9524","Motoniveladora - 93 kW",1,0.43,0.57000000000000006,288.51479999999998,125.7629,null,195.746217]
[null,"E9762","Rolo compactador de pneus autopropelido de 27 t - 85 kW",1,0.96,4.0000000000000036E-2,255.65049999999999,124.5621,null,250.40696399999999]
[null,"E9685","Rolo compactador pé de carneiro vibratório autopropelido por pneus de 11,6 t - 82 kW",1,1,0,225.9264,101.55289999999999,null,225.9264]
[null,"E9577","Trator agrícola sobre pneus - 77 kW",1,0.41,0.59000000000000008,152.69229999999999,55.394399999999997,null,95.286538999999991]
[{"$nulls":7},"Custo horário total de equipamentos",null,{"$f":"SUM(J332:J337)","v":1000.081739}]
[null,"B - MÃO DE OBRA",null,"Quantidade","Unidade",null,"Custo Horário","Custo Horário Total"]
[null,"P9824","Servente",1,"h",null,21.3355,null,null,{"$f":"D340*G340","v":21.3355}]
[null,"-",null,0,0,null,0,null,null,{"$f":"D341*G341","v":0}]
[null,null,null,"Custo horário total de mão de obra",{"$nulls":5},{"$f":"SUM(J340:J341)","v":21.3355}]
[null,null,null,"Custo horário total de execução",{"$nulls":5},{"$f":"J338+J342","v":1021.417239}]
[null,null,null,"Custo unitário de execução",{"$nulls":5},{"$f":"J343/I328","v":1.5181587975624258}]
[{"$nulls":7},"Custo do FIC",null,2.2700000000000001E-2]
[{"$nulls":7},"Custo do FIT",null,0]
[null,"C - MATERIAL",null,"Quantidade","Unidade",null,"Preço Unitário","Custo Unitário"]
[null,"-",0,null,0,null,0,null,null,{"$f":"D348*G348","v":0}]
[null,"-",0,null,0,null,0,null,null,{"$f":"D349*G349","v":0}]
[null,null,null,"Custo unitário total de material",{"$nulls":5},{"$f":"SUM(J348:J349)","v":0}]
[null,"D - ATIVIDADES AUXILIARES",null,"Quantidade","Unidade",null,"Custo Unitário","Custo Unitário"]
[null,"-",0,0,0,null,0,null,null,{"$f":"D352*G352","v":0}]
[null,"-",0,0,0,null,0,null,null,{"$f":"D353*G353","v":0}]
[null,null,null,"Custo total de atividades auxiliares",{"$nulls":5},{"$f":"SUM(J352:J353)","v":0}]
[{"$nulls":7},"Subtotal",null,{"$f":"J344+J350+J354+J345+J346","v":1.5408587975624257}]
[null,"E - TEMPO FIXO",null,"Código","Quantidade","Unidade",null,"Custo Unitário","Custo Unitário"]
[null,"-",0,"-",0,"t",null,0,null,{"$f":"ROUNDDOWN(E357*H357,4)","v":0}]
[null,"-",0,"-",0,"t",null,0,null,{"$f":"ROUNDDOWN(E358*H358,4)","v":0}]
[null,null,null,"Custo unitário total de tempo fixo",{"$nulls":5},{"$f":"SUM(J357:J358)","v":0}]
[null,"F - MOMENTO DE TRANSPORTE",null,"Quantidade","Unidade","DMT",null,null,null,"Custo Unitário"]
[{"$nulls":5},"LN","RP","P"]
[null,"-",0,null,"tkm","5914449","5914464","5914479"]
[null,"-",0,null,"tkm","5914449","5914464","5914479"]
[null,null,null,"Custo unitário total de transporte"]
[{"$nulls":5},"Custo unitário direto total",null,null,null,{"$f":"TRUNC(J355+J359,2)","v":1.54}]
[null,"Obs."]
[]
[{"$f":"A325+1","v":11},"1ª/GRD",{"$nulls":8},{"$f":"J406","v":129.22}]
[null,"OBRA:"," PAVIMENTAÇÃO ASFÁLTICA EM CBUQ - AV. MILITÃO JOSÉ DOS SANTOS E AV. VEREADOR JOSÉ PRATES (JANAÚBA / MG)"]
[null,"Custo Unitário de Referência",null,null,"Minas Gerais"]
[{"$nulls":4}," Janeiro/2025 ",null,null,"Produção da equipe ",113.18,{"$f":"VLOOKUP(A368,ORÇAMENTO!$A$10:$L$48,7,1)","v":"M3"}]
[null,4011276,"EXECUÇÃO E COMPACTAÇÃO DE BASE E OU SUB BASE PARA PAVIMENTAÇÃO DE BICA CORRIDA - EXCLUSIVE TRANSPORTE",{"$nulls":5},"Valores em reais (R$)"]
[null,"A - EQUIPAMENTOS",null,"Quantidade","Utilização",null,"Custo Horário",null,null,"Custo"]
[{"$nulls":4},"Operativa","Improdutiva","Produtivo","Improdutivo",null,"Horário Total"]
[null,"E9571","Caminhão tanque com capacidade de 10.000 l - 188 kW",1,0.34,0.66,323.59019999999998,80.173299999999998,null,{"$f":"D375*(E375*G375+F375*H375)","v":162.935046}]
[null,"E9514","Distribuidor de agregados sobre pneus autopropelido - 130 kW",1,1,0,292.00130000000001,107.6279,null,{"$f":"D376*(E376*G376+F376*H376)","v":292.00130000000001}]
[null,"E9762","Rolo compactador de pneus autopropelido de 27 t - 85 kW",1,0.97,0.03,255.65049999999999,124.5621,null,{"$f":"D377*(E377*G377+F377*H377)","v":251.71784799999998}]
[null,"E9530","Rolo compactador liso vibratório autopropelido por pneus de 11 t - 97 kW",1,0.79,0.21,259.53739999999999,112.9601,null,228.756167]
[{"$nulls":7},"Custo horário total de equipamentos",null,{"$f":"SUM(J375:J378)","v":935.41036099999997}]
[null,"B - MÃO DE OBRA",null,"Quantidade","Unidade",null,"Custo Horário","Custo Horário Total"]
[null,"P9824","Servente",1,"h",null,21.3355,null,null,{"$f":"D381*G381","v":21.3355}]
[null,"-",0,0,0,null,0,null,null,{"$f":"D382*G382","v":0}]
[null,null,null,"Custo horário total de mão de obra",{"$nulls":5},{"$f":"SUM(J381:J382)","v":21.3355}]
[null,null,null,"Custo horário total de execução",{"$nulls":5},{"$f":"J379+J383","v":956.74586099999999}]
[null,null,null,"Custo unitário de execução",{"$nulls":5},{"$f":"J384/I371","v":8.4533120781056716}]
[{"$nulls":7},"Custo do FIC",null,5.0900000000000001E-2]
[{"$nulls":7},"Custo do FIT",null,0]
[null,"C - MATERIAL",null,"Quantidade","Unidade",null,"Preço Unitário","Custo Unitário"]
[null,"-",0,null,0,null,0,null,null,{"$f":"D389*G389","v":0}]
[null,"-",0,null,0,null,0,null,null,{"$f":"D390*G390","v":0}]
[null,null,null,"Custo unitário total de material",{"$nulls":5},{"$f":"SUM(J389:J390)","v":0}]
[null,"D - ATIVIDADES AUXILIARES",null,"Quantidade","Unidade",null,"Custo Unitário","Custo Unitário"]
[null,6416040,"Usinagem de brita graduada com brita comercial em usina de 300 t/h",1,"m³",null,113,"COTAÇÃO",null,{"$f":"D393*G393","v":113}]
[null,"-",0,0,0,null,0,null,null,{"$f":"D394*G394","v":0}]
[null,null,null,"Custo total de atividades auxiliares",{"$nulls":5},{"$f":"SUM(J393:J394)","v":113}]
[{"$nulls":7},"Subtotal",null,{"$f":"J385+J391+J395+J386+J387","v":121.50421207810567}]
[null,"E - TEMPO FIXO",null,"Código","Quantidade","Unidade",null,"Custo Unitário","Custo Unitário"]
[null,6416040,"Usinagem de brita graduada com brita comercial em usina de 300 t/h",5914652,2.2000000000000002,"t",null,3.51,null,{"$f":"ROUNDDOWN(E398*H398,4)","v":7.7220000000000004}]
[null,"-",0,"-",null,"t",null,0,null,{"$f":"ROUNDDOWN(E399*H399,4)","v":0}]
[null,null,null,"Custo unitário total de tempo fixo",{"$nulls":5},{"$f":"SUM(J398:J399)","v":7.7220000000000004}]
[null,"F - MOMENTO DE TRANSPORTE",null,"Quantidade","Unidade","DMT",null,null,null,"Custo Unitário"]
[{"$nulls":5},"LN","RP","P"]
[null,6416040,"Usinagem de brita graduada com brita comercial em usina de 300 t/h",2.2000000000000002,"tkm","5914359","5914374","5914389"]
[null,"-",0,0,"tkm"]
[null,null,null,"Custo unitário total de transporte"]
[{"$nulls":5},"Custo unitário direto total",null,null,null,{"$f":"TRUNC(J396+J400,2)","v":129.22}]
[null,"Obs."]
[]
[{"$f":"A368+1","v":12},"1ª/GRD",{"$nulls":8},{"$f":"J445","v":0.4}]
[null,"OBRA:"," PAVIMENTAÇÃO ASFÁLTICA EM CBUQ - AV. MILITÃO JOSÉ DOS SANTOS E AV. VEREADOR JOSÉ PRATES (JANAÚBA / MG)"]
[null,"Custo Unitário de Referência",null,null,"Minas Gerais"]
[{"$nulls":4}," Janeiro/2025 ",null,null,"Produção da equipe ",1038.46,{"$f":"VLOOKUP(A409,ORÇAMENTO!$A$10:$L$48,7,1)","v":"M2"}]
[null,4011352,"IMPRIMAÇÃO COM EMULSÃO ASFÁLTICA (EAI)",{"$nulls":5},"Valores em reais (R$)"]
[null,"A - EQUIPAMENTOS",null,"Quantidade","Utilização",null,"Custo Horário",null,null,"Custo"]
[{"$nulls":4},"Operativa","Improdutiva","Produtivo","Improdutivo",null,"Horário Total"]
[null,"E9509","Caminhão tanque distribuidor de asfalto com capacidade de 6.000 l - 7 kW/136 kW",1,1,0,261.03050000000002,72.388300000000001,null,{"$f":"D416*(E416*G416+F416*H416)","v":261.03050000000002}]
[null,"E9558","Tanque de estocagem de asfalto com capacidade de 30.000 l",2,1,0,56.138500000000001,38.346699999999998,null,{"$f":"D417*(E417*G417+F417*H417)","v":112.277}]
[{"$nulls":7},"Custo horário total de equipamentos",null,{"$f":"SUM(J416:J417)","v":373.3075}]
[null,"B - MÃO DE OBRA",null,"Quantidade","Unidade",null,"Custo Horário","Custo Horário Total"]
[null,"P9824","Servente",2,"h",null,21.3355,null,null,{"$f":"D420*G420","v":42.670999999999999}]
[null,"-",{"$nulls":7},{"$f":"D421*G421","v":0}]
[null,null,null,"Custo horário total de mão de obra",{"$nulls":5},{"$f":"SUM(J420:J421)","v":42.670999999999999}]
[null,null,null,"Custo horário total de execução",{"$nulls":5},{"$f":"J418+J422","v":415.9785}]
[null,null,null,"Custo unitário de execução",{"$nulls":5},{"$f":"J423/I412","v":0.40057248232960341}]
[{"$nulls":7},"Custo do FIC",null,1.4E-3]
[{"$nulls":7},"Custo do FIT",null,0]
[null,"C - MATERIAL",null,"Quantidade","Unidade",null,"Preço Unitário","Custo Unitário"]
[null,"M2092","Emulsão asfáltica para imprimação",1.2999999999999999E-3,"t",null,0,"FORNECIMENTO COM BDI DIFERENCIADO",null,{"$f":"D428*G428","v":0}]
[null,"-",0,89.28,0,null,0,null,null,{"$f":"D429*G429","v":0}]
[null,null,null,"Custo unitário total de material",{"$nulls":5},{"$f":"SUM(J428:J429)","v":0}]
[null,"D - ATIVIDADES AUXILIARES",null,"Quantidade","Unidade",null,"Custo Unitário","Custo Unitário"]
[null,"-",0,0,0,null,0,null,null,{"$f":"D432*G432","v":0}]
[null,"-",0,0,0,null,0,null,null,{"$f":"D433*G433","v":0}]
[null,null,null,"Custo total de atividades auxiliares",{"$nulls":5},{"$f":"SUM(J432:J433)","v":0}]
[{"$nulls":7},"Subtotal",null,{"$f":"J424+J430+J434+J425+J426","v":0.40197248232960342}]
[null,"E - TEMPO FIXO",null,"Código","Quantidade","Unidade",null,"Custo Unitário","Custo Unitário"]
[null,"-",0,"-",0,"t",null,0,null,{"$f":"ROUNDDOWN(E437*H437,4)","v":0}]
[null,"-",0,"-",0,"t",null,0,null,{"$f":"ROUNDDOWN(E438*H438,4)","v":0}]
[null,null,null,"Custo unitário total de tempo fixo",{"$nulls":5},{"$f":"SUM(J437:J438)","v":0}]
[null,"F - MOMENTO DE TRANSPORTE",null,"Quantidade","Unidade","DMT",null,null,null,"Custo Unitário"]
[{"$nulls":5},"LN","RP","P"]
[null,"-",0,null,"tkm"]
[null,"-",0,null,"tkm"]
[null,null,null,"Custo unitário total de transporte"]
[{"$nulls":5},"Custo unitário direto total",null,null,null,{"$f":"TRUNC(J435+J439,2)","v":0.4}]
[null,"Obs."]
[]
[{"$f":"A409+1","v":13},"1ª/GRD",{"$nulls":8},{"$f":"J484","v":0.27}]
[null,"OBRA:"," PAVIMENTAÇÃO ASFÁLTICA EM CBUQ - AV. MILITÃO JOSÉ DOS SANTOS E AV. VEREADOR JOSÉ PRATES (JANAÚBA / MG)"]
[null,"Custo Unitário de Referência",null,null,"Minas Gerais"]
[{"$nulls":4}," Janeiro/2025 ",null,null,"Produção da equipe ",1500,{"$f":"VLOOKUP(A448,ORÇAMENTO!$A$10:$L$48,7,1)","v":"M2"}]
[null,4011353,"PINTURA DE LIGAÇÃO COM EMULSÃO ASFÁLTICA RR-1C",{"$nulls":5},"Valores em reais (R$)"]
[null,"A - EQUIPAMENTOS",null,"Quantidade","Utilização",null,"Custo Horário",null,null,"Custo"]
[{"$nulls":4},"Operativa","Improdutiva","Produtivo","Improdutivo",null,"Horário Total"]
[null,"E9509","Caminhão tanque distribuidor de asfalto com capacidade de 6.000 l - 7 kW/136 kW",1,1,0,261.03050000000002,72.388300000000001,null,{"$f":"D455*(E455*G455+F455*H455)","v":261.03050000000002}]
[null,"E9558","Tanque de estocagem de asfalto com capacidade de 30.000 l",2,1,0,56.138500000000001,38.346699999999998,null,{"$f":"D456*(E456*G456+F456*H456)","v":112.277}]
[{"$nulls":7},"Custo horário total de equipamentos",null,{"$f":"SUM(J455:J456)","v":373.3075}]
[null,"B - MÃO DE OBRA",null,"Quantidade","Unidade",null,"Custo Horário","Custo Horário Total"]
[null,"P9824","Servente",2,"h",null,21.3355,null,null,{"$f":"D459*G459","v":42.670999999999999}]
[null,"-",{"$nulls":7},{"$f":"D460*G460","v":0}]
[null,null,null,"Custo horário total de mão de obra",{"$nulls":5},{"$f":"SUM(J459:J460)","v":42.670999999999999}]
[null,null,null,"Custo horário total de execução",{"$nulls":5},{"$f":"J457+J461","v":415.9785}]
[null,null,null,"Custo unitário de execução",{"$nulls":5},{"$f":"J462/I451","v":0.27731899999999998}]
[{"$nulls":7},"Custo do FIC",null,8.9999999999999998E-4]
[{"$nulls":7},"Custo do FIT",null,0]
[null,"C - MATERIAL",null,"Quantidade","Unidade",null,"Preço Unitário","Custo Unitário"]
[null,"M1946","Emulsão asfáltica - RR-1C",4.4999999999999999E-4,"t",null,0,"FORNECIMENTO COM BDI DIFERENCIADO",null,{"$f":"D467*G467","v":0}]
[null,"-",0,null,0,null,0,null,null,{"$f":"D468*G468","v":0}]
[null,null,null,"Custo unitário total de material",{"$nulls":5},{"$f":"SUM(J467:J468)","v":0}]
[null,"D - ATIVIDADES AUXILIARES",null,"Quantidade","Unidade",null,"Custo Unitário","Custo Unitário"]
[null,"-",0,0,0,null,0,null,null,{"$f":"D471*G471","v":0}]
[null,"-",0,0,0,null,0,null,null,{"$f":"D472*G472","v":0}]
[null,null,null,"Custo total de atividades auxiliares",{"$nulls":5},{"$f":"SUM(J471:J472)","v":0}]
[{"$nulls":7},"Subtotal",null,{"$f":"J463+J469+J473+J464+J465","v":0.27821899999999999}]
[null,"E - TEMPO FIXO",null,"Código","Quantidade","Unidade",null,"Custo Unitário","Custo Unitário"]
[null,"-",0,"-",0,"t",null,0,null,{"$f":"ROUNDDOWN(E476*H476,4)","v":0}]
[null,"-",0,"-",0,"t",null,0,null,{"$f":"ROUNDDOWN(E477*H477,4)","v":0}]
[null,null,null,"Custo unitário total de tempo fixo",{"$nulls":5},{"$f":"SUM(J476:J477)","v":0}]
[null,"F - MOMENTO DE TRANSPORTE",null,"Quantidade","Unidade","DMT",null,null,null,"Custo Unitário"]
[{"$nulls":5},"LN","RP","P"]
[null,"-",0,null,"tkm"]
[null,"-",0,null,"tkm"]
[null,null,null,"Custo unitário total de transporte"]
[{"$nulls":5},"Custo unitário direto total",null,null,null,{"$f":"TRUNC(J474+J478,2)","v":0.27}]
[null,"Obs."]
[]
[{"$f":"A448+1","v":14},"1ª/GRD",{"$nulls":8},{"$f":"J524","v":179.91}]
[null,"OBRA:"," PAVIMENTAÇÃO ASFÁLTICA EM CBUQ - AV. MILITÃO JOSÉ DOS SANTOS E AV. VEREADOR JOSÉ PRATES (JANAÚBA / MG)"]
[null,"Custo Unitário de Referência",null,null,"Minas Gerais"]
[{"$nulls":4}," Janeiro/2025 ",null,null,"Produção da equipe ",99.6,{"$f":"VLOOKUP(A487,ORÇAMENTO!$A$10:$L$48,7,1)","v":"T"}]
[null,4011463,"EXECUÇÃO DE PAVIMENTO COM APLICAÇÃO DE CONCRETO ASFÁLTICO USINADO A QUENTE (CBUQ), CAMADA DE ROLAMENTO - EXCLUSIVE TRANSPORTE",{"$nulls":5},"Valores em reais (R$)"]
[null,"A - EQUIPAMENTOS",null,"Quantidade","Utilização",null,"Custo Horário",null,null,"Custo"]
[{"$nulls":4},"Operativa","Improdutiva","Produtivo","Improdutivo",null,"Horário Total"]
[null,"E9762","Rolo compactador de pneus autopropelido de 27 t - 85 kW",1,0.71,0.28999999999999998,255.65049999999999,124.5621,null,{"$f":"D494*(E494*G494+F494*H494)","v":217.63486399999999}]
[null,"E9681","Rolo compactador liso tandem vibratório autopropelido de 10,4 t - 82 kW",1,0.82,0.18,296.77460000000002,113.3899,null,{"$f":"D495*(E495*G495+F495*H495)","v":263.765354}]
[null,"E9545","Vibroacabadora de asfalto sobre esteiras - 97 kW",1,1,0,359.27379999999999,154.22659999999999,null,{"$f":"D496*(E496*G496+F496*H496)","v":359.27379999999999}]
[{"$nulls":7},"Custo horário total de equipamentos",null,{"$f":"SUM(J494:J496)","v":840.67401799999993}]
[null,"B - MÃO DE OBRA",null,"Quantidade","Unidade",null,"Custo Horário","Custo Horário Total"]
[null,"P9824","Servente",8,"h",null,21.3355,null,null,{"$f":"D499*G499","v":170.684}]
[null,"-",0,null,0,null,0,null,null,{"$f":"D500*G500","v":0}]
[null,null,null,"Custo horário total de mão de obra",{"$nulls":5},{"$f":"SUM(J499:J500)","v":170.684}]
[null,null,null,"Custo horário total de execução",{"$nulls":5},{"$f":"J497+J501","v":1011.3580179999999}]
[null,null,null,"Custo unitário de execução",{"$nulls":5},{"$f":"J502/I490","v":10.154196967871485}]
[{"$nulls":7},"Custo do FIC",null,3.8600000000000002E-2]
[{"$nulls":7},"Custo do FIT",null,0]
[null,"C - MATERIAL",null,"Quantidade","Unidade",null,"Preço Unitário","Custo Unitário"]
[null,"-",0,null,0,null,0,null,null,{"$f":"D507*G507","v":0}]
[null,"-",0,null,0,null,0,null,null,{"$f":"D508*G508","v":0}]
[null,null,null,"Custo unitário total de material",{"$nulls":5},{"$f":"SUM(J507:J508)","v":0}]
[null,"D - ATIVIDADES AUXILIARES",null,"Quantidade","Unidade",null,"Custo Unitário","Custo Unitário"]
[null,6416078,"Usinagem de concreto asfáltico - faixa C-12,5 - areia e brita comerciais",1,"t",null,161.66847645476304,null,null,{"$f":"D511*G511","v":161.66847645476304}]
[null,"-",0,0,0,null,0,null,null,{"$f":"D512*G512","v":0}]
[null,null,null,"Custo total de atividades auxiliares",{"$nulls":5},{"$f":"SUM(J511:J512)","v":161.66847645476304}]
[{"$nulls":7},"Subtotal",null,{"$f":"J503+J509+J513+J504+J505","v":171.86127342263453}]
[null,"E - TEMPO FIXO",null,"Código","Quantidade","Unidade",null,"Custo Unitário","Custo Unitário"]
[null,6416078,"Usinagem de concreto asfáltico - faixa C-12,5 - areia e brita comerciais",5914649,1,"t",null,8.0500000000000007,null,{"$f":"ROUNDDOWN(E516*H516,4)","v":8.0500000000000007}]
[null,"-",0,"-",0,"t",null,0,null,{"$f":"ROUNDDOWN(E517*H517,4)","v":0}]
[null,null,null,"Custo unitário total de tempo fixo",{"$nulls":5},{"$f":"SUM(J516:J517)","v":8.0500000000000007}]
[null,"F - MOMENTO DE TRANSPORTE",null,"Quantidade","Unidade","DMT",null,null,null,"Custo Unitário"]
[{"$nulls":5},"LN","RP","P"]
[null,6416078,"Usinagem de concreto asfáltico - faixa C-12,5 - areia e brita comerciais",1,"tkm"]
[null,"-",0,0,"tkm"]
[null,null,null,"Custo unitário total de transporte"]
[{"$nulls":5},"Custo unitário direto total",null,null,null,{"$f":"TRUNC(J514+J518,2)","v":179.91}]
[null,"Obs."]
[]
[null,"1ª/GRD",{"$nulls":8},{"$f":"J578","v":161.66847645476304}]
[null,"OBRA:"," PAVIMENTAÇÃO ASFÁLTICA EM CBUQ - AV. MILITÃO JOSÉ DOS SANTOS E AV. VEREADOR JOSÉ PRATES (JANAÚBA / MG)"]
[null,"Custo Unitário de Referência - Auxiliar",null,null,"Minas Gerais"]
[{"$nulls":4}," Janeiro/2025 ",null,null,"Produção da equipe ",99.6,"t"]
[null,6416078,"Usinagem de concreto asfáltico - faixa C - areia e brita comerciais",{"$nulls":5},"Valores em reais (R$)"]
[null,"A - EQUIPAMENTOS",null,"Quantidade","Utilização",null,"Custo Horário",null,null,"Custo"]
[{"$nulls":4},"Operativa","Improdutiva","Produtivo","Improdutivo",null,"Horário Total"]
[null,"E9559","Aquecedor de fluido térmico - 12 kW",1,1,0,70.491399999999999,40.1297,null,{"$f":"D534*(E534*G534+F534*H534)","v":70.491399999999999}]
[null,"E9584","Carregadeira de pneus com capacidade de 1,72 m³ - 113 kW",1,0.86,0.14000000000000001,207.59360000000001,103.7398,null,{"$f":"D535*(E535*G535+F535*H535)","v":193.054068}]
[null,"E9021","Grupo gerador - 456 kVA",1,1,0,415.94510000000002,22.186399999999999,null,415.94510000000002]
[null,"E9558","Tanque de estocagem de asfalto com capacidade de 30.000 l",2,1,0,56.138500000000001,38.346699999999998,null,112.277]
[null,"E9689","Usina de asfalto a quente gravimétrica com capacidade de 100/140 t/h - 260 kW",1,1,0,1239.9634000000001,657.78120000000001,null,{"$f":"D538*(E538*G538+F538*H538)","v":1239.9634000000001}]
[{"$nulls":7},"Custo horário total de equipamentos",null,{"$f":"SUM(J534:J538)","v":2031.7309680000003}]
[null,"B - MÃO DE OBRA",null,"Quantidade","Unidade",null,"Custo Horário","Custo Horário Total"]
[null,"P9824","Servente",4,"h",null,21.3355,null,null,{"$f":"D541*G541","v":85.341999999999999}]
[null,null,null,"Custo horário total de mão de obra",{"$nulls":5},{"$f":"SUM(J541:J541)","v":85.341999999999999}]
[null,null,null,"Custo horário total de execução",{"$nulls":5},{"$f":"J539+J542","v":2117.0729680000004}]
[null,null,null,"Custo unitário de execução",{"$nulls":5},{"$f":"J543/I530","v":21.255752690763057}]
[{"$nulls":7},"Custo do FIC",null,0]
[{"$nulls":7},"Custo do FIT",null,0]
[null,"C - MATERIAL",null,"Quantidade","Unidade",null,"Preço Unitário","Custo Unitário"]
[null,"M0028","Areia média",2.7009999999999999E-2,"m³",null,158.15639999999999,null,null,{"$f":"D548*G548","v":4.2718043639999994}]
[null,"M0005","Brita 0",9.0029999999999999E-2,"m³",null,116,null,null,{"$f":"D549*G549","v":10.443479999999999}]
[null,"M0191","Brita 1",3.2149999999999998E-2,"m³",null,109,null,null,3.5043499999999996]
[null,"M0344","Cal hidratada - a granel",14.4636,"kg",null,0.61650000000000005,null,null,8.9168094]
[null,"M1943","Cimento asfáltico de petróleo - CAP 50/70",5.5449999999999999E-2,"t",null,0,"FORNECIMENTO COM BDI DIFERENCIADO",null,0]
[null,"M1941","Óleo tipo A1",8,"l",null,6.3849,null,null,51.0792]
[null,"M1103","Pedrisco",0.1479,"m³",null,116,null,null,{"$f":"D554*G554","v":17.156400000000001}]
[null,"M1135","Pó de pedra",0.33631,"m³",null,128,null,null,43.04768]
[null,null,null,"Custo unitário total de material",{"$nulls":5},{"$f":"SUM(J548:J555)","v":138.419723764}]
[null,"D - ATIVIDADES AUXILIARES",null,"Quantidade","Unidade",null,"Custo Unitário","Custo Unitário"]
[null,"-",0,0,0,null,0,null,null,{"$f":"D558*G558","v":0}]
[null,null,null,"Custo total de atividades auxiliares",{"$nulls":5},{"$f":"SUM(J558:J558)","v":0}]
[{"$nulls":7},"Subtotal",null,{"$f":"J544+J556+J559+J545+J546","v":159.67547645476304}]
[null,"E - TEMPO FIXO",null,"Código","Quantidade","Unidade",null,"Custo Unitário","Custo Unitário"]
[null,"M0028","Areia média",5914647,4.052E-2,"t",null,1.83,null,{"$f":"ROUNDDOWN(E562*H562,4)","v":7.4099999999999999E-2}]
[null,"M0005","Brita 0",5914647,0.13505,"t",null,1.83,null,0.24709999999999999]
[null,"M0191","Brita 1",5914647,4.8230000000000002E-2,"t",null,1.83,null,8.8200000000000001E-2]
[null,"M0344","Cal hidratada - a granel",5914363,1.4460000000000001E-2,"t",null,17.61,null,0.25459999999999999]
[null,"M1103","Pedrisco",5914647,0.22184999999999999,"t",null,1.83,null,{"$f":"ROUNDDOWN(E566*H566,4)","v":0.40589999999999998}]
[null,"M1135","Pó de pedra",5914647,0.50446999999999997,"t",null,1.83,null,{"$f":"ROUNDDOWN(E567*H567,4)","v":0.92310000000000003}]
[null,null,null,"Custo unitário total de tempo fixo",{"$nulls":5},{"$f":"SUM(J562:J567)","v":1.9929999999999999}]
[null,"F - MOMENTO DE TRANSPORTE",null,"Quantidade","Unidade","DMT",null,null,null,"Custo Unitário"]
[{"$nulls":5},"LN","RP","P"]
[null,"M0028","Areia média",4.052E-2,"tkm"]
[null,"M0005","Brita 0",0.13505,"tkm"]
[null,"M0191","Brita 1",4.8230000000000002E-2,"tkm"]
[null,"M0344","Cal hidratada - a granel",1.4460000000000001E-2,"tkm"]
[null,"M1103","Pedrisco",0.22184999999999999,"tkm"]
[null,"M1135","Pó de pedra",0.50446999999999997,"tkm"]
[null,null,null,"Custo unitário total de transporte"]
[{"$nulls":5},"Custo unitário direto total",null,null,null,{"$f":"J560+J568","v":161.66847645476304}]
[null,"Obs."]
[]
[{"$f":"A487+1","v":15},"1ª/GRD",{"$nulls":8},{"$f":"J617","v":0.54}]
[null,"OBRA:"," PAVIMENTAÇÃO ASFÁLTICA EM CBUQ - AV. MILITÃO JOSÉ DOS SANTOS E AV. VEREADOR JOSÉ PRATES (JANAÚBA / MG)"]
[null,"Custo Unitário de Referência",null,null,"Minas Gerais"]
[{"$nulls":4}," Janeiro/2025 ",null,null,"Produção da equipe ",570.61,{"$f":"VLOOKUP(A581,ORÇAMENTO!$A$10:$L$48,7,1)","v":"TXKM"}]
[null,5915321,"TRANSPORTE COM CAMINHÃO BASCULANTE, EM VIA URBANA PAVIMENTADA",{"$nulls":5},"Valores em reais (R$)"]
[null,"A - EQUIPAMENTOS",null,"Quantidade","Utilização",null,"Custo Horário",null,null,"Custo"]
[{"$nulls":4},"Operativa","Improdutiva","Produtivo","Improdutivo",null,"Horário Total"]
[null,"E9667","Caminhão basculante com capacidade de 14 m³ - 210 kW",1,1,0,309.83940000000001,90.412199999999999,null,{"$f":"D588*(E588*G588+F588*H588)","v":309.83940000000001}]
[null,"-",0,null,null,null,0,0,null,{"$f":"D589*(E589*G589+F589*H589)","v":0}]
[{"$nulls":7},"Custo horário total de equipamentos",null,{"$f":"SUM(J588:J589)","v":309.83940000000001}]
[null,"B - MÃO DE OBRA",null,"Quantidade","Unidade",null,"Custo Horário","Custo Horário Total"]
[null,"-",0,null,0,null,0,null,null,{"$f":"D592*G592","v":0}]
[null,"-",0,null,0,null,0,null,null,{"$f":"D593*G593","v":0}]
[null,null,null,"Custo horário total de mão de obra",{"$nulls":5},{"$f":"SUM(J592:J593)","v":0}]
[null,null,null,"Custo horário total de execução",{"$nulls":5},{"$f":"J590+J594","v":309.83940000000001}]
[null,null,null,"Custo unitário de execução",{"$nulls":5},{"$f":"J595/I584","v":0.54299679290583758}]
[{"$nulls":7},"Custo do FIC",null,0]
[{"$nulls":7},"Custo do FIT",null,0]
[null,"C - MATERIAL",null,"Quantidade","Unidade",null,"Preço Unitário","Custo Unitário"]
[null,"-",0,0,0,null,0,null,null,{"$f":"D600*G600","v":0}]
[null,"-",0,0,0,null,0,null,null,{"$f":"D601*G601","v":0}]
[null,null,null,"Custo unitário total de material",{"$nulls":5},{"$f":"SUM(J600:J601)","v":0}]
[null,"D - ATIVIDADES AUXILIARES",null,"Quantidade","Unidade",null,"Custo Unitário","Custo Unitário"]
[null,"-",0,0,0,null,0,null,null,{"$f":"D604*G604","v":0}]
[null,"-",0,0,0,null,0,null,null,{"$f":"D605*G605","v":0}]
[null,null,null,"Custo total de atividades auxiliares",{"$nulls":5},{"$f":"SUM(J604:J605)","v":0}]
[{"$nulls":7},"Subtotal",null,{"$f":"J596+J602+J606+J597+J598","v":0.54299679290583758}]
[null,"E - TEMPO FIXO",null,"Código","Quantidade","Unidade",null,"Custo Unitário","Custo Unitário"]
[null,"-",0,"-",0,"t",null,0,null,{"$f":"ROUNDDOWN(E609*H609,4)","v":0}]
[null,"-",0,"-",0,"t",null,0,null,{"$f":"ROUNDDOWN(E610*H610,4)","v":0}]
[null,null,null,"Custo unitário total de tempo fixo",{"$nulls":5},{"$f":"SUM(J609:J610)","v":0}]
[null,"F - MOMENTO DE TRANSPORTE",null,"Quantidade","Unidade","DMT",null,null,null,"Custo Unitário"]
[{"$nulls":5},"LN","RP","P"]
[null,"-",0,0,"tkm"]
[null,"-",0,0,"tkm"]
[null,null,null,"Custo unitário total de transporte"]
[{"$nulls":5},"Custo unitário direto total",null,null,null,{"$f":"TRUNC(J607+J611,2)","v":0.54}]
[null,"Obs."]
[]
[{"$f":"A581+1","v":16},"1ª/GRD",{"$nulls":8},{"$f":"J656","v":0.74}]
[null,"OBRA:"," PAVIMENTAÇÃO ASFÁLTICA EM CBUQ - AV. MILITÃO JOSÉ DOS SANTOS E AV. VEREADOR JOSÉ PRATES (JANAÚBA / MG)"]
[null,"Custo Unitário de Referência",null,null,"Minas Gerais"]
[{"$nulls":4}," Janeiro/2025 ",null,null,"Produção da equipe ",241.03,{"$f":"VLOOKUP(A620,ORÇAMENTO!$A$10:$L$48,7,1)","v":"TXKM"}]
[null,5914434,"TRANSPORTE COM CAMINHÃO CARROCERIA 9T, EM VIA URBANA PAVIMENTADA",{"$nulls":5},"Valores em reais (R$)"]
[null,"A - EQUIPAMENTOS",null,"Quantidade","Utilização",null,"Custo Horário",null,null,"Custo"]
[{"$nulls":4},"Operativa","Improdutiva","Produtivo","Improdutivo",null,"Horário Total"]
[null,"E9508","Caminhão carroceria com capacidade de 9 t - 136 kW",1,1,0,178.82759999999999,67.927099999999996,null,{"$f":"D627*(E627*G627+F627*H627)","v":178.82759999999999}]
[null,"-",0,null,null,null,0,0,null,{"$f":"D628*(E628*G628+F628*H628)","v":0}]
[{"$nulls":7},"Custo horário total de equipamentos",null,{"$f":"SUM(J627:J628)","v":178.82759999999999}]
[null,"B - MÃO DE OBRA",null,"Quantidade","Unidade",null,"Custo Horário","Custo Horário Total"]
[null,"-",0,0,0,null,0,null,null,{"$f":"D631*G631","v":0}]
[null,"-",0,0,0,null,0,null,null,{"$f":"D632*G632","v":0}]
[null,null,null,"Custo horário total de mão de obra",{"$nulls":5},{"$f":"SUM(J631:J632)","v":0}]
[null,null,null,"Custo horário total de execução",{"$nulls":5},{"$f":"J629+J633","v":178.82759999999999}]
[null,null,null,"Custo unitário de execução",{"$nulls":5},{"$f":"J634/I623","v":0.7419308799734472}]
[{"$nulls":7},"Custo do FIC",null,0]
[{"$nulls":7},"Custo do FIT",null,0]
[null,"C - MATERIAL",null,"Quantidade","Unidade",null,"Preço Unitário","Custo Unitário"]
[null,"-",0,0,0,null,0,null,null,{"$f":"D639*G639","v":0}]
[null,"-",0,0,0,null,0,null,null,{"$f":"D640*G640","v":0}]
[null,null,null,"Custo unitário total de material",{"$nulls":5},{"$f":"SUM(J639:J640)","v":0}]
[null,"D - ATIVIDADES AUXILIARES",null,"Quantidade","Unidade",null,"Custo Unitário","Custo Unitário"]
[null,"-",0,0,0,null,0,null,null,{"$f":"D643*G643","v":0}]
[null,"-",0,0,0,null,0,null,null,{"$f":"D644*G644","v":0}]
[null,null,null,"Custo total de atividades auxiliares",{"$nulls":5},{"$f":"SUM(J643:J644)","v":0}]
[{"$nulls":7},"Subtotal",null,{"$f":"J635+J641+J645+J636+J637","v":0.7419308799734472}]
[null,"E - TEMPO FIXO",null,"Código","Quantidade","Unidade",null,"Custo Unitário","Custo Unitário"]
[null,"-",0,"-",0,"t",null,0,null,{"$f":"ROUNDDOWN(E648*H648,4)","v":0}]
[null,"-",0,"-",0,"t",null,0,null,{"$f":"ROUNDDOWN(E649*H649,4)","v":0}]
[null,null,null,"Custo unitário total de tempo fixo",{"$nulls":5},{"$f":"SUM(J648:J649)","v":0}]
[null,"F - MOMENTO DE TRANSPORTE",null,"Quantidade","Unidade","DMT",null,null,null,"Custo Unitário"]
[{"$nulls":5},"LN","RP","P"]
[null,"-",0,0,"tkm"]
[null,"-",0,0,"tkm"]
[null,null,null,"Custo unitário total de transporte"]
[{"$nulls":5},"Custo unitário direto total",null,null,null,{"$f":"TRUNC(J646+J650,2)","v":0.74}]
[null,"Obs."]
[]
[{"$f":"A620+1","v":17},"1ª/GRD",{"$nulls":8},{"$f":"J695","v":0.93}]
[null,"OBRA:"," PAVIMENTAÇÃO ASFÁLTICA EM CBUQ - AV. MILITÃO JOSÉ DOS SANTOS E AV. VEREADOR JOSÉ PRATES (JANAÚBA / MG)"]
[null,"Custo Unitário de Referência",null,null,"Minas Gerais"]
[{"$nulls":4}," Janeiro/2025 ",null,null,"Produção da equipe ",284.10000000000002,{"$f":"VLOOKUP(A659,ORÇAMENTO!$A$10:$L$48,7,1)","v":"TXKM"}]
[null,5914612,"TRNASPORTE DE MISTURA BETUMINOSA A QUENTE COM CAMINHÃO CAÇAMBA TÉRMICA",{"$nulls":5},"Valores em reais (R$)"]
[null,"A - EQUIPAMENTOS",null,"Quantidade","Utilização",null,"Custo Horário",null,null,"Custo"]
[{"$nulls":4},"Operativa","Improdutiva","Produtivo","Improdutivo",null,"Horário Total"]
[null,"E9520","Caminhão com caçamba térmica com capacidade de 6 m³ - 188 kW",1,1,0,265.74349999999998,76.6511,null,{"$f":"D666*(E666*G666+F666*H666)","v":265.74349999999998}]
[null,"-",0,null,null,null,0,0,null,{"$f":"D667*(E667*G667+F667*H667)","v":0}]
[{"$nulls":7},"Custo horário total de equipamentos",null,{"$f":"SUM(J666:J667)","v":265.74349999999998}]
[null,"B - MÃO DE OBRA",null,"Quantidade","Unidade",null,"Custo Horário","Custo Horário Total"]
[null,"-",0,0,0,null,0,null,null,{"$f":"D670*G670","v":0}]
[null,"-",0,0,0,null,0,null,null,{"$f":"D671*G671","v":0}]
[null,null,null,"Custo horário total de mão de obra",{"$nulls":5},{"$f":"SUM(J670:J671)","v":0}]
[null,null,null,"Custo horário total de execução",{"$nulls":5},{"$f":"J668+J672","v":265.74349999999998}]
[null,null,null,"Custo unitário de execução",{"$nulls":5},{"$f":"J673/I662","v":0.9353871876099964}]
[{"$nulls":7},"Custo do FIC",null,0]
[{"$nulls":7},"Custo do FIT",null,0]
[null,"C - MATERIAL",null,"Quantidade","Unidade",null,"Preço Unitário","Custo Unitário"]
[null,"-",0,0,0,null,0,null,null,{"$f":"D678*G678","v":0}]
[null,"-",0,0,0,null,0,null,null,{"$f":"D679*G679","v":0}]
[null,null,null,"Custo unitário total de material",{"$nulls":5},{"$f":"SUM(J678:J679)","v":0}]
[null,"D - ATIVIDADES AUXILIARES",null,"Quantidade","Unidade",null,"Custo Unitário","Custo Unitário"]
[null,"-",0,0,0,null,0,null,null,{"$f":"D682*G682","v":0}]
[null,"-",0,0,0,null,0,null,null,{"$f":"D683*G683","v":0}]
[null,null,null,"Custo total de atividades auxiliares",{"$nulls":5},{"$f":"SUM(J682:J683)","v":0}]
[{"$nulls":7},"Subtotal",null,{"$f":"J674+J680+J684+J675+J676","v":0.9353871876099964}]
[null,"E - TEMPO FIXO",null,"Código","Quantidade","Unidade",null,"Custo Unitário","Custo Unitário"]
[null,"-",0,"-",0,"t",null,0,null,{"$f":"ROUNDDOWN(E687*H687,4)","v":0}]
[null,"-",0,"-",0,"t",null,0,null,{"$f":"ROUNDDOWN(E688*H688,4)","v":0}]
[null,null,null,"Custo unitário total de tempo fixo",{"$nulls":5},{"$f":"SUM(J687:J688)","v":0}]
[null,"F - MOMENTO DE TRANSPORTE",null,"Quantidade","Unidade","DMT",null,null,null,"Custo Unitário"]
[{"$nulls":5},"LN","RP","P"]
[null,"-",0,0,"tkm"]
[null,"-",0,0,"tkm"]
[null,null,null,"Custo unitário total de transporte"]
[{"$nulls":5},"Custo unitário direto total",null,null,null,{"$f":"TRUNC(J685+J689,2)","v":0.93}]
[null,"Obs."]
[]
[{"$f":"A659+1","v":18},"1ª/GRD",{"$nulls":8},{"$f":"J734","v":1.74}]
[null,"OBRA:"," PAVIMENTAÇÃO ASFÁLTICA EM CBUQ - AV. MILITÃO JOSÉ DOS SANTOS E AV. VEREADOR JOSÉ PRATES (JANAÚBA / MG)"]
[null,"Custo Unitário de Referência",null,null,"Minas Gerais"]
[{"$nulls":4}," Janeiro/2025 ",null,null,"Produção da equipe ",149.4,{"$f":"VLOOKUP(A698,ORÇAMENTO!$A$10:$L$48,7,1)","v":"TXKM"}]
[null,5914622,"TRANSPORTE COM CAMINHÃO TANQUE DE TRANSPORTE DE MATERIAL ASFÁLTICO DE 30000 L, EM VIA URBANA PAVIMENTADA",{"$nulls":5},"Valores em reais (R$)"]
[null,"A - EQUIPAMENTOS",null,"Quantidade","Utilização",null,"Custo Horário",null,null,"Custo"]
[{"$nulls":4},"Operativa","Improdutiva","Produtivo","Improdutivo",null,"Horário Total"]
[null,"E9509","Caminhão tanque distribuidor de asfalto com capacidade de 6.000 l - 7 kW/136 kW",1,1,0,261.03050000000002,72.388300000000001,null,{"$f":"D705*(E705*G705+F705*H705)","v":261.03050000000002}]
[null,"-",0,null,null,null,0,0,null,{"$f":"D706*(E706*G706+F706*H706)","v":0}]
[{"$nulls":7},"Custo horário total de equipamentos",null,{"$f":"SUM(J705:J706)","v":261.03050000000002}]
[null,"B - MÃO DE OBRA",null,"Quantidade","Unidade",null,"Custo Horário","Custo Horário Total"]
[null,"-",0,0,0,null,0,null,null,{"$f":"D709*G709","v":0}]
[null,"-",0,0,0,null,0,null,null,{"$f":"D710*G710","v":0}]
[null,null,null,"Custo horário total de mão de obra",{"$nulls":5},{"$f":"SUM(J709:J710)","v":0}]
[null,null,null,"Custo horário total de execução",{"$nulls":5},{"$f":"J707+J711","v":261.03050000000002}]
[null,null,null,"Custo unitário de execução",{"$nulls":5},{"$f":"J712/I701","v":1.7471921017402945}]
[{"$nulls":7},"Custo do FIC",null,0]
[{"$nulls":7},"Custo do FIT",null,0]
[null,"C - MATERIAL",null,"Quantidade","Unidade",null,"Preço Unitário","Custo Unitário"]
[null,"-",0,996,0,null,0,null,null,{"$f":"D717*G717","v":0}]
[null,"-",0,89.28,0,null,0,null,null,{"$f":"D718*G718","v":0}]
[null,null,null,"Custo unitário total de material",{"$nulls":5},{"$f":"SUM(J717:J718)","v":0}]
[null,"D - ATIVIDADES AUXILIARES",null,"Quantidade","Unidade",null,"Custo Unitário","Custo Unitário"]
[null,"-",0,0,0,null,0,null,null,{"$f":"D721*G721","v":0}]
[null,"-",0,0,0,null,0,null,null,{"$f":"D722*G722","v":0}]
[null,null,null,"Custo total de atividades auxiliares",{"$nulls":5},{"$f":"SUM(J721:J722)","v":0}]
[{"$nulls":7},"Subtotal",null,{"$f":"J713+J719+J723+J714+J715","v":1.7471921017402945}]
[null,"E - TEMPO FIXO",null,"Código","Quantidade","Unidade",null,"Custo Unitário","Custo Unitário"]
[null,"-",0,"-",0,"t",null,0,null,{"$f":"ROUNDDOWN(E726*H726,4)","v":0}]
[null,"-",0,"-",0,"t",null,0,null,{"$f":"ROUNDDOWN(E727*H727,4)","v":0}]
[null,null,null,"Custo unitário total de tempo fixo",{"$nulls":5},{"$f":"SUM(J726:J727)","v":0}]
[null,"F - MOMENTO DE TRANSPORTE",null,"Quantidade","Unidade","DMT",null,null,null,"Custo Unitário"]
[{"$nulls":5},"LN","RP","P"]
[null,"-",0,0,"tkm"]
[null,"-",0,0,"tkm"]
[null,null,null,"Custo unitário total de transporte"]
[{"$nulls":5},"Custo unitário direto total",null,null,null,{"$f":"TRUNC(J724+J728,2)","v":1.74}]
[null,"Obs."]
[]
[{"$f":"A698+1","v":19},"1ª/GRD",{"$nulls":8},{"$f":"J773","v":53.22}]
[null,"OBRA:"," PAVIMENTAÇÃO ASFÁLTICA EM CBUQ - AV. MILITÃO JOSÉ DOS SANTOS E AV. VEREADOR JOSÉ PRATES (JANAÚBA / MG)"]
[null,"Custo Unitário de Referência",null,null,"Minas Gerais"]
[{"$nulls":4}," Janeiro/2025 ",null,null,"Produção da equipe ",1,{"$f":"VLOOKUP(A737,ORÇAMENTO!$A$10:$L$48,7,1)","v":"M"}]
[null,94273,"ASSENTAMENTO DE GUIA (MEIO-FIO) PRÉ-MOLDADO DE CONCRETO - 100X15X13X30 CM (COMPRIMENTO X BASE INFERIOR X BASE SUPERIOR X ALTURA) - USO VIÁRIO",{"$nulls":5},"Valores em reais (R$)"]
[null,"A - EQUIPAMENTOS",null,"Quantidade","Utilização",null,"Custo Horário",null,null,"Custo"]
[{"$nulls":4},"Operativa","Improdutiva","Produtivo","Improdutivo",null,"Horário Total"]
[null,"-",0,null,null,null,0,0,null,{"$f":"D744*(E744*G744+F744*H744)","v":0}]
[null,"-",0,null,null,null,0,0,null,{"$f":"D745*(E745*G745+F745*H745)","v":0}]
[{"$nulls":7},"Custo horário total de equipamentos",null,{"$f":"SUM(J744:J745)","v":0}]
[null,"B - MÃO DE OBRA",null,"Quantidade","Unidade",null,"Custo Horário","Custo Horário Total"]
[null,"P9824","Servente",0.2296,"h",null,21.3355,null,null,{"$f":"D748*G748","v":4.8986308000000003}]
[null,"P9821","Pedreiro",0.2296,"h",null,26.6785,null,null,{"$f":"D749*G749","v":6.1253836000000002}]
[null,null,null,"Custo horário total de mão de obra",{"$nulls":5},{"$f":"SUM(J748:J749)","v":11.0240144}]
[null,null,null,"Custo horário total de execução",{"$nulls":5},{"$f":"J746+J750","v":11.0240144}]
[null,null,null,"Custo unitário de execução",{"$nulls":5},{"$f":"J751/I740","v":11.0240144}]
[{"$nulls":7},"Custo do FIC",null,0]
[{"$nulls":7},"Custo do FIT",null,0]
[null,"C - MATERIAL",null,"Quantidade","Unidade",null,"Preço Unitário","Custo Unitário"]
[null,"M0082","Areia média lavada",6.6E-3,"m³",null,164.1893,null,null,{"$f":"D756*G756","v":1.08364938}]
[null,4059,"Meio-fio ou guia de concreto, pré-moldado, comp.1,0m x 30 x 12/15 cm (H X L1/L2)",1.0049999999999999,"m",null,40,null,null,40.199999999999996]
[null,null,null,"Custo unitário total de material",{"$nulls":5},{"$f":"SUM(J756:J757)","v":41.283649379999993}]
[null,"D - ATIVIDADES AUXILIARES",null,"Quantidade","Unidade",null,"Custo Unitário","Custo Unitário"]
[null,1109669,"Argamassa de cimento e areia 1:3 - confecção em betoneira e lançamento manual - areia comercial",1.8E-3,"m³",null,507.26,null,null,{"$f":"D760*G760","v":0.91306799999999999}]
[null,"-",0,0,0,null,0,null,null,{"$f":"D761*G761","v":0}]
[null,null,null,"Custo total de atividades auxiliares",{"$nulls":5},{"$f":"SUM(J760:J761)","v":0.91306799999999999}]
[{"$nulls":7},"Subtotal",null,{"$f":"J752+J758+J762+J753+J754","v":53.220731779999994}]
[null,"E - TEMPO FIXO",null,"Código","Quantidade","Unidade",null,"Custo Unitário","Custo Unitário"]
[null,"-",0,"-",null,"t",null,0,null,{"$f":"ROUNDDOWN(E765*H765,4)","v":0}]
[null,"-",0,"-",null,"t",null,0,null,{"$f":"ROUNDDOWN(E766*H766,4)","v":0}]
[null,null,null,"Custo unitário total de tempo fixo",{"$nulls":5},{"$f":"SUM(J765:J766)","v":0}]
[null,"F - MOMENTO DE TRANSPORTE",null,"Quantidade","Unidade","DMT",null,null,null,"Custo Unitário"]
[{"$nulls":5},"LN","RP","P"]
[null,"-",0,null,"tkm","5914449","5914464","5914479"]
[null,"-",0,null,"tkm"]
[null,null,null,"Custo unitário total de transporte"]
[{"$nulls":5},"Custo unitário direto total",null,null,null,{"$f":"TRUNC(J763+J767,2)","v":53.22}]
[null,"Obs."]
[]
[{"$f":"A737+1","v":20},"1ª/GRD",{"$nulls":8},{"$f":"J814","v":25.19}]
[null,"OBRA:"," PAVIMENTAÇÃO ASFÁLTICA EM CBUQ - AV. MILITÃO JOSÉ DOS SANTOS E AV. VEREADOR JOSÉ PRATES (JANAÚBA / MG)"]
[null,"Custo Unitário de Referência",null,null,"Minas Gerais"]
[{"$nulls":4}," Janeiro/2025 ",null,null,"Produção da equipe ",1,{"$f":"VLOOKUP(A776,ORÇAMENTO!$A$10:$L$48,7,1)","v":"M"}]
[null,94287,"EXECUÇÃO DE SARJETA EM CONCRETO USINADO, MOLDADO IN LOCO - 30CM DE BASE X 5CM DE ALTURA",{"$nulls":5},"Valores em reais (R$)"]
[null,"A - EQUIPAMENTOS",null,"Quantidade","Utilização",null,"Custo Horário",null,null,"Custo"]
[{"$nulls":4},"Operativa","Improdutiva","Produtivo","Improdutivo",null,"Horário Total"]
[null,"-",0,null,null,null,0,0,null,{"$f":"D783*(E783*G783+F783*H783)","v":0}]
[null,"-",0,null,null,null,0,0,null,{"$f":"D784*(E784*G784+F784*H784)","v":0}]
[{"$nulls":7},"Custo horário total de equipamentos",null,{"$f":"SUM(J783:J784)","v":0}]
[null,"B - MÃO DE OBRA",null,"Quantidade","Unidade",null,"Custo Horário","Custo Horário Total"]
[null,"P9821","Pedreiro",0.2326,"h",null,26.6785,null,null,{"$f":"D787*G787","v":6.2054191000000003}]
[null,"P9824","Servente",0.2326,"h",null,21.3355,null,null,{"$f":"D788*G788","v":4.9626372999999999}]
[null,null,null,"Custo horário total de mão de obra",{"$nulls":5},{"$f":"SUM(J787:J788)","v":11.168056400000001}]
[null,null,null,"Custo horário total de execução",{"$nulls":5},{"$f":"J785+J789","v":11.168056400000001}]
[null,null,null,"Custo unitário de execução",{"$nulls":5},{"$f":"J790/I779","v":11.168056400000001}]
[{"$nulls":7},"Custo do FIC",null,0]
[{"$nulls":7},"Custo do FIT",null,0]
[null,"C - MATERIAL",null,"Quantidade","Unidade",null,"Preço Unitário","Custo Unitário"]
[null,"M0082","Areia média lavada",9.9000000000000008E-3,"m³",null,164.1893,null,null,{"$f":"D795*G795","v":1.6254740700000001}]
[null,"M0286","Tábua - E = 2,5 cm e L = 30 cm",8.3299999999999999E-2,"m",null,15.537800000000001,null,null,{"$f":"D796*G796","v":1.2942987400000001}]
[null,"M0451","Concreto usinado - fck = 20 MPa (comercial)",1.8800000000000001E-2,"m³",null,570,"(SINAPI-34492)",null,10.716000000000001]
[null,"M1358","Sarrafo em madeira de terceira - E = 2,5 cm e L = 5 cm",0.2,"m",null,1.9665999999999999,null,null,0.39332]
[null,null,null,"Custo unitário total de material",{"$nulls":5},{"$f":"SUM(J795:J798)","v":14.029092810000002}]
[null,"D - ATIVIDADES AUXILIARES",null,"Quantidade","Unidade",null,"Custo Unitário","Custo Unitário"]
[null,"-",0,0,0,null,0,null,null,{"$f":"D801*G801","v":0}]
[null,"-",0,0,0,null,0,null,null,{"$f":"D802*G802","v":0}]
[null,null,null,"Custo total de atividades auxiliares",{"$nulls":5},{"$f":"SUM(J801:J802)","v":0}]
[{"$nulls":7},"Subtotal",null,{"$f":"J791+J799+J803+J792+J793","v":25.197149210000003}]
[null,"E - TEMPO FIXO",null,"Código","Quantidade","Unidade",null,"Custo Unitário","Custo Unitário"]
[null,"-",0,"-",0,"t",null,0,null,{"$f":"ROUNDDOWN(E806*H806,4)","v":0}]
[null,"-",0,"-",0,"t",null,0,null,{"$f":"ROUNDDOWN(E807*H807,4)","v":0}]
[null,null,null,"Custo unitário total de tempo fixo",{"$nulls":5},{"$f":"SUM(J806:J807)","v":0}]
[null,"F - MOMENTO DE TRANSPORTE",null,"Quantidade","Unidade","DMT",null,null,null,"Custo Unitário"]
[{"$nulls":5},"LN","RP","P"]
[null,"-",0,0,"tkm"]
[null,"-",0,0,"tkm"]
[null,null,null,"Custo unitário total de transporte"]
[{"$nulls":5},"Custo unitário direto total",null,null,null,{"$f":"TRUNC(J804+J808,2)","v":25.19}]
[null,"Obs."]
[]
[{"$f":"A776+1","v":21},"1ª/GRD",{"$nulls":8},{"$f":"J855","v":1.86}]
[null,"OBRA:"," PAVIMENTAÇÃO ASFÁLTICA EM CBUQ - AV. MILITÃO JOSÉ DOS SANTOS E AV. VEREADOR JOSÉ PRATES (JANAÚBA / MG)"]
[null,"Custo Unitário de Referência",null,null,"Minas Gerais"]
[{"$nulls":4}," Janeiro/2025 ",null,null,"Produção da equipe ",155.59,{"$f":"VLOOKUP(A817,ORÇAMENTO!$A$10:$L$48,7,1)","v":"M2"}]
[null,4915724,"CAIAÇÃO COM FIXADOR DE CAL",{"$nulls":5},"Valores em reais (R$)"]
[null,"A - EQUIPAMENTOS",null,"Quantidade","Utilização",null,"Custo Horário",null,null,"Custo"]
[{"$nulls":4},"Operativa","Improdutiva","Produtivo","Improdutivo",null,"Horário Total"]
[null,"E9256","Equipamento para pintura com cal rebocável com dois bicos aplicadores e capacidade de 2.200 l",1,1,0,33.162300000000002,29.625,null,{"$f":"D824*(E824*G824+F824*H824)","v":33.162300000000002}]
[null,"E9156","Soprador de ar costal - 2,6 kW",1,1,0,5.5557999999999996,0.4864,null,{"$f":"D825*(E825*G825+F825*H825)","v":5.5557999999999996}]
[null,"E9577","Trator agrícola sobre pneus - 77 kW",1,1,0,152.69229999999999,55.394399999999997,null,{"$f":"D826*(E826*G826+F826*H826)","v":152.69229999999999}]
[{"$nulls":7},"Custo horário total de equipamentos",null,{"$f":"SUM(J824:J826)","v":191.41039999999998}]
[null,"B - MÃO DE OBRA",null,"Quantidade","Unidade",null,"Custo Horário","Custo Horário Total"]
[null,"P9824","Servente",2,"h",null,21.3355,null,null,{"$f":"D829*G829","v":42.670999999999999}]
[null,"-",0,0,0,null,0,null,null,{"$f":"D830*G830","v":0}]
[null,null,null,"Custo horário total de mão de obra",{"$nulls":5},{"$f":"SUM(J829:J830)","v":42.670999999999999}]
[null,null,null,"Custo horário total de execução",{"$nulls":5},{"$f":"J827+J831","v":234.08139999999997}]
[null,null,null,"Custo unitário de execução",{"$nulls":5},{"$f":"J832/I820","v":1.5044758660582298}]
[{"$nulls":7},"Custo do FIC",null,"-"]
[{"$nulls":7},"Custo do FIT",null,"-"]
[null,"C - MATERIAL",null,"Quantidade","Unidade",null,"Preço Unitário","Custo Unitário"]
[null,"M0345","Cal hidratada - saco",0.41654999999999998,"kg",null,0.66579999999999995,null,null,{"$f":"D837*G837","v":0.27733898999999995}]
[null,"M0729","Fixador de cal para pintura",6.8999999999999997E-4,"l",null,4.0522,null,null,{"$f":"D838*G838","v":2.7960179999999999E-3}]
[null,"M0043","Óleo diesel",1.389E-2,"l",null,5.5088999999999997,null,null,7.6518620999999995E-2]
[null,null,null,"Custo unitário total de material",{"$nulls":5},{"$f":"SUM(J837:J839)","v":0.35665362899999997}]
[null,"D - ATIVIDADES AUXILIARES",null,"Quantidade","Unidade",null,"Custo Unitário","Custo Unitário"]
[null,"-",0,0,0,null,0,null,null,{"$f":"D842*G842","v":0}]
[null,"-",0,0,0,null,0,null,null,{"$f":"D843*G843","v":0}]
[null,null,null,"Custo total de atividades auxiliares",{"$nulls":5},{"$f":"SUM(J842:J843)","v":0}]
[{"$nulls":7},"Subtotal",null,{"$f":"J833+J840+J844","v":1.8611294950582298}]
[null,"E - TEMPO FIXO",null,"Código","Quantidade","Unidade",null,"Custo Unitário","Custo Unitário"]
[null,"-",0,"-",0,"t",null,0,null,{"$f":"ROUNDDOWN(E847*H847,4)","v":0}]
[null,"-",0,"-",0,"t",null,0,null,{"$f":"ROUNDDOWN(E848*H848,4)","v":0}]
[null,null,null,"Custo unitário total de tempo fixo",{"$nulls":5},{"$f":"SUM(J847:J848)","v":0}]
[null,"F - MOMENTO DE TRANSPORTE",null,"Quantidade","Unidade","DMT",null,null,null,"Custo Unitário"]
[{"$nulls":5},"LN","RP","P"]
[null,"-",0,0,"tkm"]
[null,"-",0,0,"tkm"]
[null,null,null,"Custo unitário total de transporte"]
[{"$nulls":5},"Custo unitário direto total",null,null,null,{"$f":"TRUNC(J845+J849,2)","v":1.86}]
[null,"Obs."]
[]
[42,"1ª/GRD",{"$nulls":8},{"$f":"J898","v":740.64}]
[null,"OBRA:"," PAVIMENTAÇÃO ASFÁLTICA EM CBUQ - AV. MILITÃO JOSÉ DOS SANTOS E AV. VEREADOR JOSÉ PRATES (JANAÚBA / MG)"]
[null,"Custo Unitário de Referência",null,null,"Minas Gerais"]
[{"$nulls":4}," Janeiro/2025 ",null,null,"Produção da equipe ",1,{"$f":"VLOOKUP(A858,ORÇAMENTO!$A$10:$L$48,7,1)","v":"M3"}]
[null,94990,"EXECUÇÃO DE PASSEIO (CALÇADA) OU PISO DE CONCRETO MOLDADO IN LOCO, ACABAMENTO CONVENCIONAL, NÃO ARMADO",{"$nulls":5},"Valores em reais (R$)"]
[null,"A - EQUIPAMENTOS",null,"Quantidade","Utilização",null,"Custo Horário",null,null,"Custo"]
[{"$nulls":4},"Operativa","Improdutiva","Produtivo","Improdutivo",null,"Horário Total"]
[null,"-",0,null,null,null,0,0,null,{"$f":"D865*(E865*G865+F865*H865)","v":0}]
[null,"-",0,null,null,null,0,0,null,{"$f":"D866*(E866*G866+F866*H866)","v":0}]
[{"$nulls":7},"Custo horário total de equipamentos",null,{"$f":"SUM(J865:J866)","v":0}]
[null,"B - MÃO DE OBRA",null,"Quantidade","Unidade",null,"Custo Horário","Custo Horário Total"]
[null,"P9808","Carpinteiro",1.6268,"h",null,26.4529,null,null,{"$f":"D869*G869","v":43.033577719999997}]
[null,"P9821","Pedreiro",1.4149,"h",null,26.6785,null,null,{"$f":"D870*G870","v":37.747409650000002}]
[null,"P9824","Servente",3.0417000000000001,"h",null,21.3355,null,null,64.896190349999998]
[null,null,null,"Custo horário total de mão de obra",{"$nulls":5},{"$f":"SUM(J869:J871)","v":145.67717771999997}]
[null,null,null,"Custo horário total de execução",{"$nulls":5},{"$f":"J867+J872","v":145.67717771999997}]
[null,null,null,"Custo unitário de execução",{"$nulls":5},{"$f":"J873/I861","v":145.67717771999997}]
[{"$nulls":7},"Custo do FIC",null,0]
[{"$nulls":7},"Custo do FIT",null,0]
[null,"C - MATERIAL",null,"Quantidade","Unidade",null,"Preço Unitário","Custo Unitário"]
[null,"M1358","Sarrafo em madeira de terceira - E = 2,5 cm e L = 5 cm",10,"m",null,1.9665999999999999,null,null,{"$f":"D878*G878","v":19.666}]
[null,"M1205","Prego de ferro",0.2994,"kg",null,16.544499999999999,null,null,{"$f":"D879*G879","v":4.9534232999999999}]
[null,"M3949","Desmoldante para fôrmas metálicas",2.1299999999999999E-2,"l",null,16.5001,null,null,0.35145212999999997]
[null,"M0451","Concreto usinado - fck = 20 MPa (comercial)",1,"m³",null,570,null,null,570]
[null,"-",0,null,0,null,0,null,null,0]
[null,null,null,"Custo unitário total de material",{"$nulls":5},{"$f":"SUM(J878:J882)","v":594.97087542999998}]
[null,"D - ATIVIDADES AUXILIARES",null,"Quantidade","Unidade",null,"Custo Unitário","Custo Unitário"]
[null,"-",0,null,0,null,0,null,null,{"$f":"D885*G885","v":0}]
[null,"-",0,null,0,null,0,null,null,{"$f":"D886*G886","v":0}]
[null,null,null,"Custo total de atividades auxiliares",{"$nulls":5},{"$f":"SUM(J885:J886)","v":0}]
[{"$nulls":7},"Subtotal",null,{"$f":"J874+J883+J887+J875+J876","v":740.6480531499999}]
[null,"E - TEMPO FIXO",null,"Código","Quantidade","Unidade",null,"Custo Unitário","Custo Unitário"]
[null,"-",0,"-",null,"t",null,0,null,{"$f":"ROUNDDOWN(E890*H890,4)","v":0}]
[null,"-",0,"-",null,"t",null,0,null,{"$f":"ROUNDDOWN(E891*H891,4)","v":0}]
[null,null,null,"Custo unitário total de tempo fixo",{"$nulls":5},{"$f":"SUM(J890:J891)","v":0}]
[null,"F - MOMENTO DE TRANSPORTE",null,"Quantidade","Unidade","DMT",null,null,null,"Custo Unitário"]
[{"$nulls":5},"LN","RP","P"]
[null,"-",0,null,"tkm"]
[null,"-",0,null,"tkm"]
[null,null,null,"Custo unitário total de transporte"]
[{"$nulls":5},"Custo unitário direto total",null,null,null,{"$f":"TRUNC(J888+J892,2)","v":740.64}]
[null,"Obs."]
[]
[{"$f":"A858+1","v":43},"1ª/GRD",{"$nulls":8},{"$f":"J937","v":198.9}]
[null,"OBRA:"," PAVIMENTAÇÃO ASFÁLTICA EM CBUQ - AV. MILITÃO JOSÉ DOS SANTOS E AV. VEREADOR JOSÉ PRATES (JANAÚBA / MG)"]
[null,"Custo Unitário de Referência",null,null,"Minas Gerais"]
[{"$nulls":4}," Janeiro/2025 ",null,null,"Produção da equipe ",1,{"$f":"VLOOKUP(A901,ORÇAMENTO!$A$10:$L$48,7,1)","v":"UN."}]
[null,"ED-51148a","RAMPA PARA ACESSO DE DEFICIENTES EM CONCRETO SIMPLES, DESEMPENADA ",{"$nulls":5},"Valores em reais (R$)"]
[null,"A - EQUIPAMENTOS",null,"Quantidade","Utilização",null,"Custo Horário",null,null,"Custo"]
[{"$nulls":4},"Operativa","Improdutiva","Produtivo","Improdutivo",null,"Horário Total"]
[null,"-",0,null,null,null,0,0,null,{"$f":"D908*(E908*G908+F908*H908)","v":0}]
[null,"-",0,null,null,null,0,0,null,{"$f":"D909*(E909*G909+F909*H909)","v":0}]
[{"$nulls":7},"Custo horário total de equipamentos",null,{"$f":"SUM(J908:J909)","v":0}]
[null,"B - MÃO DE OBRA",null,"Quantidade","Unidade",null,"Custo Horário","Custo Horário Total"]
[null,"P9821","Pedreiro",1.056,"h",null,26.6785,null,null,{"$f":"D912*G912","v":28.172496000000002}]
[null,"P9824","Servente",1.056,"h",null,21.3355,null,null,{"$f":"D913*G913","v":22.530288000000002}]
[null,null,null,"Custo horário total de mão de obra",{"$nulls":5},{"$f":"SUM(J912:J913)","v":50.702784000000008}]
[null,null,null,"Custo horário total de execução",{"$nulls":5},{"$f":"J910+J914","v":50.702784000000008}]
[null,null,null,"Custo unitário de execução",{"$nulls":5},{"$f":"J915/I904","v":50.702784000000008}]
[{"$nulls":7},"Custo do FIC",null,0]
[{"$nulls":7},"Custo do FIT",null,0]
[null,"C - MATERIAL",null,"Quantidade","Unidade",null,"Preço Unitário","Custo Unitário"]
[null,"M0451","Concreto usinado - fck = 20 MPa (comercial)",0.26,"m³",null,570,null,null,{"$f":"D920*G920","v":148.20000000000002}]
[null,"-",0,0,0,null,0,null,null,0]
[null,null,null,"Custo unitário total de material",{"$nulls":5},{"$f":"SUM(J920:J921)","v":148.20000000000002}]
[null,"D - ATIVIDADES AUXILIARES",null,"Quantidade","Unidade",null,"Custo Unitário","Custo Unitário"]
[null,"-",0,0.89999999999999991,0,null,0,null,null,{"$f":"D924*G924","v":0}]
[null,"-",0,0,0,null,0,null,null,{"$f":"D925*G925","v":0}]
[null,null,null,"Custo total de atividades auxiliares",{"$nulls":5},{"$f":"SUM(J924:J925)","v":0}]
[{"$nulls":7},"Subtotal",null,{"$f":"J916+J922+J926+J917+J918","v":198.90278400000003}]
[null,"E - TEMPO FIXO",null,"Código","Quantidade","Unidade",null,"Custo Unitário","Custo Unitário"]
[null,"-",0,"-",0,"t",null,0,null,{"$f":"ROUNDDOWN(E929*H929,4)","v":0}]
[null,"-",0,"-",0,"t",null,0,null,{"$f":"ROUNDDOWN(E930*H930,4)","v":0}]
[null,null,null,"Custo unitário total de tempo fixo",{"$nulls":5},{"$f":"SUM(J929:J930)","v":0}]
[null,"F - MOMENTO DE TRANSPORTE",null,"Quantidade","Unidade","DMT",null,null,null,"Custo Unitário"]
[{"$nulls":5},"LN","RP","P"]
[null,"-",0,0,"tkm"]
[null,"-",0,0,"tkm"]
[null,null,null,"Custo unitário total de transporte"]
[{"$nulls":5},"Custo unitário direto total",null,null,null,{"$f":"TRUNC(J927+J931,2)","v":198.9}]
[null,"Obs."]
[]
[{"$f":"A901+1","v":44},"1ª/GRD",{"$nulls":8},{"$f":"J976","v":259.49}]
[null,"OBRA:"," PAVIMENTAÇÃO ASFÁLTICA EM CBUQ - AV. MILITÃO JOSÉ DOS SANTOS E AV. VEREADOR JOSÉ PRATES (JANAÚBA / MG)"]
[null,"Custo Unitário de Referência",null,null,"Minas Gerais"]
[{"$nulls":4}," Janeiro/2025 ",null,null,"Produção da equipe ",3,{"$f":"VLOOKUP(A940,ORÇAMENTO!$A$10:$L$48,5,1)","v":"RAMPA PARA ACESSO DE DEFICIENTES EM CONCRETO SIMPLES, DESEMPENADA "}]
[null,"SETOP","ED-51148a",{"$nulls":5},"Valores em reais (R$)"]
[null,"A - EQUIPAMENTOS",null,"Quantidade","Utilização",null,"Custo Horário",null,null,"Custo"]
[{"$nulls":4},"Operativa","Improdutiva","Produtivo","Improdutivo",null,"Horário Total"]
[null,"E9687","Caminhão carroceria com capacidade de 5 t - 115 kW",1,0.3,0.7,146.88079999999999,57.423099999999998,null,{"$f":"D947*(E947*G947+F947*H947)","v":84.260409999999993}]
[null,"-",0,null,null,null,0,0,null,{"$f":"D948*(E948*G948+F948*H948)","v":0}]
[{"$nulls":7},"Custo horário total de equipamentos",null,{"$f":"SUM(J947:J948)","v":84.260409999999993}]
[null,"B - MÃO DE OBRA",null,"Quantidade","Unidade",null,"Custo Horário","Custo Horário Total"]
[null,"P9830","Montador",1,"h",null,36.409500000000001,null,null,{"$f":"D951*G951","v":36.409500000000001}]
[null,"P9824","Servente",2,"h",null,21.3355,null,null,{"$f":"D952*G952","v":42.670999999999999}]
[null,null,null,"Custo horário total de mão de obra",{"$nulls":5},{"$f":"SUM(J951:J952)","v":79.080500000000001}]
[null,null,null,"Custo horário total de execução",{"$nulls":5},{"$f":"J949+J953","v":163.34091000000001}]
[null,null,null,"Custo unitário de execução",{"$nulls":5},{"$f":"J954/I943","v":54.44697}]
[{"$nulls":7},"Custo do FIC",null,0]
[{"$nulls":7},"Custo do FIT",null,0]
[null,"C - MATERIAL",null,"Quantidade","Unidade",null,"Preço Unitário","Custo Unitário"]
[null,"-",0,null,0,null,0,null,null,{"$f":"D959*G959","v":0}]
[null,"-",0,null,0,null,0,null,null,0]
[null,null,null,"Custo unitário total de material",{"$nulls":5},{"$f":"SUM(J959:J960)","v":0}]
[null,"D - ATIVIDADES AUXILIARES",null,"Quantidade","Unidade",null,"Custo Unitário","Custo Unitário"]
[null,5213414,"Placa em aço nº 16 galvanizado com película retrorrefletiva tipo I + SI - confecção",0.36,"m²",null,569.58000000000004,null,null,{"$f":"D963*G963","v":205.0488}]
[null,"-",0,null,0,null,0,null,null,{"$f":"D964*G964","v":0}]
[null,null,null,"Custo total de atividades auxiliares",{"$nulls":5},{"$f":"SUM(J963:J964)","v":205.0488}]
[{"$nulls":7},"Subtotal",null,{"$f":"J955+J961+J965+J956+J957","v":259.49576999999999}]
[null,"E - TEMPO FIXO",null,"Código","Quantidade","Unidade",null,"Custo Unitário","Custo Unitário"]
[null,"-",0,"-",null,"t",null,0,null,{"$f":"ROUNDDOWN(E968*H968,4)","v":0}]
[null,"-",0,"-",null,"t",null,0,null,{"$f":"ROUNDDOWN(E969*H969,4)","v":0}]
[null,null,null,"Custo unitário total de tempo fixo",{"$nulls":5},{"$f":"SUM(J968:J969)","v":0}]
[null,"F - MOMENTO DE TRANSPORTE",null,"Quantidade","Unidade","DMT",null,null,null,"Custo Unitário"]
[{"$nulls":5},"LN","RP","P"]
[null,"-",0,null,"tkm"]
[null,"-",0,null,"tkm"]
[null,null,null,"Custo unitário total de transporte"]
[{"$nulls":5},"Custo unitário direto total",null,null,null,{"$f":"TRUNC(J966+J970,2)","v":259.49}]
[null,"Obs."]
[]
[{"$f":"A940+1","v":45},"1ª/GRD",{"$nulls":8},{"$f":"J1016","v":361.25}]
[null,"OBRA:"," PAVIMENTAÇÃO ASFÁLTICA EM CBUQ - AV. MILITÃO JOSÉ DOS SANTOS E AV. VEREADOR JOSÉ PRATES (JANAÚBA / MG)"]
[null,"Custo Unitário de Referência",null,null,"Minas Gerais"]
[{"$nulls":4}," Janeiro/2025 ",null,null,"Produção da equipe ",3,{"$f":"VLOOKUP(A979,ORÇAMENTO!$A$10:$L$48,7,1)","v":"UN."}]
[null,5213440,"PLACA DE REGULAMENTAÇÃO EM AÇO, D=60CM - PELÍCULA RETRORREFLETIVA - FORNECIMENTO E INSTALAÇÃO, INCLUSIVE  SUPORTE",{"$nulls":5},"Valores em reais (R$)"]
[null,"A - EQUIPAMENTOS",null,"Quantidade","Utilização",null,"Custo Horário",null,null,"Custo"]
[{"$nulls":4},"Operativa","Improdutiva","Produtivo","Improdutivo",null,"Horário Total"]
[null,"E9687","Caminhão carroceria com capacidade de 5 t - 115 kW",1,0.3,0.7,146.88079999999999,57.423099999999998,null,{"$f":"D986*(E986*G986+F986*H986)","v":84.260409999999993}]
[null,"-",0,null,null,null,0,0,null,{"$f":"D987*(E987*G987+F987*H987)","v":0}]
[{"$nulls":7},"Custo horário total de equipamentos",null,{"$f":"SUM(J986:J987)","v":84.260409999999993}]
[null,"B - MÃO DE OBRA",null,"Quantidade","Unidade",null,"Custo Horário","Custo Horário Total"]
[null,"P9830","Montador",1,"h",null,36.409500000000001,null,null,{"$f":"D990*G990","v":36.409500000000001}]
[null,"P9824","Servente",2,"h",null,21.3355,null,null,{"$f":"D991*G991","v":42.670999999999999}]
[null,null,null,"Custo horário total de mão de obra",{"$nulls":5},{"$f":"SUM(J990:J991)","v":79.080500000000001}]
[null,null,null,"Custo horário total de execução",{"$nulls":5},{"$f":"J988+J992","v":163.34091000000001}]
[null,null,null,"Custo unitário de execução",{"$nulls":5},{"$f":"J993/I982","v":54.44697}]
[{"$nulls":7},"Custo do FIC",null,0]
[{"$nulls":7},"Custo do FIT",null,0]
[null,"C - MATERIAL",null,"Quantidade","Unidade",null,"Preço Unitário","Custo Unitário"]
[null,"M0789","Conjunto para fixação de placas em aço galvanizado composto por barra chata, abraçadeira, parafusos, porcas e arruelas",0.14829787234042552,"kg",null,29.133400000000002,null,null,{"$f":"D998*G998","v":4.320421234042553}]
[null,"M0787","Suporte em aço-carbono galvanizado tipo perfil C para placa de sinalização",2.4051063829787234,"kg",null,29.503499999999999,null,null,{"$f":"D999*G999","v":70.959056170212762}]
[null,null,null,"Custo unitário total de material",{"$nulls":5},{"$f":"SUM(J998:J999)","v":75.279477404255317}]
[null,"D - ATIVIDADES AUXILIARES",null,"Quantidade","Unidade",null,"Custo Unitário","Custo Unitário"]
[null,5213414,"Placa em aço nº 16 galvanizado com película retrorrefletiva tipo I + SI - confecção",0.35993999999999998,"m²",null,569.58000000000004,null,null,{"$f":"D1002*G1002","v":205.01462520000001}]
[null,4805750,"Escavação manual em material de 1ª categoria na profundidade de até 1 m",5.0270000000000002E-2,"m³",null,43.54,null,null,{"$f":"D1003*G1003","v":2.1887558}]
[null,1107892,"Concreto fck = 20 MPa - confecção em betoneira e lançamento manual - areia e brita comerciais",5.0270000000000002E-2,"m³",null,483.94,null,null,{"$f":"D1004*G1004","v":24.3276638}]
[null,null,null,"Custo total de atividades auxiliares",{"$nulls":5},{"$f":"SUM(J1002:J1004)","v":231.53104480000002}]
[{"$nulls":7},"Subtotal",null,{"$f":"J994+J1000+J1005+J995+J996","v":361.2574922042553}]
[null,"E - TEMPO FIXO",null,"Código","Quantidade","Unidade",null,"Custo Unitário","Custo Unitário"]
[null,"-",0,"-",null,"t",null,0,null,{"$f":"ROUNDDOWN(E1008*H1008,4)","v":0}]
[null,"-",0,"-",null,"t",null,0,null,{"$f":"ROUNDDOWN(E1009*H1009,4)","v":0}]
[null,null,null,"Custo unitário total de tempo fixo",{"$nulls":5},{"$f":"SUM(J1008:J1009)","v":0}]
[null,"F - MOMENTO DE TRANSPORTE",null,"Quantidade","Unidade","DMT",null,null,null,"Custo Unitário"]
[{"$nulls":5},"LN","RP","P"]
[null,"-",0,null,"tkm"]
[null,"-",0,null,"tkm"]
[null,null,null,"Custo unitário total de transporte"]
[{"$nulls":5},"Custo unitário direto total",null,null,null,{"$f":"TRUNC(J1006+J1010,2)","v":361.25}]
[null,"Obs."]
[]
[{"$f":"A979+1","v":46},"1ª/GRD",{"$nulls":8},{"$f":"J1055","v":106.22}]
[null,"OBRA:"," PAVIMENTAÇÃO ASFÁLTICA EM CBUQ - AV. MILITÃO JOSÉ DOS SANTOS E AV. VEREADOR JOSÉ PRATES (JANAÚBA / MG)"]
[null,"Custo Unitário de Referência",null,null,"Minas Gerais"]
[{"$nulls":4}," Janeiro/2025 ",null,null,"Produção da equipe ",6,{"$f":"VLOOKUP(A1019,ORÇAMENTO!$A$10:$L$48,7,1)","v":"UN."}]
[null,"5213440a","PLACA DE IDENTIFICAÇÃO DE VIAS EM AÇO, 0,64 X 0,30M - PELÍCULA RETRORREFLETIVA - FORNECIMENTO E IMPLANTAÇÃO",{"$nulls":5},"Valores em reais (R$)"]
[null,"A - EQUIPAMENTOS",null,"Quantidade","Utilização",null,"Custo Horário",null,null,"Custo"]
[{"$nulls":4},"Operativa","Improdutiva","Produtivo","Improdutivo",null,"Horário Total"]
[null,"-",0,null,null,null,0,0,null,{"$f":"D1026*(E1026*G1026+F1026*H1026)","v":0}]
[null,"-",0,null,null,null,0,0,null,{"$f":"D1027*(E1027*G1027+F1027*H1027)","v":0}]
[{"$nulls":7},"Custo horário total de equipamentos",null,{"$f":"SUM(J1026:J1027)","v":0}]
[null,"B - MÃO DE OBRA",null,"Quantidade","Unidade",null,"Custo Horário","Custo Horário Total"]
[null,"P9830","Montador",1,"h",null,36.409500000000001,null,null,{"$f":"D1030*G1030","v":36.409500000000001}]
[null,"P9824","Servente",1,"h",null,21.3355,null,null,{"$f":"D1031*G1031","v":21.3355}]
[null,null,null,"Custo horário total de mão de obra",{"$nulls":5},{"$f":"SUM(J1030:J1031)","v":57.745000000000005}]
[null,null,null,"Custo horário total de execução",{"$nulls":5},{"$f":"J1028+J1032","v":57.745000000000005}]
[null,null,null,"Custo unitário de execução",{"$nulls":5},{"$f":"J1033/I1022","v":9.6241666666666674}]
[{"$nulls":7},"Custo do FIC",null,0]
[{"$nulls":7},"Custo do FIT",null,0]
[null,"C - MATERIAL",null,"Quantidade","Unidade",null,"Preço Unitário","Custo Unitário"]
[null,"M0789","Conjunto para fixação de placas em aço galvanizado composto por barra chata, abraçadeira, parafusos, porcas e arruelas",0.69699999999999995,"kg",null,29.133400000000002,null,null,{"$f":"D1038*G1038","v":20.305979799999999}]
[null,"-",0,null,0,null,0,null,null,{"$f":"D1039*G1039","v":0}]
[null,null,null,"Custo unitário total de material",{"$nulls":5},{"$f":"SUM(J1038:J1039)","v":20.305979799999999}]
[null,"D - ATIVIDADES AUXILIARES",null,"Quantidade","Unidade",null,"Custo Unitário","Custo Unitário"]
[null,5213421,"Placa em aço nº 16 galvanizado com película retrorrefletiva tipo I + IV - confecção",0.192,"m²",null,397.37,null,null,{"$f":"D1042*G1042","v":76.29504}]
[null,"-",0,null,0,null,0,null,null,{"$f":"D1043*G1043","v":0}]
[null,null,null,"Custo total de atividades auxiliares",{"$nulls":5},{"$f":"SUM(J1042:J1043)","v":76.29504}]
[{"$nulls":7},"Subtotal",null,{"$f":"J1034+J1040+J1044+J1035+J1036","v":106.22518646666667}]
[null,"E - TEMPO FIXO",null,"Código","Quantidade","Unidade",null,"Custo Unitário","Custo Unitário"]
[null,"-",0,"-",null,"t",null,0,null,{"$f":"ROUNDDOWN(E1047*H1047,4)","v":0}]
[null,"-",0,"-",null,"t",null,0,null,{"$f":"ROUNDDOWN(E1048*H1048,4)","v":0}]
[null,null,null,"Custo unitário total de tempo fixo",{"$nulls":5},{"$f":"SUM(J1047:J1048)","v":0}]
[null,"F - MOMENTO DE TRANSPORTE",null,"Quantidade","Unidade","DMT",null,null,null,"Custo Unitário"]
[{"$nulls":5},"LN","RP","P"]
[null,"-",0,null,"tkm"]
[null,"-",0,null,"tkm"]
[null,null,null,"Custo unitário total de transporte"]
[{"$nulls":5},"Custo unitário direto total",null,null,null,{"$f":"TRUNC(J1045+J1049,2)","v":106.22}]
[null,"Obs."]
[]
[{"$f":"A1019+1","v":47},"1ª/GRD",{"$nulls":8},{"$f":"J1094","v":372.97}]
[null,"OBRA:"," PAVIMENTAÇÃO ASFÁLTICA EM CBUQ - AV. MILITÃO JOSÉ DOS SANTOS E AV. VEREADOR JOSÉ PRATES (JANAÚBA / MG)"]
[null,"Custo Unitário de Referência",null,null,"Minas Gerais"]
[{"$nulls":4}," Janeiro/2025 ",null,null,"Produção da equipe ",66.400000000000006,{"$f":"VLOOKUP(A1058,ORÇAMENTO!$A$10:$L$48,5,1)","v":"PLACA DE IDENTIFICAÇÃO DE VIAS EM AÇO, 0,64 X 0,30M - PELÍCULA RETRORREFLETIVA - FORNECIMENTO E IMPLANTAÇÃO"}]
[null,"SICRO","5213440a",{"$nulls":5},"Valores em reais (R$)"]
[null,"A - EQUIPAMENTOS",null,"Quantidade","Utilização",null,"Custo Horário",null,null,"Custo"]
[{"$nulls":4},"Operativa","Improdutiva","Produtivo","Improdutivo",null,"Horário Total"]
[null,"E9082","Bate-estaca hidráulico para defensas montado em caminhão guindauto com capacidade de 20 t.m e carroceria de 4 t - 136 kW",1,1,0,351.34030000000001,149.98169999999999,null,{"$f":"D1065*(E1065*G1065+F1065*H1065)","v":351.34030000000001}]
[null,"-",0,null,null,null,0,0,null,{"$f":"D1066*(E1066*G1066+F1066*H1066)","v":0}]
[{"$nulls":7},"Custo horário total de equipamentos",null,{"$f":"SUM(J1065:J1066)","v":351.34030000000001}]
[null,"B - MÃO DE OBRA",null,"Quantidade","Unidade",null,"Custo Horário","Custo Horário Total"]
[null,"P9801","Ajudante",3,"h",null,23.050599999999999,null,null,{"$f":"D1069*G1069","v":69.151799999999994}]
[null,"P9830","Montador",1,"h",null,36.409500000000001,null,null,{"$f":"D1070*G1070","v":36.409500000000001}]
[null,null,null,"Custo horário total de mão de obra",{"$nulls":5},{"$f":"SUM(J1069:J1070)","v":105.56129999999999}]
[null,null,null,"Custo horário total de execução",{"$nulls":5},{"$f":"J1067+J1071","v":456.90160000000003}]
[null,null,null,"Custo unitário de execução",{"$nulls":5},{"$f":"J1072/I1061","v":6.8810481927710843}]
[{"$nulls":7},"Custo do FIC",null,0]
[{"$nulls":7},"Custo do FIT",null,0]
[null,"C - MATERIAL",null,"Quantidade","Unidade",null,"Preço Unitário","Custo Unitário"]
[null,"M1968","Defensa metálica semimaleável simples",0.25,"un",null,1462.6141,null,null,{"$f":"D1077*G1077","v":365.653525}]
[null,"-",0,0,0,null,0,null,null,{"$f":"D1078*G1078","v":0}]
[null,null,null,"Custo unitário total de material",{"$nulls":5},{"$f":"SUM(J1077:J1078)","v":365.653525}]
[null,"D - ATIVIDADES AUXILIARES",null,"Quantidade","Unidade",null,"Custo Unitário","Custo Unitário"]
[null,"-",0,null,0,null,0,null,null,{"$f":"D1081*G1081","v":0}]
[null,"-",0,null,0,null,0,null,null,{"$f":"D1082*G1082","v":0}]
[null,null,null,"Custo total de atividades auxiliares",{"$nulls":5},{"$f":"SUM(J1081:J1082)","v":0}]
[{"$nulls":7},"Subtotal",null,{"$f":"J1073+J1079+J1083+J1074+J1075","v":372.53457319277106}]
[null,"E - TEMPO FIXO",null,"Código","Quantidade","Unidade",null,"Custo Unitário","Custo Unitário"]
[null,"M1968","Defensa metálica semimaleável simples",5915373,1.9359999999999999E-2,"t",null,17.96,null,{"$f":"ROUNDDOWN(E1086*H1086,4)","v":0.34770000000000001}]
[null,"M3511","Acessórios e materiais metálicos",5915373,5.0000000000000001E-3,"t",null,17.96,null,{"$f":"ROUNDDOWN(E1087*H1087,4)","v":8.9800000000000005E-2}]
[null,null,null,"Custo unitário total de tempo fixo",{"$nulls":5},{"$f":"SUM(J1086:J1087)","v":0.4375}]
[null,"F - MOMENTO DE TRANSPORTE",null,"Quantidade","Unidade","DMT",null,null,null,"Custo Unitário"]
[{"$nulls":5},"LN","RP","P"]
[null,"M1968","Defensa metálica semimaleável simples",1.9359999999999999E-2,"tkm"]
[null,"M3511","Acessórios e materiais metálicos",5.0000000000000001E-3,"tkm"]
[null,null,null,"Custo unitário total de transporte"]
[{"$nulls":5},"Custo unitário direto total",null,null,null,{"$f":"TRUNC(J1084+J1088,2)","v":372.97}]
[null,"Obs."]
[]
[{"$f":"A1058+1","v":48},"1ª/GRD",{"$nulls":8},{"$f":"J1140","v":29.17}]
[null,"OBRA:"," PAVIMENTAÇÃO ASFÁLTICA EM CBUQ - AV. MILITÃO JOSÉ DOS SANTOS E AV. VEREADOR JOSÉ PRATES (JANAÚBA / MG)"]
[null,"Custo Unitário de Referência",null,null,"Minas Gerais"]
[{"$nulls":4}," Janeiro/2025 ",null,null,"Produção da equipe ",149.4,{"$f":"VLOOKUP(A1097,ORÇAMENTO!$A$10:$L$48,7,1)","v":"M2"}]
[null,5213401,"PINTURA DE EIXO VIÁRIO SOBRE ASFALTO COM TINTA RETRORREFLETIVA A BASE DE RESINA ACRÍLICA COM MICROESFERAS DE VIDRO, APLICAÇÃO MECÂNICA COM DEMARCADORA AUTOPROPELIDA",{"$nulls":5},"Valores em reais (R$)"]
[null,"A - EQUIPAMENTOS",null,"Quantidade","Utilização",null,"Custo Horário",null,null,"Custo"]
[{"$nulls":4},"Operativa","Improdutiva","Produtivo","Improdutivo",null,"Horário Total"]
[null,"E9644","Caminhão demarcador de faixas com sistema de pintura a frio - 28 kW/115 kW",1,1,0,374.84390000000002,155.3843,null,{"$f":"D1104*(E1104*G1104+F1104*H1104)","v":374.84390000000002}]
[null,"-",0,null,null,null,0,0,null,{"$f":"D1105*(E1105*G1105+F1105*H1105)","v":0}]
[{"$nulls":7},"Custo horário total de equipamentos",null,{"$f":"SUM(J1104:J1105)","v":374.84390000000002}]
[null,"B - MÃO DE OBRA",null,"Quantidade","Unidade",null,"Custo Horário","Custo Horário Total"]
[null,"P9853","Pré-marcador",1,"h",null,22.8993,null,null,{"$f":"D1108*G1108","v":22.8993}]
[null,"P9824","Servente",4,"h",null,21.3355,null,null,{"$f":"D1109*G1109","v":85.341999999999999}]
[null,null,null,"Custo horário total de mão de obra",{"$nulls":5},{"$f":"SUM(J1108:J1109)","v":108.2413}]
[null,null,null,"Custo horário total de execução",{"$nulls":5},{"$f":"J1106+J1110","v":483.08519999999999}]
[null,null,null,"Custo unitário de execução",{"$nulls":5},{"$f":"J1111/I1100","v":3.2335020080321284}]
[{"$nulls":7},"Custo do FIC",null,0]
[{"$nulls":7},"Custo do FIT",null,0]
[null,"C - MATERIAL",null,"Quantidade","Unidade",null,"Preço Unitário","Custo Unitário"]
[null,"M2037","Microesferas refletivas de vidro tipo I-B",0.12,"kg",null,8.7245000000000008,null,null,{"$f":"D1116*G1116","v":1.04694}]
[null,"M2038","Microesferas refletivas de vidro tipo II-A",0.35,"kg",null,8.9086999999999996,null,null,{"$f":"D1117*G1117","v":3.1180449999999995}]
[null,"M2034","Solvente para tinta à base de resina acrílica",0.03,"l",null,16.8491,null,null,0.50547299999999995]
[null,"M2044","Tinta à base de resina acrílica emulsionada em água para pré-marcação viária",9.7000000000000005E-4,"l",null,21.025400000000001,null,null,2.0394638000000003E-2]
[null,"M2027","Tinta à base de resina acrílica estirenada para demarcação viária",0.6,"l",null,35.350499999999997,null,null,21.210299999999997]
[null,null,null,"Custo unitário total de material",{"$nulls":5},{"$f":"SUM(J1116:J1120)","v":25.901152637999996}]
[null,"D - ATIVIDADES AUXILIARES",null,"Quantidade","Unidade",null,"Custo Unitário","Custo Unitário"]
[null,"-",0,null,0,null,0,null,null,{"$f":"D1123*G1123","v":0}]
[null,"-",0,null,0,null,0,null,null,{"$f":"D1124*G1124","v":0}]
[null,null,null,"Custo total de atividades auxiliares",{"$nulls":5},{"$f":"SUM(J1123:J1124)","v":0}]
[{"$nulls":7},"Subtotal",null,{"$f":"J1112+J1121+J1125+J1113+J1114","v":29.134654646032125}]
[null,"E - TEMPO FIXO",null,"Código","Quantidade","Unidade",null,"Custo Unitário","Custo Unitário"]
[null,"M2037","Microesferas refletivas de vidro tipo I-B",5914655,1.2E-4,"t",null,32.520000000000003,null,{"$f":"ROUNDDOWN(E1128*H1128,4)","v":3.8999999999999998E-3}]
[null,"M2038","Microesferas refletivas de vidro tipo II-A",5914655,3.5E-4,"t",null,32.520000000000003,null,{"$f":"ROUNDDOWN(E1129*H1129,4)","v":1.1299999999999999E-2}]
[null,"M2034","Solvente para tinta à base de resina acrílica",5914655,3.0000000000000001E-5,"t",null,32.520000000000003,null,8.9999999999999998E-4]
[null,"M2027","Tinta à base de resina acrílica estirenada para demarcação viária",5914655,8.3000000000000001E-4,"t",null,32.520000000000003,null,2.69E-2]
[null,null,null,"Custo unitário total de tempo fixo",{"$nulls":5},{"$f":"SUM(J1128:J1131)","v":4.2999999999999997E-2}]
[null,"F - MOMENTO DE TRANSPORTE",null,"Quantidade","Unidade","DMT",null,null,null,"Custo Unitário"]
[{"$nulls":5},"LN","RP","P"]
[null,"M2037","Microesferas refletivas de vidro tipo I-B",1.2E-4,"tkm"]
[null,"M2038","Microesferas refletivas de vidro tipo II-A",3.5E-4,"tkm"]
[null,"M2034","Solvente para tinta à base de resina acrílica",3.0000000000000001E-5,"tkm"]
[null,"M2027","Tinta à base de resina acrílica estirenada para demarcação viária",8.3000000000000001E-4,"tkm"]
[null,null,null,"Custo unitário total de transporte"]
[{"$nulls":5},"Custo unitário direto total",null,null,null,{"$f":"TRUNC(J1126+J1132,2)","v":29.17}]
[null,"Obs."]
[]
[{"$f":"A1097+1","v":49},"1ª/GRD",{"$nulls":8},{"$f":"J1181","v":31.08}]
[null,"OBRA:"," PAVIMENTAÇÃO ASFÁLTICA EM CBUQ - AV. MILITÃO JOSÉ DOS SANTOS E AV. VEREADOR JOSÉ PRATES (JANAÚBA / MG)"]
[null,"Custo Unitário de Referência",null,null,"Minas Gerais"]
[{"$nulls":4}," Janeiro/2025 ",null,null,"Produção da equipe ",36,{"$f":"VLOOKUP(A1143,ORÇAMENTO!$A$10:$L$48,7,1)","v":"UNID."}]
[null,5213360,"TACHA REFLETIVA EM PLÁSTICO INJETADO - BIDIRECIONAL COM UM PINO - FORNECIMENTO E COLOCAÇÃO",{"$nulls":5},"Valores em reais (R$)"]
[null,"A - EQUIPAMENTOS",null,"Quantidade","Utilização",null,"Custo Horário",null,null,"Custo"]
[{"$nulls":4},"Operativa","Improdutiva","Produtivo","Improdutivo",null,"Horário Total"]
[null,"E9687","Caminhão carroceria com capacidade de 5 t - 115 kW",1,1,0,146.88079999999999,57.423099999999998,null,{"$f":"D1150*(E1150*G1150+F1150*H1150)","v":146.88079999999999}]
[null,"E9764","Grupo gerador - 7,2 kVA",1,1,0,10.466200000000001,0.4899,null,{"$f":"D1151*(E1151*G1151+F1151*H1151)","v":10.466200000000001}]
[null,"E9675","Martelete perfurador/rompedor elétrico - 1,50 kW",1,1,0,1.2357,0.68189999999999995,null,{"$f":"D1152*(E1152*G1152+F1152*H1152)","v":1.2357}]
[{"$nulls":7},"Custo horário total de equipamentos",null,{"$f":"SUM(J1150:J1152)","v":158.58269999999999}]
[null,"B - MÃO DE OBRA",null,"Quantidade","Unidade",null,"Custo Horário","Custo Horário Total"]
[null,"P9830","Montador",1,"h",null,36.409500000000001,null,null,{"$f":"D1155*G1155","v":36.409500000000001}]
[null,"P9824","Servente",5,"h",null,21.3355,null,null,{"$f":"D1156*G1156","v":106.67749999999999}]
[null,null,null,"Custo horário total de mão de obra",{"$nulls":5},{"$f":"SUM(J1155:J1156)","v":143.08699999999999}]
[null,null,null,"Custo horário total de execução",{"$nulls":5},{"$f":"J1153+J1157","v":301.66969999999998}]
[null,null,null,"Custo unitário de execução",{"$nulls":5},{"$f":"J1158/I1146","v":8.3797138888888885}]
[{"$nulls":7},"Custo do FIC",null,0]
[{"$nulls":7},"Custo do FIT",null,0]
[null,"C - MATERIAL",null,"Quantidade","Unidade",null,"Preço Unitário","Custo Unitário"]
[null,"M2041","Adesivo à base de resina poliéster",0.10292,"kg",null,28.1373,null,null,{"$f":"D1163*G1163","v":2.8958909159999999}]
[null,"M1528","Broca de widia - D = 13 mm e C = 150 mm",3.4099999999999998E-3,"un",null,20.665500000000002,null,null,{"$f":"D1164*G1164","v":7.0469354999999997E-2}]
[null,"M3821","Tacha refletiva em plástico injetado bidirecional com um pino - tipo I",1,"un",null,19.734000000000002,null,null,19.734000000000002]
[null,null,null,"Custo unitário total de material",{"$nulls":5},{"$f":"SUM(J1163:J1165)","v":22.700360271000001}]
[null,"D - ATIVIDADES AUXILIARES",null,"Quantidade","Unidade",null,"Custo Unitário","Custo Unitário"]
[null,"-",0,null,0,null,0,null,null,{"$f":"D1168*G1168","v":0}]
[null,"-",0,null,0,null,0,null,null,{"$f":"D1169*G1169","v":0}]
[null,null,null,"Custo total de atividades auxiliares",{"$nulls":5},{"$f":"SUM(J1168:J1169)","v":0}]
[{"$nulls":7},"Subtotal",null,{"$f":"J1159+J1166+J1170+J1160+J1161","v":31.080074159888888}]
[null,"E - TEMPO FIXO",null,"Código","Quantidade","Unidade",null,"Custo Unitário","Custo Unitário"]
[null,"M2041","Adesivo à base de resina poliéster",5914655,1E-4,"t",null,32.520000000000003,null,{"$f":"ROUNDDOWN(E1173*H1173,4)","v":3.2000000000000002E-3}]
[null,"M3821","Tacha refletiva em plástico injetado bidirecional com um pino - tipo I",5914655,1.6000000000000001E-4,"t",null,32.520000000000003,null,{"$f":"ROUNDDOWN(E1174*H1174,4)","v":5.1999999999999998E-3}]
[null,null,null,"Custo unitário total de tempo fixo",{"$nulls":5},{"$f":"SUM(J1173:J1174)","v":8.3999999999999995E-3}]
[null,"F - MOMENTO DE TRANSPORTE",null,"Quantidade","Unidade","DMT",null,null,null,"Custo Unitário"]
[{"$nulls":5},"LN","RP","P"]
[null,"M2041","Adesivo à base de resina poliéster",1E-4,"tkm"]
[null,"M3821","Tacha refletiva em plástico injetado bidirecional com um pino - tipo I",1.6000000000000001E-4,"tkm"]
[null,null,null,"Custo unitário total de transporte"]
[{"$nulls":5},"Custo unitário direto total",null,null,null,{"$f":"TRUNC(J1171+J1175,2)","v":31.08}]
[null,"Obs."]
[]
[{"$f":"A1143+1","v":50},"1ª/GRD",{"$nulls":8},{"$f":"J1227","v":41.95}]
[null,"OBRA:"," PAVIMENTAÇÃO ASFÁLTICA EM CBUQ - AV. MILITÃO JOSÉ DOS SANTOS E AV. VEREADOR JOSÉ PRATES (JANAÚBA / MG)"]
[null,"Custo Unitário de Referência",null,null,"Minas Gerais"]
[{"$nulls":4}," Janeiro/2025 ",null,null,"Produção da equipe ",30.18,{"$f":"VLOOKUP(A1184,ORÇAMENTO!$A$10:$L$48,7,1)","v":"M2"}]
[null,5213405,"PINTURA DE FAIXA DE PEDESTRE OU ZEBRADA TINTA RETRORREFLETIVA A BASE DE RESINA ACRÍLICA COM MICROESFERAS DE VIDRO, APLICAÇÃO MANUAL",{"$nulls":5},"Valores em reais (R$)"]
[null,"A - EQUIPAMENTOS",null,"Quantidade","Utilização",null,"Custo Horário",null,null,"Custo"]
[{"$nulls":4},"Operativa","Improdutiva","Produtivo","Improdutivo",null,"Horário Total"]
[null,"E9644","Caminhão demarcador de faixas com sistema de pintura a frio - 28 kW/115 kW",1,1,0,374.84390000000002,155.3843,null,{"$f":"D1191*(E1191*G1191+F1191*H1191)","v":374.84390000000002}]
[null,"-",0,null,null,null,0,0,null,{"$f":"D1192*(E1192*G1192+F1192*H1192)","v":0}]
[{"$nulls":7},"Custo horário total de equipamentos",null,{"$f":"SUM(J1191:J1192)","v":374.84390000000002}]
[null,"B - MÃO DE OBRA",null,"Quantidade","Unidade",null,"Custo Horário","Custo Horário Total"]
[null,"P9853","Pré-marcador",1,"h",null,22.8993,null,null,{"$f":"D1195*G1195","v":22.8993}]
[null,"P9824","Servente",4,"h",null,21.3355,null,null,{"$f":"D1196*G1196","v":85.341999999999999}]
[null,null,null,"Custo horário total de mão de obra",{"$nulls":5},{"$f":"SUM(J1195:J1196)","v":108.2413}]
[null,null,null,"Custo horário total de execução",{"$nulls":5},{"$f":"J1193+J1197","v":483.08519999999999}]
[null,null,null,"Custo unitário de execução",{"$nulls":5},{"$f":"J1198/I1187","v":16.006799204771372}]
[{"$nulls":7},"Custo do FIC",null,0]
[{"$nulls":7},"Custo do FIT",null,0]
[null,"C - MATERIAL",null,"Quantidade","Unidade",null,"Preço Unitário","Custo Unitário"]
[null,"M2037","Microesferas refletivas de vidro tipo I-B",0.12,"kg",null,8.7245000000000008,null,null,{"$f":"D1203*G1203","v":1.04694}]
[null,"M2038","Microesferas refletivas de vidro tipo II-A",0.35,"kg",null,8.9086999999999996,null,null,{"$f":"D1204*G1204","v":3.1180449999999995}]
[null,"M2034","Solvente para tinta à base de resina acrílica",0.03,"l",null,16.8491,null,null,0.50547299999999995]
[null,"M2044","Tinta à base de resina acrílica emulsionada em água para pré-marcação viária",9.7000000000000005E-4,"l",null,21.025400000000001,null,null,2.0394638000000003E-2]
[null,"M2027","Tinta à base de resina acrílica estirenada para demarcação viária",0.6,"l",null,35.350499999999997,null,null,21.210299999999997]
[null,null,null,"Custo unitário total de material",{"$nulls":5},{"$f":"SUM(J1203:J1207)","v":25.901152637999996}]
[null,"D - ATIVIDADES AUXILIARES",null,"Quantidade","Unidade",null,"Custo Unitário","Custo Unitário"]
[null,"-",0,null,0,null,0,null,null,{"$f":"D1210*G1210","v":0}]
[null,"-",0,null,0,null,0,null,null,{"$f":"D1211*G1211","v":0}]
[null,null,null,"Custo total de atividades auxiliares",{"$nulls":5},{"$f":"SUM(J1210:J1211)","v":0}]
[{"$nulls":7},"Subtotal",null,{"$f":"J1199+J1208+J1212+J1200+J1201","v":41.907951842771368}]
[null,"E - TEMPO FIXO",null,"Código","Quantidade","Unidade",null,"Custo Unitário","Custo Unitário"]
[null,"M2037","Microesferas refletivas de vidro tipo I-B",5914655,1.2E-4,"t",null,32.520000000000003,null,{"$f":"ROUNDDOWN(E1215*H1215,4)","v":3.8999999999999998E-3}]
[null,"M2038","Microesferas refletivas de vidro tipo II-A",5914655,3.5E-4,"t",null,32.520000000000003,null,{"$f":"ROUNDDOWN(E1216*H1216,4)","v":1.1299999999999999E-2}]
[null,"M2034","Solvente para tinta à base de resina acrílica",5914655,3.0000000000000001E-5,"t",null,32.520000000000003,null,8.9999999999999998E-4]
[null,"M2027","Tinta à base de resina acrílica estirenada para demarcação viária",5914655,8.3000000000000001E-4,"t",null,32.520000000000003,null,2.69E-2]
[null,null,null,"Custo unitário total de tempo fixo",{"$nulls":5},{"$f":"SUM(J1215:J1218)","v":4.2999999999999997E-2}]
[null,"F - MOMENTO DE TRANSPORTE",null,"Quantidade","Unidade","DMT",null,null,null,"Custo Unitário"]
[{"$nulls":5},"LN","RP","P"]
[null,"M2037","Microesferas refletivas de vidro tipo I-B",1.2E-4,"tkm"]
[null,"M2038","Microesferas refletivas de vidro tipo II-A",3.5E-4,"tkm"]
[null,"M2034","Solvente para tinta à base de resina acrílica",3.0000000000000001E-5,"tkm"]
[null,"M2027","Tinta à base de resina acrílica estirenada para demarcação viária",8.3000000000000001E-4,"tkm"]
[null,null,null,"Custo unitário total de transporte"]
[{"$nulls":5},"Custo unitário direto total",null,null,null,{"$f":"TRUNC(J1213+J1219,2)","v":41.95}]
[null,"Obs."]

{"sheet":"CPU-FORNEC","index":2,"n_rows":92,"n_cols":14,"rows_kept":92,"cut":false,"hidden":false,"merged":[[81,1,81,7],[82,0,91,0],[82,1,82,3],[82,4,82,7],[83,2,83,5],[84,2,84,3],[85,1,85,7],[88,1,88,3],[88,5,88,6],[89,1,89,6],[90,1,90,6],[91,1,91,6],[60,0,69,0],[60,1,60,3],[60,4,60,7],[61,2,61,5],[62,2,62,3],[63,1,63,7],[66,1,66,3],[66,5,66,6],[67,1,67,6],[68,1,68,6],[69,1,69,6],[38,0,47,0],[38,1,38,3],[38,4,38,7],[39,2,39,5],[40,2,40,3],[41,1,41,7],[44,1,44,3],[44,5,44,6],[45,1,45,6],[46,1,46,6],[47,1,47,6],[22,5,22,6],[23,1,23,6],[24,1,24,6],[25,1,25,6],[5,1,5,7],[9,1,9,7],[13,1,13,7],[17,1,17,7],[0,10,0,11],[1,2,1,5],[1,10,1,11],[2,2,2,3],[3,1,3,7],[27,4,27,7],[28,2,28,5],[27,0,36,0],[29,2,29,3],[30,1,30,7],[33,1,33,3],[33,5,33,6],[34,1,34,6],[35,1,35,6],[36,1,36,6],[0,0,26,0],[0,1,0,3],[0,4,0,7],[22,1,22,3],[49,0,58,0],[49,1,49,3],[49,4,49,7],[50,2,50,5],[51,2,51,3],[52,1,52,7],[55,1,55,3],[55,5,55,6],[56,1,56,6],[57,1,57,6],[58,1,58,6],[27,1,27,3],[71,0,80,0],[71,1,71,3],[71,4,71,7],[72,2,72,5],[73,2,73,3],[74,1,74,7],[77,1,77,3],[77,5,77,6],[78,1,78,6],[79,1,79,6],[80,1,80,6]]}
[1,"CODEVASF",null,null," COMPOSIÇÃO DE PREÇO UNITÁRIO",null,null,null,{"$f":"H24","v":0},{"$f":"H26","v":0},"BDI CALCULADO:",null,{"$f":"ORÇAMENTO!L6","v":15}]
[null,"OBRA:  "," PAVIMENTAÇÃO ASFÁLTICA EM CBUQ - AV. MILITÃO JOSÉ DOS SANTOS E AV. VEREADOR JOSÉ PRATES (JANAÚBA / MG)",null,null,null,"DATA: ",{"$f":"ORÇAMENTO!C6","v":" ABRIL / 2025"},null,null,"BDI DIFERENCIADO:",null,{"$f":"'BDI FORN'!D31/100","v":0.15}]
[null,"SERVIÇO:  ","CPU.1",null,"Referência:","CODEVASF","UNIDADE: ",{"$f":"VLOOKUP(A1,ORÇAMENTO!A11:L31,5)","v":"MOBILIZAÇÃO E DESMOBILIZAÇÃO"}]
[]
[null,"TIPO ITEM","CODIGO ITEM","DESCRIÇÃO ITEM","UNIDADE ITEM","COEFICIENTE","PRECO UNITARIO","CUSTO TOTAL",null,"distancia =",90,"B.DESPACHO"]
[null,"EQUIPAMENTOS",{"$nulls":7},"Pá carregadeira ",null,null,10.1," ton"]
[null,null,"E9001","E9001","E9001",null,"E9001"]
[]
[]
[null,"MÃO DE OBRA"]
[]
[]
[]
[null,"MATERIAIS"]
[]
[]
[{"$nulls":7},{"$f":"ROUNDDOWN(F17*G17,2)","v":0},null,"Motoniveladora ",null,null,12.47," ton"]
[null,"ATIVIDADES AUXILIARES",{"$nulls":7},"Trator de pneus",null,null,2.8," ton"]
[{"$nulls":7},{"$f":"ROUNDDOWN(F19*G19,2)","v":0}]
[{"$nulls":7},0]
[{"$nulls":7},0]
[{"$nulls":7},{"$f":"ROUNDDOWN(F22*G22,2)","v":0},null,"Rolo Compactador ",null,null,15.33," ton"]
[null,"PRODUÇÃO DA EQUIPE",null,null,1,"CUSTO ",null,{"$f":"SUM(H6:H22)","v":0},null,"Grade de disco",null,null,1," ton"]
[null,"TOTAL",{"$nulls":5},{"$f":"H23/E23","v":0},"OK","RETROESCAVADEIRA",null,null,6.67," ton"]
[null,"BDI                %",{"$nulls":5},{"$f":"1+$M$1","v":16}]
[null,"TOTAL DO SERVIÇO - R$",{"$nulls":5},{"$f":"ROUND(H24*H25,2)","v":0}]
[]
["F1","CODEVASF",null,null," COMPOSIÇÃO DE PREÇO UNITÁRIO",null,null,null,{"$f":"H35","v":3532.13},{"$f":"H37","v":4061.95}]
[null,"OBRA:  "," PAVIMENTAÇÃO ASFÁLTICA EM CBUQ - AV. MILITÃO JOSÉ DOS SANTOS E AV. VEREADOR JOSÉ PRATES (JANAÚBA / MG)",null,null,null,"DATA: ",{"$f":"$H$2","v":" ABRIL / 2025"}]
[null,"SERVIÇO:  ","AQUISIÇÃO DE EMULSÃO ASFÁLTICA PARA IMPRIMAÇÃO (EAI) - EXCLUSIVE TRANSPORTE",null,"Referência:","CODEVASF","UNIDADE: ",{"$f":"VLOOKUP(A28,ORÇAMENTO!$A$11:$L$55,7)","v":"T"}]
[]
[null,"TIPO ITEM","CODIGO ITEM","DESCRIÇÃO ITEM","UNIDADE ITEM","COEFICIENTE","PRECO UNITARIO","CUSTO TOTAL"]
[null,"INSUMO","ANP","EMULSÃO ASFÁLTICA PARA SERVIÇO DE IMPRIMAÇÃO (MEMÓRIA EM ANEXO)","T",1,3532.1370595881235,{"$f":"ROUNDDOWN(F33*G33,2)","v":3532.13}]
[null,"PRODUÇÃO DA EQUIPE",null,null,1,"CUSTO ",null,{"$f":"SUM(H33:H33)","v":3532.13}]
[null,"TOTAL",{"$nulls":5},{"$f":"H34/E34","v":3532.13}]
[null,"BDI                %",{"$nulls":5},{"$f":"1+$M$2","v":1.1499999999999999}]
[null,"TOTAL DO SERVIÇO - R$",{"$nulls":5},{"$f":"ROUND(H35*H36,2)","v":4061.95},"OK"]
[]
["F2","CODEVASF",null,null," COMPOSIÇÃO DE PREÇO UNITÁRIO",null,null,null,{"$f":"H46","v":477},{"$f":"H48","v":548.54999999999995}]
[null,"OBRA:  "," PAVIMENTAÇÃO ASFÁLTICA EM CBUQ - AV. MILITÃO JOSÉ DOS SANTOS E AV. VEREADOR JOSÉ PRATES (JANAÚBA / MG)",null,null,null,"DATA: ",{"$f":"$H$2","v":" ABRIL / 2025"}]
[null,"SERVIÇO:  ","TRANSPORTE DE EMULSÃO ASFÁLTICA PARA IMPRIMAÇÃO (EAI)",null,"Referência:","CODEVASF","UNIDADE: ",{"$f":"VLOOKUP(A39,ORÇAMENTO!$A$11:$L$55,7)","v":"T"}]
[]
[null,"TIPO ITEM","CODIGO ITEM","DESCRIÇÃO ITEM","UNIDADE ITEM","COEFICIENTE","PRECO UNITARIO","CUSTO TOTAL"]
[null,"INSUMO"," - ","TRANSPORTE DE EMULSÃO ASFÁLTICA PARA IMPRIMAÇÃO (EAI), INCLUINDO CUSTO TOTAL DO TRANSPORTE (COMBUSTÍVEL, PEDÁGIOS, ETC.) E ICMS - MEMÓRIA ANEXA","T",1,477,{"$f":"ROUNDDOWN(F44*G44,2)","v":477}]
[null,"PRODUÇÃO DA EQUIPE",null,null,1,"CUSTO ",null,{"$f":"SUM(H44:H44)","v":477}]
[null,"TOTAL",{"$nulls":5},{"$f":"H45/E45","v":477}]
[null,"BDI                %",{"$nulls":5},{"$f":"1+$M$2","v":1.1499999999999999}]
[null,"TOTAL DO SERVIÇO - R$",{"$nulls":5},{"$f":"ROUND(H46*H47,2)","v":548.54999999999995},"OK"]
[]
["F3","CODEVASF",null,null," COMPOSIÇÃO DE PREÇO UNITÁRIO",null,null,null,{"$f":"H57","v":3480.79},{"$f":"H59","v":4002.91}]
[null,"OBRA:  "," PAVIMENTAÇÃO ASFÁLTICA EM CBUQ - AV. MILITÃO JOSÉ DOS SANTOS E AV. VEREADOR JOSÉ PRATES (JANAÚBA / MG)",null,null,null,"DATA: ",{"$f":"$H$2","v":" ABRIL / 2025"}]
[null,"SERVIÇO:  ","AQUISIÇÃO DE EMULSAO ASFALTICA CATIONICA RR-1C - EXCLUSIVE TRANSPORTE",null,"Referência:","CODEVASF","UNIDADE: ",{"$f":"VLOOKUP(A50,ORÇAMENTO!$A$11:$L$55,7)","v":"T"}]
[]
[null,"TIPO ITEM","CODIGO ITEM","DESCRIÇÃO ITEM","UNIDADE ITEM","COEFICIENTE","PRECO UNITARIO","CUSTO TOTAL"]
[null,"INSUMO","ANP","EMULSÃO ASFÁLTICA CATIÔNICA RR-1C(MEMÓRIA EM ANEXO)","T",1,3480.7926129148304,{"$f":"ROUNDDOWN(F55*G55,2)","v":3480.79}]
[null,"PRODUÇÃO DA EQUIPE",null,null,1,"CUSTO ",null,{"$f":"SUM(H55:H55)","v":3480.79}]
[null,"TOTAL",{"$nulls":5},{"$f":"H56/E56","v":3480.79},"OK"]
[null,"BDI                %",{"$nulls":5},{"$f":"1+$M$2","v":1.1499999999999999}]
[null,"TOTAL DO SERVIÇO - R$",{"$nulls":5},{"$f":"ROUND(H57*H58,2)","v":4002.91}]
[]
["F4","CODEVASF",null,null," COMPOSIÇÃO DE PREÇO UNITÁRIO",null,null,null,{"$f":"H68","v":494.16},{"$f":"H70","v":568.28}]
[null,"OBRA:  "," PAVIMENTAÇÃO ASFÁLTICA EM CBUQ - AV. MILITÃO JOSÉ DOS SANTOS E AV. VEREADOR JOSÉ PRATES (JANAÚBA / MG)",null,null,null,"DATA: ",{"$f":"$H$2","v":" ABRIL / 2025"}]
[null,"SERVIÇO:  ","TRANSPORTE DE EMULSÃO ASFÁLTICA CATIONICA RR-1C",null,"Referência:","CODEVASF","UNIDADE: ",{"$f":"VLOOKUP(A61,ORÇAMENTO!$A$11:$L$55,7)","v":"T"}]
[]
[null,"TIPO ITEM","CODIGO ITEM","DESCRIÇÃO ITEM","UNIDADE ITEM","COEFICIENTE","PRECO UNITARIO","CUSTO TOTAL"]
[null,"INSUMO"," - ","TRANSPORTE DE EMULSÃO ASFÁLTICA CATIONICA TIPO RR-1C, INCLUINDO CUSTO TOTAL DO TRANSPORTE (COMBUSTÍVEL, PEDÁGIOS, ETC.) E ICMS - MEMÓRIA ANEXA","T",1,494.16500000000002,{"$f":"ROUNDDOWN(F66*G66,2)","v":494.16}]
[null,"PRODUÇÃO DA EQUIPE",null,null,1,"CUSTO ",null,{"$f":"SUM(H66:H66)","v":494.16}]
[null,"TOTAL",{"$nulls":5},{"$f":"H67/E67","v":494.16},"OK"]
[null,"BDI                %",{"$nulls":5},{"$f":"1+$M$2","v":1.1499999999999999}]
[null,"TOTAL DO SERVIÇO - R$",{"$nulls":5},{"$f":"ROUND(H68*H69,2)","v":568.28}]
[]
["F5","CODEVASF",null,null," COMPOSIÇÃO DE PREÇO UNITÁRIO",null,null,null,{"$f":"H79","v":4815.2},{"$f":"H81","v":5537.48}]
[null,"OBRA:  "," PAVIMENTAÇÃO ASFÁLTICA EM CBUQ - AV. MILITÃO JOSÉ DOS SANTOS E AV. VEREADOR JOSÉ PRATES (JANAÚBA / MG)",null,null,null,"DATA: ",{"$f":"$H$2","v":" ABRIL / 2025"}]
[null,"SERVIÇO:  ","AQUISIÇÃO DE CONCRETO ASFÁLTICO DE PETRÓLEO - CAP 50/70 - EXCLUSIVE TRANSPORTE",null,"Referência:","CODEVASF","UNIDADE: ",{"$f":"VLOOKUP(A72,ORÇAMENTO!$A$11:$L$55,7)","v":"T"}]
[]
[null,"TIPO ITEM","CODIGO ITEM","DESCRIÇÃO ITEM","UNIDADE ITEM","COEFICIENTE","PRECO UNITARIO","CUSTO TOTAL"]
[null,"INSUMO",1518,"CIMENTOS ASFÁLTICO DE PETRÓLEO TIPO CAP 50/70 (MEMÓRIA EM ANEXO)","T",1,4815.2051307564443,{"$f":"ROUNDDOWN(F77*G77,2)","v":4815.2}]
[null,"PRODUÇÃO DA EQUIPE",null,null,1,"CUSTO ",null,{"$f":"SUM(H77:H77)","v":4815.2}]
[null,"TOTAL",{"$nulls":5},{"$f":"H78/E78","v":4815.2}]
[null,"BDI                %",{"$nulls":5},{"$f":"1+$M$2","v":1.1499999999999999}]
[null,"TOTAL DO SERVIÇO - R$",{"$nulls":5},{"$f":"ROUND(H79*H80,2)","v":5537.48}]
[]
["F6","CODEVASF",null,null," COMPOSIÇÃO DE PREÇO UNITÁRIO",null,null,null,{"$f":"H90","v":385.69},{"$f":"H92","v":443.54}]
[null,"OBRA:  "," PAVIMENTAÇÃO ASFÁLTICA EM CBUQ - AV. MILITÃO JOSÉ DOS SANTOS E AV. VEREADOR JOSÉ PRATES (JANAÚBA / MG)",null,null,null,"DATA: ",{"$f":"$H$2","v":" ABRIL / 2025"}]
[null,"SERVIÇO:  ","TRANSPORTE DE CONCRETO ASFÁLTICO DE PETRÓLEO - CAP 50/70",null,"Referência:","CODEVASF","UNIDADE: ",{"$f":"VLOOKUP(A83,ORÇAMENTO!$A$11:$L$55,7)","v":"T"}]
[]
[null,"TIPO ITEM","CODIGO ITEM","DESCRIÇÃO ITEM","UNIDADE ITEM","COEFICIENTE","PRECO UNITARIO","CUSTO TOTAL"]
[null,"INSUMO"," - ","TRANSPORTE DE CIMENTO ASFÁLTICO DE PETRÓLEO TIPO CAP 50-70, INCLUINDO CUSTO TOTAL DO TRANSPORTE (COMBUSTÍVEL, PEDÁGIOS, ETC.) E ICMS - MEMÓRIA ANEXA","T",1,385.69459016393444,{"$f":"ROUNDDOWN(F88*G88,2)","v":385.69}]
[null,"PRODUÇÃO DA EQUIPE",null,null,1,"CUSTO ",null,{"$f":"SUM(H88:H88)","v":385.69}]
[null,"TOTAL",{"$nulls":5},{"$f":"H89/E89","v":385.69}]
[null,"BDI                %",{"$nulls":5},{"$f":"1+$M$2","v":1.1499999999999999}]
[null,"TOTAL DO SERVIÇO - R$",{"$nulls":5},{"$f":"ROUND(H90*H91,2)","v":443.54}]

{"sheet":"BDI SERV","index":3,"n_rows":60,"n_cols":5,"rows_kept":60,"cut":false,"hidden":false,"merged":[[38,1,38,4],[39,2,39,3],[36,0,36,5],[0,1,2,4],[25,1,25,3],[26,1,26,2],[26,3,26,4],[27,3,27,4],[35,0,35,5]]}
[null,"DETALHAMENTO DO BDI - SERVIÇOS"]
[]
[]
[null,"Item","Descrição dos Serviços","% - PV","% - CD"]
[]
[null,1,"ADMINISTRAÇÃO CENTRAL"," ",{"$f":"SUM(E7:E9)","v":4.01}]
[null,"1.1","ESCRITÓRIO CENTRAL",null,4.01]
[null,"1.2","VIAGENS"]
[null,"1.3","OUTROS"]
[null," "," "," "," "]
[null,2,"IMPOSTOS E TAXAS",{"$f":"SUM(D12:D15)","v":6.15},{"$f":"SUM(E12:E15)","v":0}]
[null,"2.1","ISS - Proposta",{"$f":"D34*100","v":2.5}]
[null,"2.2","PIS",0.65]
[null,"2.3","Cofins",3]
[null,"2.4","Contribuição Previdenciaria (CPRB)"]
[]
[null,3,"TAXA DE RISCO",null,{"$f":"SUM(E18:E20)","v":0.96}]
[null,"3.1","SEGURO",null,0.2]
[null,"3.2","RISCO",null,0.56000000000000005]
[null,"3.3","GARANTIA",null,0.2]
[]
[null,4,"DESPESAS FINANCEIRAS",null,1.1100000000000001]
[]
[null,5,"LUCRO",null,8]
[]
[null,"BDI APRESENTADO:",null,null,{"$f":"IF($D$41=$C$43,$D$43,IF($D$41=$C$44,$D$44,IF($D$41=$C$44,$D$44,IF($D$41=$C$45,$D$45,0))))","v":22.14}]
[]
[null,null,"Legislação Municipal:","Lei nº 2.226/2017 - Anexo V"]
[null,null,"Município:","Janaúba"]
[null,null,"Alíquota ISSQN:",0.05,"Município"]
[null,null,"Base de Cálculo:",0.5,"art. 106, §15º "]
[null,null,"Valor Serviço:",3544947.4363325043]
[null,null,"Dedução - Material (estimado):",{"$f":"0.5*D32","v":1772473.7181662521},{"$f":"D33/D32","v":0.5}]
[null,null,"ISSQN BDI:",{"$f":"IF(D32=\"\",0,ROUND(IF(D31=D49,((1-(D33/D32))*D30),D30*D31),4))","v":2.5000000000000001E-2},"(*)"]
[]
["Acórdão nº 2.622/2013 - TCU Plenário"]
["BDI = ARRED((((((1+(AC+TR)/100)*(1+DF/100)*(1+L/100))/(1-IMP/100))-1)*100);2)"]
[]
[null,"(*) É obrigação da licitante a verificação da Legislação Tributária vigente no município, bem como o cálculo dos valores totais de serviços e materiais estimados, para apresentação de sua proposta."]
[]
[null,null,"Forma de Cálculo do BDI:","BDI - Acórdão nº 2.622/2013 - TCU"]
[]
[null,null,"BDI - Digitado",{"$f":"ROUND(E6+E11+E17+E22+E24,2)","v":14.08}]
[null,null,"BDI - Calculado",{"$f":"ROUND((((1+(E6/100+E22/100+E17/100))/(1-(D11/100+E24/100)))-1)*100,2)","v":23.56}]
[null,null,"BDI - Acórdão nº 2.622/2013 - TCU",{"$f":"ROUND((((((1+(E6+E17)/100)*(1+E22/100)*(1+E24/100))/(1-D11/100))-1)*100),2)","v":22.14}]
[]
[]
[]
[null,null,null,"Dedução - Material","Município"]
[null,null,null,0.1,"Simples Nacional"]
[null,null,null,0.2,"Municípios Indefinidos"]
[null,null,null,0.3]
[null,null,null,0.4]
[null,null,null,0.5]
[null,null,null,0.6]
[null,null,null,0.7]
[null,null,null,0.8]
[null,null,null,0.9]
[null,null,null,1]
[null,null,null,{"$f":"E31","v":"art. 106, §15º "}]

{"sheet":"BDI FORN","index":4,"n_rows":37,"n_cols":5,"rows_kept":37,"cut":false,"hidden":false,"merged":[[31,1,31,2],[32,0,34,5],[36,0,36,5],[0,1,2,4],[3,1,4,1],[3,2,4,2],[28,0,28,5],[30,1,30,2]]}
[null,"DETALHAMENTO DO BDI - FORNECIMENTO \n(MATERIAL ASFÁLTICO)"]
[]
[]
[null,"Item","Descrição dos Serviços","%","%"]
[null,null,null,"PV","CD"]
[]
[null,1,"ADMINISTRAÇÃO CENTRAL"," ",3.45]
[null,"1.1","ESCRITÓRIO CENTRAL"," "," "]
[null,"1.2","VIAGENS"," "," "]
[null,"1.3","OUTROS"," "," "]
[null," "," "," "," "]
[null,2,"IMPOSTOS E TAXAS",{"$f":"SUM(D13:D16)","v":3.65},{"$f":"SUM(E13:E16)","v":4.5600000000000005}]
[null,"2.1","ISS (*)",null,{"$f":"ROUND(D13*1.2515,2)","v":0}]
[null,"2.2","PIS",0.65,{"$f":"ROUND(D14*1.2515,2)","v":0.81}]
[null,"2.3","Cofins",3,{"$f":"ROUND(D15*1.2515,2)","v":3.75}]
[null,"2.4","CONTRIBUIÇÃO PREVIDENCIÁRIA SOBRE A RENDA BRUTA",0,{"$f":"ROUND(D16*1.2515,2)","v":0}]
[]
[null,3,"TAXA DE RISCO"," ",{"$f":"SUM(E19:E22)","v":1.08}]
[null,"3.1","SEGURO",null,0.24]
[null,"3.2","RISCO",null,0.6]
[null,"3.3","GARANTIA",null,0.24]
[]
[null,4,"DESPESAS FINANCEIRAS"," ",0.85]
[]
[null,5,"LUCRO",null,5.1100000000000003]
[]
[null," ","BDI - CALCULADO"," ",{"$f":"ROUND((((1+(E7+E18)/100)*(1+E23/100)*(1+E25/100)/(1-D12/100)-1)*100),2)","v":15}]
[]
["BDI = ((1+((AC+S+R+G)/100))x(1+DF/100)x(1+L/100)/(1-I/100)-1)*100"]
[]
[null,"BDI (CALCULADO):",null,{"$f":"ROUND((((1+((E7+E18)/100))*(1+E23/100)*(1+E25/100))/(1-D12/100)-1)*100,2)","v":15},"%"]
[null," "]
[]
[]
[]
[]
["BDI EM CONFORMIDADE COM OS ACÓRDÃOS Nº 2369/2011 e ACÓRDÃO Nº 2.622/2013 - TCU - PLENÁRIO"]

{"sheet":"CRONOGRAMA","index":5,"n_rows":19,"n_cols":14,"rows_kept":19,"cut":false,"hidden":false,"merged":[[0,1,0,13],[1,1,2,1],[1,2,2,4],[1,6,1,13],[2,6,2,13],[3,1,3,12],[5,0,6,0],[5,1,6,1],[5,2,6,2],[7,0,8,0],[7,1,8,1],[7,2,8,2],[9,0,10,0],[9,1,10,1],[9,2,10,2],[15,1,16,2],[18,1,22,13],[11,0,12,0],[11,1,12,1],[11,2,12,2],[13,0,14,0],[13,1,14,1],[13,2,14,2]]}
[null,"CRONOGRAMA FÍSICO-FINANCEIRO"]
[null,"OBRA: ",{"$f":"ORÇAMENTO!C5","v":" PAVIMENTAÇÃO ASFÁLTICA EM CBUQ - AV. MILITÃO JOSÉ DOS SANTOS E AV. VEREADOR JOSÉ PRATES (JANAÚBA / MG)"},null,null,"VALOR:",{"$f":"ORÇAMENTO!L48","v":5698790.6100000003}]
[{"$nulls":5},"PRAZO: ","240 DIAS "]
[]
[null,"ITEM","ETAPAS/DESCRIÇAO","FISICO/  FINANCEIRO","TOTAL    ETAPAS","MÊS 1","MÊS 2","MÊS 3","MÊS 4","MÊS 5","MÊS 6","MÊS 7","MÊS 8","TOTAL"]
["A",{"$f":"VLOOKUP(A6,ORÇAMENTO!$A$10:$L$48,2)","v":1},{"$f":"VLOOKUP(A6,ORÇAMENTO!$A$10:$L$48,5)","v":"SERVIÇOS PRELIMINARES "},"FISICO ",{"$f":"ROUND(E7/$G$2,4)","v":6.2300000000000001E-2},0.2,0.1,0.1,0.1,0.1,0.1,0.1,0.2,{"$f":"SUM(F6:M6)","v":1}]
[null,null,null,"FINANCEIRO",{"$f":"ORÇAMENTO!L10","v":354870.19999999995},{"$f":"ROUND($E$7*F6,2)","v":70974.039999999994},{"$f":"ROUND($E$7*G6,2)","v":35487.019999999997},{"$f":"ROUND($E$7*H6,2)","v":35487.019999999997},{"$f":"ROUND($E$7*I6,2)","v":35487.019999999997},35487.019999999997,35487.019999999997,35487.019999999997,70974.039999999994,{"$f":"SUM(F7:M7)","v":354870.19999999995}]
["B",{"$f":"VLOOKUP(A8,ORÇAMENTO!$A$10:$L$48,2)","v":2},{"$f":"VLOOKUP(A8,ORÇAMENTO!$A$10:$L$48,5)","v":"TERRAPLANAGEM E PAVIMENTAÇÃO"},"FISICO ",{"$f":"ROUND(E9/$G$2,4)","v":0.35049999999999998},0.1,0.2,0.2,0.2,0.2,0.1,null,null,{"$f":"SUM(F8:M8)","v":0.99999999999999989}]
[null,null,null,"FINANCEIRO",{"$f":"ORÇAMENTO!L16","v":1997462},{"$f":"ROUND($E$9*F8,2)","v":199746.2},{"$f":"ROUND($E$9*G8,2)","v":399492.4},{"$f":"ROUND($E$9*H8,2)","v":399492.4},{"$f":"ROUND($E$9*I8,2)","v":399492.4},399492.4,199746.2,0,0,{"$f":"SUM(F9:M9)","v":1997462.0000000002}]
["C",{"$f":"VLOOKUP(A10,ORÇAMENTO!$A$10:$L$48,2)","v":3},{"$f":"VLOOKUP(A10,ORÇAMENTO!$A$10:$L$48,5)","v":"TRANSPORTE DE MATERIAIS"},"FISICO ",{"$f":"ROUND(E11/$G$2,4)","v":0.1153},0.25,0.5,0.25,{"$nulls":5},{"$f":"SUM(F10:M10)","v":1}]
[null,null,null,"FINANCEIRO",{"$f":"ORÇAMENTO!L25","v":656816},{"$f":"ROUND($E$11*F10,2)","v":164204},{"$f":"ROUND($E$11*G10,2)","v":328408},{"$f":"ROUND($E$11*H10,2)","v":164204},{"$f":"ROUND($E$11*I10,2)","v":0},0,0,0,0,{"$f":"SUM(F11:M11)-0.04","v":656815.96}]
["E",{"$f":"VLOOKUP(A12,ORÇAMENTO!$A$10:$L$48,2)","v":4},{"$f":"VLOOKUP(A12,ORÇAMENTO!$A$10:$L$48,5)","v":"DRENAGEM E OBRAS COMPLEMENTARES"},"FISICO ",{"$f":"ROUND(E13/$G$2,4)","v":0.23069999999999999},0.2,0.2,0.1,0.1,0.1,0.1,0.1,0.1,{"$f":"SUM(F12:M12)","v":0.99999999999999989}]
[null,null,null,"FINANCEIRO",{"$f":"ORÇAMENTO!L30","v":1314504.82},{"$f":"ROUND($E$13*F12,2)","v":262900.96000000002},{"$f":"ROUND($E$13*G12,2)","v":262900.96000000002},{"$f":"ROUND($E$13*H12,2)","v":131450.48000000001},{"$f":"ROUND($E$13*I12,2)","v":131450.48000000001},131450.48000000001,131450.48000000001,131450.48000000001,131450.48000000001,{"$f":"SUM(F13:M13)-0.02","v":1314504.78}]
["F",{"$f":"VLOOKUP(A14,ORÇAMENTO!$A$10:$L$48,2)","v":5},{"$f":"VLOOKUP(A14,ORÇAMENTO!$A$10:$L$48,5)","v":"FORNECIMENTOS - MATERIAL ASFÁLTICO (BDI DIFERENCIADO)"},"FISICO ",{"$f":"ROUND(E15/$G$2,4)","v":0.24129999999999999},null,0.2,0.2,0.2,0.2,0.2,null,null,{"$f":"SUM(F14:M14)","v":1}]
[null,null,null,"FINANCEIRO",{"$f":"ORÇAMENTO!L41","v":1375137.59},{"$f":"ROUND($E$15*F14,2)","v":0},275027.52,275027.52,275027.52,275027.52,275027.52,0,0,{"$f":"SUM(F15:M15)-0.02","v":1375137.58}]
[null,"TOTAL",null,"FISICO ",{"$f":"SUM(F16:M16)","v":0.99999999824524177},{"$f":"F17/$E$17","v":0.12245145466048277},{"$f":"G17/$E$17","v":0.22834948483920522},{"$f":"H17/$E$17","v":0.17646927020538486},{"$f":"I17/$E$17","v":0.14765543737007034},0.14765543737007034,0.11260480756635484,2.9293496010726387E-2,3.5520610222946933E-2,{"$f":"SUM(F16:M16)","v":0.99999999824524177}]
[null,null,null,"FINANCEIRO",{"$f":"E11+E9+E7+E15+E13","v":5698790.6100000003},{"$f":"F11+F9+F7+F15+F13","v":697825.2},1301315.9000000001,1005661.42,841457.42,841457.42,641711.22,166937.5,202424.52000000002,{"$f":"SUM(F17:M17)+0.01","v":5698790.6099999994}]
[]
[null,"OBSERVAÇÕES:"]