{"text_format":"2","workbook":"xlsx","n_sheets":6,"sheets":["ORÇAMENTO","CPU-SERV","CPU-FORNEC","BDI SERV","BDI FORN","CRONOGRAMA"],"not_rendered":{"charts":0,"images":4,"macros":0,"external_links":0,"defined_names":7,"comments":2,"pivot_tables":0},"unopened":[],"bounds":{"document_bytes":16777216,"sheet_cells":100000,"run_cost":"one","rows_first":2000,"rows_last":500,"rows_between":2000,"halvings":0,"cell_chars":16384,"cell_head_chars":4096},"cells_cut":0,"cells_raw":0,"read":"whole","date_system":"1900"}

{"sheet":"ORÇAMENTO","index":0,"n_rows":48,"n_cols":12,"rows_kept":48,"cut":false,"hidden":false,"merged":[[5,8,5,10],[6,8,6,10],[9,16,9,18],[47,1,47,4],[0,0,8,0],[0,4,0,11],[1,4,1,11],[2,4,2,11],[6,1,6,4],[9,14,9,15],[7,1,7,11],[4,2,4,7],[5,2,5,7],[4,8,4,10]]}
["<---- NUMERAR SERVIÇOS PARA CPU",null,null,null,"Ministério do Desenvolvimento Regional"]
[{"$nulls":4},"Companhia de Desenvolvimento dos Vales do São Francisco e do Parnaíba"]
[{"$nulls":4},"1ª Superintendência Regional"]
[]
[null,"OBRA: "," PAVIMENTAÇÃO ASFÁLTICA EM CBUQ - AV. MILITÃO JOSÉ DOS SANTOS E AV. VEREADOR JOSÉ PRATES (JANAÚBA / MG)",{"$nulls":5},"BDI Serviços (%):",null,null,{"$f":"'BDI SERV'!E26","v":22.14}]
[null,"DATA:"," ABRIL / 2025",{"$nulls":5},"BDI Diferenciado Serviços (%):",null,null,{"$f":"'BDI FORN'!D31","v":15}]
[null,"PRAZO DE EXECUÇÃO:     240 DIAS",{"$nulls":6},"BDI Fornecimentos (%):",null,null,{"$f":"L6","v":15}]
[null,"PLANILHA DE ORÇAMENTAÇÃO"]
[null,"ITEM","CÓDIGO","FONTE","DISCRIMINAÇÃO","TIPO","UNID.","QUANT.","VR.UNIT.S/BDI","PR. UNIT.C/BDI","C. TOT.S/BDI","P. TOT.C/BDI"]
["A",1,null,null,"SERVIÇOS PRELIMINARES ",{"$nulls":5},{"$f":"SUM(K11:K15)","v":290905.13000000006},{"$f":"SUM(L11:L15)","v":354870.19999999995}]
[1,"1.1","CPU.1","CODEVASF","MOBILIZAÇÃO E DESMOBILIZAÇÃO","SERV","GL",1,{"$f":"VLOOKUP(A11,'CPU-SERV'!A:K,11,0)","v":13613.23},{"$f":"TRUNC(_xlfn.IFS(F11=\"SERV\",I11*(1+$L$5/100),F11=\"SERV DIF\",I11*(1+$L$6/100),F11=\"FORN\",I11*(1+$L$7/100)),2)","v":16627.189999999999},{"$f":"TRUNC(H11*I11,2)","v":13613.23},{"$f":"TRUNC(H11*J11,2)","v":16627.189999999999}]
[2,"1.2","CPU.2","CODEVASF","ADMINISTRAÇÃO LOCAL ","SERV","GL",1,{"$f":"VLOOKUP(A12,'CPU-SERV'!A:K,11,0)","v":230359.32},{"$f":"TRUNC(_xlfn.IFS(F12=\"SERV\",I12*(1+$L$5/100),F12=\"SERV DIF\",I12*(1+$L$6/100),F12=\"FORN\",I12*(1+$L$7/100)),2)","v":281360.87},{"$f":"TRUNC(H12*I12,2)","v":230359.32},{"$f":"TRUNC(H12*J12,2)","v":281360.87}]
[3,"1.3","CPU.3","CODEVASF","CANTEIRO DE OBRAS ","SERV","GL",1,{"$f":"VLOOKUP(A13,'CPU-SERV'!A:K,11,0)","v":18289.8},{"$f":"TRUNC(_xlfn.IFS(F13=\"SERV\",I13*(1+$L$5/100),F13=\"SERV DIF\",I13*(1+$L$6/100),F13=\"FORN\",I13*(1+$L$7/100)),2)","v":22339.16},18289.8,22339.16]
[4,"1.4",103689,"SINAPI","PLACA DE OBRA EM CHAPA DE AÇO GALVANIZADO","SERV","M2",9,{"$f":"VLOOKUP(A14,'CPU-SERV'!A:K,11,0)","v":351.42},{"$f":"TRUNC(_xlfn.IFS(F14=\"SERV\",I14*(1+$L$5/100),F14=\"SERV DIF\",I14*(1+$L$6/100),F14=\"FORN\",I14*(1+$L$7/100)),2)","v":429.22},3162.78,3862.98]
[6,"1.5",78472,"SINAPI","SERVIÇOS TOPOGRÁFICOS PARA PAVIMENTAÇÃO, INCLUSIVE LEVANTAMENTO PLANIALTIMÉTRICO CADASTRAL, GERAÇÃO DE NOTAS DE SERVIÇO, SEÇÕES TRANSVERSAIS E GREIDE, ESTAQUEAMENTO E ACOMPANHAMENTO EXECUTIVO","SERV","M2",52000,{"$f":"VLOOKUP(A15,'CPU-SERV'!A:K,11,0)","v":0.49},{"$f":"TRUNC(_xlfn.IFS(F15=\"SERV\",I15*(1+$L$5/100),F15=\"SERV DIF\",I15*(1+$L$6/100),F15=\"FORN\",I15*(1+$L$7/100)),2)","v":0.59},25480,30680]
{"$rows_left_out":34}
{"sheet":"CPU-SERV","index":1,"n_rows":1228,"n_cols":11,"rows_kept":1228,"cut":false,"hidden":false,"merged":[[1211,3,1211,7],[1213,8,1213,9],[1218,3,1218,7],[1219,1,1220,2],[1219,3,1220,3],[1219,4,1220,4],[1219,5,1219,7],[1219,9,1220,9],[1196,3,1196,7],[1197,3,1197,7],[1198,3,1198,7],[1201,7,1201,9],[1207,3,1207,7],[1208,7,1208,9],[1187,8,1187,9],[1188,1,1189,2],[1188,3,1189,3],[1188,4,1188,5],[1188,6,1188,7],[1193,7,1193,9],[1179,3,1179,7],[1180,5,1180,7],[1183,0,1227,0],[1184,2,1184,9],[1185,1,1186,3],[1185,4,1185,5],[1186,4,1186,5],[1187,2,1187,7],[1225,3,1225,7],[1226,5,1226,7],[1142,0,1181,0],[1143,2,1143,9],[1144,1,1145,3],[1144,4,1144,5],[1145,4,1145,5],[1146,2,1146,7],[1132,3,1133,3],[1132,4,1133,4],[1132,5,1132,7],[1132,9,1133,9],[1169,3,1169,7],[1171,8,1171,9],[1174,3,1174,7],[1175,1,1176,2],[1175,3,1176,3],[1175,4,1176,4],[1175,5,1175,7],[1175,9,1176,9],[1156,3,1156,7],[1157,3,1157,7],[1158,3,1158,7],[1161,7,1161,9],[1165,3,1165,7],[1166,7,1166,9],[1146,8,1146,9],[1147,1,1148,2],[1147,3,1148,3],[1147,4,1147,5],[1147,6,1147,7],[1153,7,1153,9],[1109,3,1109,7],[1110,3,1110,7],[1111,3,1111,7],[1114,7,1114,9],[1120,3,1120,7],[1121,7,1121,9],[1100,8,1100,9],[1101,1,1102,2],[1101,3,1102,3],[1101,4,1101,5],[1101,6,1101,7],[1106,7,1106,9],[1092,3,1092,7],[1093,5,1093,7],[1096,0,1140,0],[1097,2,1097,9],[1098,1,1099,3],[1098,4,1098,5],[1099,4,1099,5],[1100,2,1100,7],[1138,3,1138,7],[1139,5,1139,7],[1057,0,1094,0],[1058,2,1058,9],[1059,1,1060,3],[1059,4,1059,5],[1060,4,1060,5],[1061,2,1061,7],[1124,3,1124,7],[1126,8,1126,9],[1131,3,1131,7],[1132,1,1133,2],[1049,3,1050,3],[1049,4,1050,4],[1049,5,1049,7],[1049,9,1050,9],[1082,3,1082,7],[1084,8,1084,9],[1087,3,1087,7],[1088,1,1089,2],[1088,3,1089,3],[1088,4,1089,4],[1088,5,1088,7],[1088,9,1089,9],[1070,3,1070,7],[1071,3,1071,7],[1072,3,1072,7],[1075,7,1075,9],[1078,3,1078,7],[1079,7,1079,9],[1061,8,1061,9],[1062,1,1063,2],[1062,3,1063,3],[1062,4,1062,5],[1062,6,1062,7],[1067,7,1067,9],[1031,3,1031,7],[1032,3,1032,7],[1033,3,1033,7],[1036,7,1036,9],[1039,3,1039,7],[1040,7,1040,9],[1022,8,1022,9],[1023,1,1024,2],[1023,3,1024,3],[1023,4,1023,5],[1023,6,1023,7],[1028,7,1028,9],[1014,3,1014,7],[1015,5,1015,7],[1018,0,1055,0],[1019,2,1019,9],[1020,1,1021,3],[1020,4,1020,5],[1021,4,1021,5],[1022,2,1022,7],[1053,3,1053,7],[1054,5,1054,7],[978,0,1016,0],[979,2,979,9],[980,1,981,3],[980,4,980,5],[981,4,981,5],[982,2,982,7],[1043,3,1043,7],[1045,8,1045,9],[1048,3,1048,7],[1049,1,1050,2],[970,3,971,3],[970,4,971,4],[970,5,970,7],[970,9,971,9],[1004,3,1004,7],[1006,8,1006,9],[1009,3,1009,7],[1010,1,1011,2],[1010,3,1011,3],[1010,4,1011,4],[1010,5,1010,7],[1010,9,1011,9],[991,3,991,7],[992,3,992,7],[993,3,993,7],[996,7,996,9],[999,3,999,7],[1000,7,1000,9],[982,8,982,9],[983,1,984,2],[983,3,984,3],[983,4,983,5],[983,6,983,7],[988,7,988,9],[952,3,952,7],[953,3,953,7],[954,3,954,7],[957,7,957,9],[960,3,960,7],[961,7,961,9],[943,8,943,9],[944,1,945,2],[944,3,945,3],[944,4,944,5],[944,6,944,7],[949,7,949,9],[935,3,935,7],[936,5,936,7],[939,0,976,0],[940,2,940,9],[941,1,942,3],[941,4,941,5],[942,4,942,5],[943,2,943,7],[974,3,974,7],[975,5,975,7],[900,0,937,0],[901,2,901,9],[902,1,903,3],[902,4,902,5],[903,4,903,5],[904,2,904,7],[964,3,964,7],[966,8,966,9],[969,3,969,7],[970,1,971,2],[925,3,925,7],[927,8,927,9],[930,3,930,7],[931,1,932,2],[931,3,932,3],[931,4,932,4],[931,5,931,7],[931,9,932,9],[913,3,913,7],[914,3,914,7],[915,3,915,7],[918,7,918,9],[921,3,921,7],[922,7,922,9],[904,8,904,9],[905,1,906,2],[905,3,906,3],[905,4,905,5],[905,6,905,7],[910,7,910,9],[871,3,871,7],[872,3,872,7],[873,3,873,7],[876,7,876,9],[882,3,882,7],[883,7,883,9],[861,8,861,9],[862,1,863,2],[862,3,863,3],[862,4,862,5],[862,6,862,7],[867,7,867,9],[857,0,898,0],[858,2,858,9],[859,1,860,3],[859,4,859,5],[860,4,860,5],[861,2,861,7],[896,3,896,7],[897,5,897,7],[886,3,886,7],[888,8,888,9],[891,3,891,7],[892,1,893,2],[892,3,893,3],[892,4,893,4],[892,5,892,7],[892,9,893,9],[853,3,853,7],[854,5,854,7],[816,0,855,0],[817,2,817,9],[818,1,819,3],[818,4,818,5],[819,4,819,5],[820,2,820,7],[808,3,809,3],[808,4,809,4],[808,5,808,7],[808,9,809,9],[843,3,843,7],[845,8,845,9],[848,3,848,7],[849,1,850,2],[849,3,850,3],[849,4,850,4],[849,5,849,7],[849,9,850,9],[830,3,830,7],[831,3,831,7],[832,3,832,7],[835,7,835,9],[839,3,839,7],[840,7,840,9],[820,8,820,9],[821,1,822,2],[821,3,822,3],[821,4,821,5],[821,6,821,7],[827,7,827,9],[788,3,788,7],[789,3,789,7],[790,3,790,7],[793,7,793,9],[798,3,798,7],[799,7,799,9],[779,8,779,9],[780,1,781,2],[780,3,781,3],[780,4,780,5],[780,6,780,7],[785,7,785,9],[771,3,771,7],[772,5,772,7],[775,0,814,0],[776,2,776,9],[777,1,778,3],[777,4,777,5],[778,4,778,5],[779,2,779,7],[812,3,812,7],[813,5,813,7],[736,0,773,0],[737,2,737,9],[738,1,739,3],[738,4,738,5],[739,4,739,5],[740,2,740,7],[802,3,802,7],[804,8,804,9],[807,3,807,7],[808,1,809,2],[728,3,729,3],[728,4,729,4],[728,5,728,7],[728,9,729,9],[761,3,761,7],[763,8,763,9],[766,3,766,7],[767,1,768,2],[767,3,768,3],[767,4,768,4],[767,5,767,7],[767,9,768,9],[749,3,749,7],[750,3,750,7],[751,3,751,7],[754,7,754,9],[757,3,757,7],[758,7,758,9],[740,8,740,9],[741,1,742,2],[741,3,742,3],[741,4,741,5],[741,6,741,7],[746,7,746,9],[710,3,710,7],[711,3,711,7],[712,3,712,7],[715,7,715,9],[718,3,718,7],[719,7,719,9],[701,8,701,9],[702,1,703,2],[702,3,703,3],[702,4,702,5],[702,6,702,7],[707,7,707,9],[693,3,693,7],[694,5,694,7],[697,0,734,0],[698,2,698,9],[699,1,700,3],[699,4,699,5],[700,4,700,5],[701,2,701,7],[732,3,732,7],[733,5,733,7],[658,0,695,0],[659,2,659,9],[660,1,661,3],[660,4,660,5],[661,4,661,5],[662,2,662,7],[722,3,722,7],[724,8,724,9],[727,3,727,7],[728,1,729,2],[683,3,683,7],[685,8,685,9],[688,3,688,7],[689,1,690,2],[689,3,690,3],[689,4,690,4],[689,5,689,7],[689,9,690,9],[671,3,671,7],[672,3,672,7],[673,3,673,7],[676,7,676,9],[679,3,679,7],[680,7,680,9],[662,8,662,9],[663,1,664,2],[663,3,664,3],[663,4,663,5],[663,6,663,7],[668,7,668,9],[641,7,641,9],[623,8,623,9],[624,1,625,2],[624,3,625,3],[624,4,624,5],[624,6,624,7],[629,7,629,9],[615,3,615,7],[616,5,616,7],[619,0,656,0],[620,2,620,9],[621,1,622,3],[621,4,621,5],[622,4,622,5],[623,2,623,7],[654,3,654,7],[655,5,655,7],[580,0,617,0],[581,2,581,9],[582,1,583,3],[582,4,582,5],[583,4,583,5],[644,3,644,7],[646,8,646,9],[649,3,649,7],[650,1,651,2],[650,3,651,3],[650,4,651,4],[650,5,650,7],[650,9,651,9],[594,3,594,7],[595,3,595,7],[598,7,598,9],[601,3,601,7],[602,7,602,9],[584,8,584,9],[585,1,586,2],[585,3,586,3],[585,4,585,5],[585,6,585,7],[590,7,590,9],[632,3,632,7],[633,3,633,7],[634,3,634,7],[637,7,637,9],[640,3,640,7],[584,2,584,7],[514,8,514,9],[517,3,517,7],[518,1,519,2],[518,3,519,3],[518,4,519,4],[518,5,518,7],[518,9,519,9],[568,1,569,2],[568,3,569,3],[568,4,569,4],[568,5,568,7],[568,9,569,9],[576,3,576,7],[558,3,558,7],[560,8,560,9],[567,3,567,7],[593,3,593,7],[551,7,551,8],[577,5,577,7],[605,3,605,7],[607,8,607,9],[610,3,610,7],[611,1,612,2],[611,3,612,3],[611,4,612,4],[611,5,611,7],[611,9,612,9],[452,6,452,7],[457,7,457,9],[500,3,500,7],[501,3,501,7],[502,3,502,7],[505,7,505,9],[508,3,508,7],[509,7,509,9],[490,8,490,9],[491,1,492,2],[491,3,492,3],[491,4,491,5],[491,6,491,7],[497,7,497,9],[482,3,482,7],[483,5,483,7],[461,3,461,7],[462,3,462,7],[465,7,465,9],[468,3,468,7],[469,7,469,9],[556,7,556,9],[512,3,512,7],[486,0,524,0],[487,2,487,9],[488,1,489,3],[488,4,488,5],[489,4,489,5],[490,2,490,7],[522,3,522,7],[523,5,523,7],[466,7,466,8],[447,0,484,0],[448,2,448,9],[449,1,450,3],[449,4,449,5],[450,4,450,5],[451,2,451,7],[433,3,433,7],[435,8,435,9],[438,3,438,7],[439,1,440,2],[439,3,440,3],[439,4,440,4],[439,5,439,7],[439,9,440,9],[472,3,472,7],[474,8,474,9],[477,3,477,7],[478,1,479,2],[478,3,479,3],[478,4,479,4],[478,5,478,7],[478,9,479,9],[460,3,460,7],[451,8,451,9],[452,1,453,2],[452,3,453,3],[452,4,452,5],[372,6,372,7],[379,7,379,9],[421,3,421,7],[422,3,422,7],[423,3,423,7],[426,7,426,9],[429,3,429,7],[430,7,430,9],[412,8,412,9],[413,1,414,2],[413,3,414,3],[413,4,413,5],[413,6,413,7],[418,7,418,9],[404,3,404,7],[405,5,405,7],[383,3,383,7],[384,3,384,7],[387,7,387,9],[390,3,390,7],[391,7,391,9],[408,0,445,0],[409,2,409,9],[410,1,411,3],[410,4,410,5],[411,4,411,5],[412,2,412,7],[443,3,443,7],[444,5,444,7],[427,7,427,8],[367,0,406,0],[368,2,368,9],[369,1,370,3],[369,4,369,5],[370,4,370,5],[371,2,371,7],[353,3,353,7],[355,8,355,9],[358,3,358,7],[359,1,360,2],[359,3,360,3],[359,4,360,4],[359,5,359,7],[359,9,360,9],[394,3,394,7],[396,8,396,9],[399,3,399,7],[400,1,401,2],[400,3,401,3],[400,4,401,4],[400,5,400,7],[400,9,401,9],[382,3,382,7],[371,8,371,9],[372,1,373,2],[372,3,373,3],[372,4,372,5],[287,6,287,7],[295,7,295,9],[341,3,341,7],[342,3,342,7],[343,3,343,7],[346,7,346,9],[349,3,349,7],[350,7,350,9],[328,8,328,9],[329,1,330,2],[329,3,330,3],[329,4,329,5],[329,6,329,7],[338,7,338,9],[320,3,320,7],[321,5,321,7],[300,3,300,7],[303,7,303,9],[306,3,306,7],[307,7,307,9],[324,0,365,0],[325,2,325,9],[326,1,327,3],[326,4,326,5],[327,4,327,5],[328,2,328,7],[363,3,363,7],[364,5,364,7],[282,0,322,0],[283,2,283,9],[284,1,285,3],[284,4,284,5],[285,4,285,5],[286,2,286,7],[268,3,268,7],[270,8,270,9],[273,3,273,7],[274,1,275,2],[274,3,275,3],[274,4,275,4],[274,5,274,7],[274,9,275,9],[310,3,310,7],[312,8,312,9],[315,3,315,7],[316,1,317,2],[316,3,317,3],[316,4,317,4],[316,5,316,7],[316,9,317,9],[298,3,298,7],[299,3,299,7],[286,8,286,9],[287,1,288,2],[287,3,288,3],[287,4,287,5],[209,6,209,7],[214,7,214,9],[256,3,256,7],[257,3,257,7],[258,3,258,7],[261,7,261,9],[264,3,264,7],[265,7,265,9],[247,8,247,9],[248,1,249,2],[248,3,249,3],[248,4,248,5],[248,6,248,7],[253,7,253,9],[239,3,239,7],[240,5,240,7],[219,3,219,7],[222,7,222,9],[225,3,225,7],[226,7,226,9],[243,0,280,0],[244,2,244,9],[245,1,246,3],[245,4,245,5],[246,4,246,5],[247,2,247,7],[278,3,278,7],[279,5,279,7],[204,0,241,0],[205,2,205,9],[206,1,207,3],[206,4,206,5],[207,4,207,5],[208,2,208,7],[190,3,190,7],[192,8,192,9],[195,3,195,7],[196,1,197,2],[196,3,197,3],[196,4,197,4],[196,5,196,7],[196,9,197,9],[229,3,229,7],[231,8,231,9],[234,3,234,7],[235,1,236,2],[235,3,236,3],[235,4,236,4],[235,5,235,7],[235,9,236,9],[217,3,217,7],[218,3,218,7],[208,8,208,9],[209,1,210,2],[209,3,210,3],[209,4,209,5],[178,3,178,7],[179,3,179,7],[180,3,180,7],[183,7,183,9],[186,3,186,7],[187,7,187,9],[167,8,167,9],[168,1,169,2],[168,3,169,3],[168,4,168,5],[168,6,168,7],[173,7,173,9],[163,0,202,0],[164,2,164,9],[165,1,166,3],[165,4,165,5],[166,4,166,5],[167,2,167,7],[200,3,200,7],[201,5,201,7],[151,8,151,9],[154,3,154,7],[155,1,156,2],[155,3,156,3],[155,4,156,4],[155,5,155,7],[155,9,156,9],[136,3,136,7],[137,3,137,7],[140,7,140,9],[145,3,145,7],[146,7,146,9],[149,3,149,7],[127,1,128,2],[127,3,128,3],[127,4,127,5],[127,6,127,7],[132,7,132,9],[135,3,135,7],[119,5,119,7],[122,0,161,0],[123,2,123,9],[124,1,125,3],[124,4,124,5],[125,4,125,5],[126,2,126,7],[126,8,126,9],[159,3,159,7],[160,5,160,7],[114,1,115,2],[114,3,115,3],[114,4,115,4],[114,5,114,7],[114,9,115,9],[118,3,118,7],[93,7,93,9],[98,3,98,7],[101,7,101,9],[104,3,104,7],[105,7,105,9],[108,3,108,7],[83,0,120,0],[84,2,84,9],[85,1,86,3],[86,4,86,5],[87,2,87,7],[87,8,87,9],[88,1,89,2],[110,8,110,9],[113,3,113,7],[96,3,96,7],[97,3,97,7],[88,3,89,3],[88,4,88,5],[88,6,88,7],[79,3,79,7],[80,5,80,7],[85,4,85,5],[74,3,74,7],[75,1,76,2],[75,3,76,3],[75,4,76,4],[75,5,75,7],[75,9,76,9],[57,3,57,7],[60,7,60,9],[63,3,63,7],[64,7,64,9],[69,3,69,7],[71,8,71,9],[44,3,45,3],[44,4,44,5],[44,6,44,7],[49,7,49,9],[55,3,55,7],[56,3,56,7],[41,1,42,3],[41,4,41,5],[42,4,42,5],[43,2,43,7],[43,8,43,9],[44,1,45,2],[0,0,37,0],[3,4,3,5],[2,4,2,5],[1,2,1,9],[2,1,3,3],[31,3,32,3],[31,4,32,4],[31,5,31,7],[31,9,32,9],[35,3,35,7],[36,5,36,7],[10,7,10,9],[13,3,13,7],[14,3,14,7],[15,3,15,7],[18,7,18,9],[30,3,30,7],[31,1,32,2],[22,7,22,9],[25,3,25,7],[27,8,27,9],[21,3,21,7],[4,2,4,7],[4,8,4,9],[5,1,6,2],[5,3,6,3],[5,4,5,5],[5,6,5,7],[526,0,578,0],[527,2,527,9],[528,1,529,3],[528,4,528,5],[529,4,529,5],[530,2,530,7],[530,8,530,9],[531,1,532,2],[531,3,532,3],[531,4,531,5],[531,6,531,7],[539,7,539,9],[541,3,541,7],[542,3,542,7],[543,3,543,7],[546,7,546,9],[555,3,555,7],[39,0,81,0],[40,2,40,9]]}
[1,"1ª/GRD",{"$nulls":8},{"$f":"J37","v":13613.23}]
[null,"OBRA:"," PAVIMENTAÇÃO ASFÁLTICA EM CBUQ - AV. MILITÃO JOSÉ DOS SANTOS E AV. VEREADOR JOSÉ PRATES (JANAÚBA / MG)"]
[null,"Custo Unitário de Referência",null,null,"Minas Gerais"]
[{"$nulls":4}," Janeiro/2025 ",null,null,"Produção da equipe ",0.5,{"$f":"VLOOKUP(A1,ORÇAMENTO!$A$10:$L$48,7,1)","v":"GL"}]
[null,"CPU.1","MOBILIZAÇÃO E DESMOBILIZAÇÃO",{"$nulls":5},"Valores em reais (R$)"]
[null,"A - EQUIPAMENTOS",null,"Quantidade","Utilização",null,"Custo Horário",null,null,"Custo"]
[{"$nulls":4},"Operativa","Improdutiva","Produtivo","Improdutivo",null,"Horário Total"]
[null,"E9687","Caminhão carroceria com capacidade de 5 t - 115 kW",8,0.5,0.5,146.88079999999999,57.423099999999998,null,{"$f":"D8*(E8*G8+F8*H8)","v":817.21559999999999}]
[null,"E9575","Caminhão basculante com caçamba estanque com capacidade de 14 m³ - 210 kW",12,1,0,309.83940000000001,90.412199999999999,null,{"$f":"D9*(E9*G9+F9*H9)","v":3718.0727999999999}]
[{"$nulls":7},"Custo horário total de equipamentos",null,{"$f":"SUM(J8:J9)","v":4535.2883999999995}]
[null,"B - MÃO DE OBRA",null,"Quantidade","Unidade",null,"Custo Horário","Custo Horário Total"]
[null,"P9824","Servente",16,"h",null,21.3355,null,null,{"$f":"D12*G12","v":341.36799999999999}]
[{"$nulls":9},{"$f":"D13*G13","v":0}]
[null,null,null,"Custo horário total de mão de obra",{"$nulls":5},{"$f":"SUM(J12:J13)","v":341.36799999999999}]
[null,null,null,"Custo horário total de execução",{"$nulls":5},{"$f":"J10+J14","v":4876.6563999999998}]
{"$rows_left_out":1214}
{"sheet":"CPU-FORNEC","index":2,"n_rows":92,"n_cols":14,"rows_kept":92,"cut":false,"hidden":false,"merged":[[81,1,81,7],[82,0,91,0],[82,1,82,3],[82,4,82,7],[83,2,83,5],[84,2,84,3],[85,1,85,7],[88,1,88,3],[88,5,88,6],[89,1,89,6],[90,1,90,6],[91,1,91,6],[60,0,69,0],[60,1,60,3],[60,4,60,7],[61,2,61,5],[62,2,62,3],[63,1,63,7],[66,1,66,3],[66,5,66,6],[67,1,67,6],[68,1,68,6],[69,1,69,6],[38,0,47,0],[38,1,38,3],[38,4,38,7],[39,2,39,5],[40,2,40,3],[41,1,41,7],[44,1,44,3],[44,5,44,6],[45,1,45,6],[46,1,46,6],[47,1,47,6],[22,5,22,6],[23,1,23,6],[24,1,24,6],[25,1,25,6],[5,1,5,7],[9,1,9,7],[13,1,13,7],[17,1,17,7],[0,10,0,11],[1,2,1,5],[1,10,1,11],[2,2,2,3],[3,1,3,7],[27,4,27,7],[28,2,28,5],[27,0,36,0],[29,2,29,3],[30,1,30,7],[33,1,33,3],[33,5,33,6],[34,1,34,6],[35,1,35,6],[36,1,36,6],[0,0,26,0],[0,1,0,3],[0,4,0,7],[22,1,22,3],[49,0,58,0],[49,1,49,3],[49,4,49,7],[50,2,50,5],[51,2,51,3],[52,1,52,7],[55,1,55,3],[55,5,55,6],[56,1,56,6],[57,1,57,6],[58,1,58,6],[27,1,27,3],[71,0,80,0],[71,1,71,3],[71,4,71,7],[72,2,72,5],[73,2,73,3],[74,1,74,7],[77,1,77,3],[77,5,77,6],[78,1,78,6],[79,1,79,6],[80,1,80,6]]}
[1,"CODEVASF",null,null," COMPOSIÇÃO DE PREÇO UNITÁRIO",null,null,null,{"$f":"H24","v":0},{"$f":"H26","v":0},"BDI CALCULADO:",null,{"$f":"ORÇAMENTO!L6","v":15}]
[null,"OBRA:  "," PAVIMENTAÇÃO ASFÁLTICA EM CBUQ - AV. MILITÃO JOSÉ DOS SANTOS E AV. VEREADOR JOSÉ PRATES (JANAÚBA / MG)",null,null,null,"DATA: ",{"$f":"ORÇAMENTO!C6","v":" ABRIL / 2025"},null,null,"BDI DIFERENCIADO:",null,{"$f":"'BDI FORN'!D31/100","v":0.15}]
[null,"SERVIÇO:  ","CPU.1",null,"Referência:","CODEVASF","UNIDADE: ",{"$f":"VLOOKUP(A1,ORÇAMENTO!A11:L31,5)","v":"MOBILIZAÇÃO E DESMOBILIZAÇÃO"}]
[]
[null,"TIPO ITEM","CODIGO ITEM","DESCRIÇÃO ITEM","UNIDADE ITEM","COEFICIENTE","PRECO UNITARIO","CUSTO TOTAL",null,"distancia =",90,"B.DESPACHO"]
[null,"EQUIPAMENTOS",{"$nulls":7},"Pá carregadeira ",null,null,10.1," ton"]
[null,null,"E9001","E9001","E9001",null,"E9001"]
[]
[]
[null,"MÃO DE OBRA"]
[]
[]
[]
[null,"MATERIAIS"]
[]
{"$rows_left_out":78}
{"sheet":"BDI SERV","index":3,"n_rows":60,"n_cols":5,"rows_kept":60,"cut":false,"hidden":false,"merged":[[38,1,38,4],[39,2,39,3],[36,0,36,5],[0,1,2,4],[25,1,25,3],[26,1,26,2],[26,3,26,4],[27,3,27,4],[35,0,35,5]]}
[null,"DETALHAMENTO DO BDI - SERVIÇOS"]
[]
[]
[null,"Item","Descrição dos Serviços","% - PV","% - CD"]
[]
[null,1,"ADMINISTRAÇÃO CENTRAL"," ",{"$f":"SUM(E7:E9)","v":4.01}]
[null,"1.1","ESCRITÓRIO CENTRAL",null,4.01]
[null,"1.2","VIAGENS"]
[null,"1.3","OUTROS"]
[null," "," "," "," "]
[null,2,"IMPOSTOS E TAXAS",{"$f":"SUM(D12:D15)","v":6.15},{"$f":"SUM(E12:E15)","v":0}]
[null,"2.1","ISS - Proposta",{"$f":"D34*100","v":2.5}]
[null,"2.2","PIS",0.65]
[null,"2.3","Cofins",3]
[null,"2.4","Contribuição Previdenciaria (CPRB)"]
{"$rows_left_out":46}
{"sheet":"BDI FORN","index":4,"n_rows":37,"n_cols":5,"rows_kept":37,"cut":false,"hidden":false,"merged":[[31,1,31,2],[32,0,34,5],[36,0,36,5],[0,1,2,4],[3,1,4,1],[3,2,4,2],[28,0,28,5],[30,1,30,2]]}
[null,"DETALHAMENTO DO BDI - FORNECIMENTO \n(MATERIAL ASFÁLTICO)"]
[]
[]
[null,"Item","Descrição dos Serviços","%","%"]
[null,null,null,"PV","CD"]
[]
[null,1,"ADMINISTRAÇÃO CENTRAL"," ",3.45]
[null,"1.1","ESCRITÓRIO CENTRAL"," "," "]
[null,"1.2","VIAGENS"," "," "]
[null,"1.3","OUTROS"," "," "]
[null," "," "," "," "]
[null,2,"IMPOSTOS E TAXAS",{"$f":"SUM(D13:D16)","v":3.65},{"$f":"SUM(E13:E16)","v":4.5600000000000005}]
[null,"2.1","ISS (*)",null,{"$f":"ROUND(D13*1.2515,2)","v":0}]
[null,"2.2","PIS",0.65,{"$f":"ROUND(D14*1.2515,2)","v":0.81}]
[null,"2.3","Cofins",3,{"$f":"ROUND(D15*1.2515,2)","v":3.75}]
{"$rows_left_out":23}
{"sheet":"CRONOGRAMA","index":5,"n_rows":19,"n_cols":14,"rows_kept":19,"cut":false,"hidden":false,"merged":[[0,1,0,13],[1,1,2,1],[1,2,2,4],[1,6,1,13],[2,6,2,13],[3,1,3,12],[5,0,6,0],[5,1,6,1],[5,2,6,2],[7,0,8,0],[7,1,8,1],[7,2,8,2],[9,0,10,0],[9,1,10,1],[9,2,10,2],[15,1,16,2],[18,1,22,13],[11,0,12,0],[11,1,12,1],[11,2,12,2],[13,0,14,0],[13,1,14,1],[13,2,14,2]]}
[null,"CRONOGRAMA FÍSICO-FINANCEIRO"]
[null,"OBRA: ",{"$f":"ORÇAMENTO!C5","v":" PAVIMENTAÇÃO ASFÁLTICA EM CBUQ - AV. MILITÃO JOSÉ DOS SANTOS E AV. VEREADOR JOSÉ PRATES (JANAÚBA / MG)"},null,null,"VALOR:",{"$f":"ORÇAMENTO!L48","v":5698790.6100000003}]
[{"$nulls":5},"PRAZO: ","240 DIAS "]
[]
[null,"ITEM","ETAPAS/DESCRIÇAO","FISICO/  FINANCEIRO","TOTAL    ETAPAS","MÊS 1","MÊS 2","MÊS 3","MÊS 4","MÊS 5","MÊS 6","MÊS 7","MÊS 8","TOTAL"]
["A",{"$f":"VLOOKUP(A6,ORÇAMENTO!$A$10:$L$48,2)","v":1},{"$f":"VLOOKUP(A6,ORÇAMENTO!$A$10:$L$48,5)","v":"SERVIÇOS PRELIMINARES "},"FISICO ",{"$f":"ROUND(E7/$G$2,4)","v":6.2300000000000001E-2},0.2,0.1,0.1,0.1,0.1,0.1,0.1,0.2,{"$f":"SUM(F6:M6)","v":1}]
[null,null,null,"FINANCEIRO",{"$f":"ORÇAMENTO!L10","v":354870.19999999995},{"$f":"ROUND($E$7*F6,2)","v":70974.039999999994},{"$f":"ROUND($E$7*G6,2)","v":35487.019999999997},{"$f":"ROUND($E$7*H6,2)","v":35487.019999999997},{"$f":"ROUND($E$7*I6,2)","v":35487.019999999997},35487.019999999997,35487.019999999997,35487.019999999997,70974.039999999994,{"$f":"SUM(F7:M7)","v":354870.19999999995}]
["B",{"$f":"VLOOKUP(A8,ORÇAMENTO!$A$10:$L$48,2)","v":2},{"$f":"VLOOKUP(A8,ORÇAMENTO!$A$10:$L$48,5)","v":"TERRAPLANAGEM E PAVIMENTAÇÃO"},"FISICO ",{"$f":"ROUND(E9/$G$2,4)","v":0.35049999999999998},0.1,0.2,0.2,0.2,0.2,0.1,null,null,{"$f":"SUM(F8:M8)","v":0.99999999999999989}]
[null,null,null,"FINANCEIRO",{"$f":"ORÇAMENTO!L16","v":1997462},{"$f":"ROUND($E$9*F8,2)","v":199746.2},{"$f":"ROUND($E$9*G8,2)","v":399492.4},{"$f":"ROUND($E$9*H8,2)","v":399492.4},{"$f":"ROUND($E$9*I8,2)","v":399492.4},399492.4,199746.2,0,0,{"$f":"SUM(F9:M9)","v":1997462.0000000002}]
["C",{"$f":"VLOOKUP(A10,ORÇAMENTO!$A$10:$L$48,2)","v":3},{"$f":"VLOOKUP(A10,ORÇAMENTO!$A$10:$L$48,5)","v":"TRANSPORTE DE MATERIAIS"},"FISICO ",{"$f":"ROUND(E11/$G$2,4)","v":0.1153},0.25,0.5,0.25,{"$nulls":5},{"$f":"SUM(F10:M10)","v":1}]
[null,null,null,"FINANCEIRO",{"$f":"ORÇAMENTO!L25","v":656816},{"$f":"ROUND($E$11*F10,2)","v":164204},{"$f":"ROUND($E$11*G10,2)","v":328408},{"$f":"ROUND($E$11*H10,2)","v":164204},{"$f":"ROUND($E$11*I10,2)","v":0},0,0,0,0,{"$f":"SUM(F11:M11)-0.04","v":656815.96}]
["E",{"$f":"VLOOKUP(A12,ORÇAMENTO!$A$10:$L$48,2)","v":4},{"$f":"VLOOKUP(A12,ORÇAMENTO!$A$10:$L$48,5)","v":"DRENAGEM E OBRAS COMPLEMENTARES"},"FISICO ",{"$f":"ROUND(E13/$G$2,4)","v":0.23069999999999999},0.2,0.2,0.1,0.1,0.1,0.1,0.1,0.1,{"$f":"SUM(F12:M12)","v":0.99999999999999989}]
[null,null,null,"FINANCEIRO",{"$f":"ORÇAMENTO!L30","v":1314504.82},{"$f":"ROUND($E$13*F12,2)","v":262900.96000000002},{"$f":"ROUND($E$13*G12,2)","v":262900.96000000002},{"$f":"ROUND($E$13*H12,2)","v":131450.48000000001},{"$f":"ROUND($E$13*I12,2)","v":131450.48000000001},131450.48000000001,131450.48000000001,131450.48000000001,131450.48000000001,{"$f":"SUM(F13:M13)-0.02","v":1314504.78}]
["F",{"$f":"VLOOKUP(A14,ORÇAMENTO!$A$10:$L$48,2)","v":5},{"$f":"VLOOKUP(A14,ORÇAMENTO!$A$10:$L$48,5)","v":"FORNECIMENTOS - MATERIAL ASFÁLTICO (BDI DIFERENCIADO)"},"FISICO ",{"$f":"ROUND(E15/$G$2,4)","v":0.24129999999999999},null,0.2,0.2,0.2,0.2,0.2,null,null,{"$f":"SUM(F14:M14)","v":1}]
[null,null,null,"FINANCEIRO",{"$f":"ORÇAMENTO!L41","v":1375137.59},{"$f":"ROUND($E$15*F14,2)","v":0},275027.52,275027.52,275027.52,275027.52,275027.52,0,0,{"$f":"SUM(F15:M15)-0.02","v":1375137.58}]
{"$rows_left_out":4}