{"text_format":"2","workbook":"xlsx","n_sheets":6,"sheets":["ORÇAMENTO","CPU-SERV","CPU-FORNEC","BDI SERV","BDI FORN","CRONOGRAMA"],"not_rendered":{"charts":0,"images":3,"macros":0,"external_links":1,"defined_names":8,"comments":2,"pivot_tables":0},"unopened":[],"bounds":{"document_bytes":16777216,"sheet_cells":100000,"run_cost":"one","rows_first":2000,"rows_last":500,"rows_between":2000,"halvings":0,"cell_chars":16384,"cell_head_chars":4096},"cells_cut":0,"cells_raw":0,"read":"whole","date_system":"1900"}

{"sheet":"ORÇAMENTO","index":0,"n_rows":41,"n_cols":12,"rows_kept":41,"cut":false,"hidden":false,"merged":[[40,1,40,4],[40,14,40,15],[0,0,8,0],[0,4,0,11],[1,4,1,11],[2,4,2,11],[9,14,9,15],[4,2,4,8],[4,9,4,10],[5,2,5,7],[5,8,5,10],[6,8,6,10],[7,1,7,11],[6,1,6,7],[6,14,8,15]]}
["<---- NUMERAR SERVIÇOS PARA CPU",null,null,null,"Ministério do Desenvolvimento Regional"]
[{"$nulls":4},"Companhia de Desenvolvimento dos Vales do São Francisco e do Parnaíba"]
[{"$nulls":4},"1ª Superintendência Regional"]
[]
[null,"OBRA: ","PAVIMENTAÇÃO ASFÁLTICA EM CBUQ - VIAS URBANAS DIVERSAS - BAIRRO MAJOR SALVO (CORINTO / MG)",{"$nulls":6},"BDI Serviços (%):",null,{"$f":"'BDI SERV'!E26","v":24.67}]
[null,"DATA:"," ABRIL/2025",null," JULHO / 2024",null,null,null,"BDI Diferenciado Serviços (%):",null,null,{"$f":"'BDI FORN'!D31","v":15}]
[null,"PRAZO DE EXECUÇÃO:     180 DIAS",{"$nulls":6},"BDI Fornecimentos (%):",null,null,{"$f":"'BDI FORN'!D31","v":15}]
[null,"PLANILHA DE ORÇAMENTAÇÃO"]
[null,"ITEM","CÓDIGO","FONTE","DISCRIMINAÇÃO","TIPO","UNID.","QUANT.","VR. UNIT.S/BDI","PR. UNIT.C/BDI","C. TOT.S/BDI","P. TOT.C/BDI"]
["A",1,null,null,"SERVIÇOS PRELIMINARES ",{"$nulls":6},{"$f":"SUM(L11:L15)","v":187368.30000000002}]
[1,"1.1","CPU.1","CODEVASF","MOBILIZAÇÃO E DESMOBILIZAÇÃO","SERV","GL",1,{"$f":"VLOOKUP(A11,'CPU-SERV'!A:K,11,0)","v":10988.76},{"$f":"TRUNC(_xlfn.IFS(F11=\"SERV\",I11*(1+$L$5/100),F11=\"SERV DIF\",I11*(1+$L$6/100),F11=\"FORN\",I11*(1+$L$7/100)),2)","v":13699.68},{"$f":"TRUNC(H11*I11,2)","v":10988.76},{"$f":"TRUNC(H11*J11,2)","v":13699.68}]
[2,"1.2","CPU.2","CODEVASF","ADMINISTRAÇÃO LOCAL ","SERV","GL",1,{"$f":"VLOOKUP(A12,'CPU-SERV'!A:K,11,0)","v":118885.52},{"$f":"TRUNC(_xlfn.IFS(F12=\"SERV\",I12*(1+$L$5/100),F12=\"SERV DIF\",I12*(1+$L$6/100),F12=\"FORN\",I12*(1+$L$7/100)),2)","v":148214.57},{"$f":"TRUNC(H12*I12,2)","v":118885.52},{"$f":"TRUNC(H12*J12,2)","v":148214.57}]
[3,"1.3","CPU.3","CODEVASF","CANTEIRO DE OBRAS ","SERV","GL",1,{"$f":"VLOOKUP(A13,'CPU-SERV'!A:K,11,0)","v":11570.05},{"$f":"TRUNC(_xlfn.IFS(F13=\"SERV\",I13*(1+$L$5/100),F13=\"SERV DIF\",I13*(1+$L$6/100),F13=\"FORN\",I13*(1+$L$7/100)),2)","v":14424.38},11570.05,14424.38]
[4,"1.4",103689,"SINAPI","PLACA DE OBRA EM CHAPA DE AÇO GALVANIZADO","SERV","M2",2,{"$f":"VLOOKUP(A14,'CPU-SERV'!A:K,11,0)","v":351.42},{"$f":"TRUNC(_xlfn.IFS(F14=\"SERV\",I14*(1+$L$5/100),F14=\"SERV DIF\",I14*(1+$L$6/100),F14=\"FORN\",I14*(1+$L$7/100)),2)","v":438.11},702.84,876.22]
[6,"1.5",78472,"SINAPI","SERVIÇOS TOPOGRÁFICOS PARA PAVIMENTAÇÃO, INCLUSIVE LEVANTAMENTO PLANIALTIMÉTRICO CADASTRAL, GERAÇÃO DE NOTAS DE SERVIÇO, SEÇÕES TRANSVERSAIS E GREIDE, ESTAQUEAMENTO E ACOMPANHAMENTO EXECUTIVO","SERV","M2",16645,{"$f":"VLOOKUP(A15,'CPU-SERV'!A:K,11,0)","v":0.49},{"$f":"TRUNC(_xlfn.IFS(F15=\"SERV\",I15*(1+$L$5/100),F15=\"SERV DIF\",I15*(1+$L$6/100),F15=\"FORN\",I15*(1+$L$7/100)),2)","v":0.61},8156.05,10153.450000000001]
["B",2,null,null,"TERRAPLANAGEM E PAVIMENTAÇÃO",{"$nulls":6},{"$f":"SUM(L17:L22)","v":699394.87000000011}]
[7,"2.1",5502140,"SICRO","ESCAVAÇÃO, CARGA E TRANSPORTE DE MATERIAL DE 1ª CATEGORIA - DMT 1.000 A 1.200M, CAMINHO DE SERVIÇO EM REVESTIMENTO PRIMÁRIO","SERV","M3",2500.0034999999998,{"$f":"VLOOKUP(A17,'CPU-SERV'!A:K,11,0)","v":6.74},{"$f":"TRUNC(_xlfn.IFS(F17=\"SERV\",I17*(1+$L$5/100),F17=\"SERV DIF\",I17*(1+$L$6/100),F17=\"FORN\",I17*(1+$L$7/100)),2)","v":8.4},16850.02,{"$f":"TRUNC(H17*J17,2)","v":21000.02}]
[9,"2.2",4011209,"SICRO","REGULARIZAÇÃO E COMPACTAÇÃO DO SUBLEITO ","SERV","M2",16800,{"$f":"VLOOKUP(A18,'CPU-SERV'!A:K,11,0)","v":1.54},{"$f":"TRUNC(_xlfn.IFS(F18=\"SERV\",I18*(1+$L$5/100),F18=\"SERV DIF\",I18*(1+$L$6/100),F18=\"FORN\",I18*(1+$L$7/100)),2)","v":1.91},25872,{"$f":"TRUNC(H18*J18,2)","v":32088}]
[10,"2.3",4011276,"SICRO","EXECUÇÃO E COMPACTAÇÃO DE BASE E OU SUB BASE PARA PAVIMENTAÇÃO DE BICA CORRIDA - EXCLUSIVE TRANSPORTE","SERV","M3",2529.9999999999995,{"$f":"VLOOKUP(A19,'CPU-SERV'!A:K,11,0)","v":115.23},{"$f":"TRUNC(_xlfn.IFS(F19=\"SERV\",I19*(1+$L$5/100),F19=\"SERV DIF\",I19*(1+$L$6/100),F19=\"FORN\",I19*(1+$L$7/100)),2)","v":143.65},291531.90000000002,363434.5]
[12,"2.4",4011352,"SICRO","IMPRIMAÇÃO COM EMULSÃO ASFÁLTICA (EAI)","SERV","M2",16100,{"$f":"VLOOKUP(A20,'CPU-SERV'!A:K,11,0)","v":0.4},{"$f":"TRUNC(_xlfn.IFS(F20=\"SERV\",I20*(1+$L$5/100),F20=\"SERV DIF\",I20*(1+$L$6/100),F20=\"FORN\",I20*(1+$L$7/100)),2)","v":0.49},6440,7889]
[13,"2.5",4011353,"SICRO","PINTURA DE LIGAÇÃO COM EMULSÃO ASFÁLTICA RR-1C","SERV","M2",14664.999999999998,{"$f":"VLOOKUP(A21,'CPU-SERV'!A:K,11,0)","v":0.27},{"$f":"TRUNC(_xlfn.IFS(F21=\"SERV\",I21*(1+$L$5/100),F21=\"SERV DIF\",I21*(1+$L$6/100),F21=\"FORN\",I21*(1+$L$7/100)),2)","v":0.33},3959.55,4839.45]
[14,"2.6",4011463,"SICRO","EXECUÇÃO DE PAVIMENTO COM APLICAÇÃO DE CONCRETO ASFÁLTICO USINADO A QUENTE (CBUQ), CAMADA DE ROLAMENTO - EXCLUSIVE TRANSPORTE","SERV","T",1235.0000000000002,{"$f":"VLOOKUP(A22,'CPU-SERV'!A:K,11,0)","v":175.46},{"$f":"TRUNC(_xlfn.IFS(F22=\"SERV\",I22*(1+$L$5/100),F22=\"SERV DIF\",I22*(1+$L$6/100),F22=\"FORN\",I22*(1+$L$7/100)),2)","v":218.74},216693.1,270143.90000000002]
["C",3,null,null,"TRANSPORTE DE MATERIAIS",{"$nulls":6},{"$f":"SUM(L24:L28)","v":255850.46999999997}]
[15,"3.1",5915321,"SICRO","TRANSPORTE COM CAMINHÃO BASCULANTE, EM RODOVIA PAVIMENTADA","SERV","TXKM",199999.99849999993,{"$f":"VLOOKUP(A24,'CPU-SERV'!A:K,11,0)","v":0.65},{"$f":"TRUNC(_xlfn.IFS(F24=\"SERV\",I24*(1+$L$5/100),F24=\"SERV DIF\",I24*(1+$L$6/100),F24=\"FORN\",I24*(1+$L$7/100)),2)","v":0.81},129999.99,{"$f":"TRUNC(H24*J24,2)","v":161999.99}]
[16,"3.2",5915320,"SICRO","TRANSPORTE COM CAMINHÃO BASCULANTE, RODOVIA EM REVESTIMENTO PRIMÁRIO","SERV","TXKM",14999.996299999999,{"$f":"VLOOKUP(A25,'CPU-SERV'!A:K,11,0)","v":0.72},{"$f":"TRUNC(_xlfn.IFS(F25=\"SERV\",I25*(1+$L$5/100),F25=\"SERV DIF\",I25*(1+$L$6/100),F25=\"FORN\",I25*(1+$L$7/100)),2)","v":0.89},10799.99,{"$f":"TRUNC(H25*J25,2)","v":13349.99}]
[17,"3.3",5914434,"SICRO","TRANSPORTE COM CAMINHÃO CARROCERIA 9T, EM VIA URBANA PREDOMINANTEMENTE PAVIMENTADA","SERV","TXKM",499.99551360000009,{"$f":"VLOOKUP(A26,'CPU-SERV'!A:K,11,0)","v":0.74},{"$f":"TRUNC(_xlfn.IFS(F26=\"SERV\",I26*(1+$L$5/100),F26=\"SERV DIF\",I26*(1+$L$6/100),F26=\"FORN\",I26*(1+$L$7/100)),2)","v":0.92},369.99,459.99]
[18,"3.4",5914612,"SICRO","TRANSPORTE DE MASSA ASFÁLTICA COM CAMINHÃO BASCULANTE, EM VIA URBANA PREDOMINANTEMENTE PAVIMENTADA","SERV","TXKM",65750,{"$f":"VLOOKUP(A27,'CPU-SERV'!A:K,11,0)","v":0.93},{"$f":"TRUNC(_xlfn.IFS(F27=\"SERV\",I27*(1+$L$5/100),F27=\"SERV DIF\",I27*(1+$L$6/100),F27=\"FORN\",I27*(1+$L$7/100)),2)","v":1.1499999999999999},61147.5,{"$f":"TRUNC(H27*J27,2)","v":75612.5}]
[19,"3.5",5914622,"SICRO","TRANSPORTE COM CAMINHÃO TANQUE DE TRANSPORTE DE MATERIAL ASFÁLTICO DE 30000 L, EM VIA URBANA PREDOMINANTEMENTE PAVIMENTADA","SERV","TXKM",2050,{"$f":"VLOOKUP(A28,'CPU-SERV'!A:K,11,0)","v":1.74},{"$f":"TRUNC(_xlfn.IFS(F28=\"SERV\",I28*(1+$L$5/100),F28=\"SERV DIF\",I28*(1+$L$6/100),F28=\"FORN\",I28*(1+$L$7/100)),2)","v":2.16},3567,4428]
["E",4,null,null,"DRENAGEM E OBRAS COMPLEMENTARES",{"$nulls":6},{"$f":"SUM(L30:L33)","v":330559.87}]
[20,"4.1",94273,"SINAPI","GUIA (MEIO-FIO) E SARJETA CONJUGADOS DE CONCRETO, MOLDADA  IN LOCO  EM TRECHO RETO COM EXTRUSORA, 45 CM BASE (15 CM BASE DA GUIA + 30 CM BASE DA SARJETA) X 22 CM ALTURA","SERV","M",4600,{"$f":"VLOOKUP(A30,'CPU-SERV'!A:K,11,0)","v":48.38},{"$f":"TRUNC(_xlfn.IFS(F30=\"SERV\",I30*(1+$L$5/100),F30=\"SERV DIF\",I30*(1+$L$6/100),F30=\"FORN\",I30*(1+$L$7/100)),2)","v":60.31},222548,{"$f":"TRUNC(H30*J30,2)","v":277426}]
[46,"4.2",5213440,"SICRO","PLACA DE REGULAMENTAÇÃO EM AÇO, D=60CM - PELÍCULA RETRORREFLETIVA - FORNECIMENTO E INSTALAÇÃO, INCLUSIVE  SUPORTE","SERV","UN.",29,{"$f":"VLOOKUP(A31,'CPU-SERV'!A:K,11,0)","v":259.45999999999998},{"$f":"TRUNC(_xlfn.IFS(F31=\"SERV\",I31*(1+$L$5/100),F31=\"SERV DIF\",I31*(1+$L$6/100),F31=\"FORN\",I31*(1+$L$7/100)),2)","v":323.45999999999998},7524.34,9380.34]
[49,"4.3",5213401,"SICRO","PINTURA DE EIXO VIÁRIO SOBRE ASFALTO COM TINTA RETRORREFLETIVA A BASE DE RESINA ACRÍLICA COM MICROESFERAS DE VIDRO, APLICAÇÃO MECÂNICA COM DEMARCADORA AUTOPROPELIDA","SERV","M2",700.00100000000009,{"$f":"VLOOKUP(A32,'CPU-SERV'!A:K,11,0)","v":29.17},{"$f":"TRUNC(_xlfn.IFS(F32=\"SERV\",I32*(1+$L$5/100),F32=\"SERV DIF\",I32*(1+$L$6/100),F32=\"FORN\",I32*(1+$L$7/100)),2)","v":36.36},20419.02,25452.03]
[51,"4.4",5213405,"SICRO","PINTURA DE FAIXA DE PEDESTRE OU ZEBRADA TINTA RETRORREFLETIVA A BASE DE RESINA ACRÍLICA COM MICROESFERAS DE VIDRO, APLICAÇÃO MANUAL","SERV","M2",350,{"$f":"VLOOKUP(A33,'CPU-SERV'!A:K,11,0)","v":41.95},{"$f":"TRUNC(_xlfn.IFS(F33=\"SERV\",I33*(1+$L$5/100),F33=\"SERV DIF\",I33*(1+$L$6/100),F33=\"FORN\",I33*(1+$L$7/100)),2)","v":52.29},14682.5,18301.5]
["F",5,null,null,"FORNECIMENTOS - MATERIAL ASFÁLTICO (BDI DIFERENCIADO)",{"$nulls":6},{"$f":"SUM(L35:L40)","v":526769.72}]
["F1","5.1","CPU.7","ANP","AQUISIÇÃO DE EMULSÃO ASFÁLTICA PARA IMPRIMAÇÃO (EAI) - EXCLUSIVE TRANSPORTE","FORN","T",21.5,{"$f":"VLOOKUP(A35,'CPU-FORNEC'!A:J,9,0)","v":3189.94},{"$f":"TRUNC(_xlfn.IFS(F35=\"SERV\",I35*(1+$L$5/100),F35=\"SERV DIF\",I35*(1+$L$6/100),F35=\"FORN\",I35*(1+$L$7/100)),2)","v":3668.43},68583.710000000006,{"$f":"TRUNC(H35*J35,2)","v":78871.240000000005}]
["F2","5.2","CPU.8","CODEVASF","TRANSPORTE DE EMULSÃO ASFÁLTICA PARA IMPRIMAÇÃO (EAI)","SERV DIF","T",21.5,{"$f":"VLOOKUP(A36,'CPU-FORNEC'!A:J,9,0)","v":196.94},{"$f":"TRUNC(_xlfn.IFS(F36=\"SERV\",I36*(1+$L$5/100),F36=\"SERV DIF\",I36*(1+$L$6/100),F36=\"FORN\",I36*(1+$L$7/100)),2)","v":226.48},4234.21,4869.32]
["F3","5.3","CPU.9","ANP","AQUISIÇÃO DE EMULSAO ASFALTICA CATIONICA RR-1C - EXCLUSIVE TRANSPORTE","FORN","T",6.99925,{"$f":"VLOOKUP(A37,'CPU-FORNEC'!A:J,9,0)","v":3510.21},{"$f":"TRUNC(_xlfn.IFS(F37=\"SERV\",I37*(1+$L$5/100),F37=\"SERV DIF\",I37*(1+$L$6/100),F37=\"FORN\",I37*(1+$L$7/100)),2)","v":4036.74},24568.83,28254.15]
["F4","5.4","CPU.10","CODEVASF","TRANSPORTE DE EMULSÃO ASFÁLTICA CATIONICA RR-1C","SERV DIF","T",6.99925,{"$f":"VLOOKUP(A38,'CPU-FORNEC'!A:J,9,0)","v":220.02},{"$f":"TRUNC(_xlfn.IFS(F38=\"SERV\",I38*(1+$L$5/100),F38=\"SERV DIF\",I38*(1+$L$6/100),F38=\"FORN\",I38*(1+$L$7/100)),2)","v":253.02},1539.97,1770.95]
["F5","5.5","CPU.11","ANP","AQUISIÇÃO DE CONCRETO ASFÁLTICO DE PETRÓLEO - CAP 50/70 - EXCLUSIVE TRANSPORTE","FORN","T",68.995000000000005,{"$f":"VLOOKUP(A39,'CPU-FORNEC'!A:J,9,0)","v":4816.4799999999996},{"$f":"TRUNC(_xlfn.IFS(F39=\"SERV\",I39*(1+$L$5/100),F39=\"SERV DIF\",I39*(1+$L$6/100),F39=\"FORN\",I39*(1+$L$7/100)),2)","v":5538.95},332313.03000000003,382159.85]
["F6","5.6","CPU.12","CODEVASF","TRANSPORTE DE CONCRETO ASFÁLTICO DE PETRÓLEO - CAP 50/70","SERV DIF","T",68.995000000000005,{"$f":"VLOOKUP(A40,'CPU-FORNEC'!A:J,9,0)","v":388.74},{"$f":"TRUNC(_xlfn.IFS(F40=\"SERV\",I40*(1+$L$5/100),F40=\"SERV DIF\",I40*(1+$L$6/100),F40=\"FORN\",I40*(1+$L$7/100)),2)","v":447.05},26821.11,30844.21]
[null,"TOTAL GERAL DA OBRA COM BDI ",{"$nulls":9},{"$f":"SUM(L10,L16,L23,L29,L34)","v":1999943.2300000002}]

{"sheet":"CPU-SERV","index":1,"n_rows":1680,"n_cols":11,"rows_kept":1680,"cut":false,"hidden":false,"merged":[[1477,11,1477,12],[1478,2,1478,9],[1478,11,1478,12],[1444,7,1444,9],[1450,3,1450,7],[1451,7,1451,9],[1479,1,1480,3],[1479,4,1479,5],[1480,4,1480,5],[1481,2,1481,7],[1455,3,1455,7],[1457,8,1457,9],[1464,3,1464,7],[1465,1,1466,2],[1465,3,1466,3],[1465,4,1466,4],[1465,5,1465,7],[1465,9,1466,9],[1524,3,1524,7],[1525,5,1525,7],[1506,3,1506,7],[1508,8,1508,9],[1515,3,1515,7],[1516,1,1517,2],[1516,3,1517,3],[1516,4,1517,4],[1516,5,1516,7],[1516,9,1517,9],[1501,3,1501,7],[1502,7,1502,9],[1430,2,1430,7],[1473,3,1473,7],[1474,5,1474,7],[1477,0,1526,0],[1399,3,1399,7],[1400,7,1400,9],[1490,3,1490,7],[1491,3,1491,7],[1492,3,1492,7],[1495,7,1495,9],[1487,7,1487,9],[1385,7,1385,9],[1439,3,1439,7],[1440,3,1440,7],[1441,3,1441,7],[1324,0,1373,0],[1426,0,1475,0],[1430,8,1430,9],[1431,1,1432,2],[1431,3,1432,3],[1431,4,1431,5],[1431,6,1431,7],[1436,7,1436,9],[1422,3,1422,7],[1423,5,1423,7],[1481,8,1481,9],[1482,1,1483,2],[1482,3,1483,3],[1482,4,1482,5],[1482,6,1482,7],[1428,4,1428,5],[1429,4,1429,5],[1324,11,1324,12],[1325,2,1325,9],[1325,11,1325,12],[1326,1,1327,3],[1326,4,1326,5],[1327,4,1327,5],[1328,2,1328,7],[1371,3,1371,7],[1372,5,1372,7],[1375,0,1424,0],[1375,11,1375,12],[1376,2,1376,9],[1376,11,1376,12],[1377,1,1378,3],[1377,4,1377,5],[1378,4,1378,5],[1379,2,1379,7],[1353,3,1353,7],[1355,8,1355,9],[1362,3,1362,7],[1363,1,1364,2],[1363,3,1364,3],[1380,1,1381,2],[1380,3,1381,3],[1380,4,1380,5],[1380,6,1380,7],[1414,5,1414,7],[1414,9,1415,9],[1388,3,1388,7],[1389,3,1389,7],[1390,3,1390,7],[1393,7,1393,9],[1426,11,1426,12],[1427,2,1427,9],[1427,11,1427,12],[1428,1,1429,3],[1363,4,1364,4],[1363,5,1363,7],[1363,9,1364,9],[1404,3,1404,7],[1406,8,1406,9],[1413,3,1413,7],[1414,1,1415,2],[1414,3,1415,3],[1414,4,1415,4],[1379,8,1379,9],[1278,3,1279,3],[1278,4,1278,5],[1278,6,1278,7],[1283,7,1283,9],[1337,3,1337,7],[1338,3,1338,7],[1339,3,1339,7],[1342,7,1342,9],[1348,3,1348,7],[1349,7,1349,9],[1328,8,1328,9],[1329,1,1330,2],[1329,3,1330,3],[1329,4,1329,5],[1329,6,1329,7],[1334,7,1334,9],[1320,3,1320,7],[1321,5,1321,7],[1273,0,1322,0],[1273,11,1273,12],[1274,2,1274,9],[1274,11,1274,12],[1275,1,1276,3],[1275,4,1275,5],[1276,4,1276,5],[1277,2,1277,7],[1251,3,1251,7],[1253,8,1253,9],[1260,3,1260,7],[1261,1,1262,2],[1261,3,1262,3],[1261,4,1262,4],[1261,5,1261,7],[1261,9,1262,9],[1302,3,1302,7],[1304,8,1304,9],[1311,3,1311,7],[1312,1,1313,2],[1312,3,1313,3],[1312,4,1313,4],[1312,5,1312,7],[1312,9,1313,9],[1286,3,1286,7],[1287,3,1287,7],[1288,3,1288,7],[1291,7,1291,9],[1297,3,1297,7],[1298,7,1298,9],[1277,8,1277,9],[1278,1,1279,2],[1240,7,1240,9],[1246,3,1246,7],[1247,7,1247,9],[1226,8,1226,9],[1227,1,1228,2],[1227,3,1228,3],[1227,4,1227,5],[1227,6,1227,7],[1232,7,1232,9],[1218,3,1218,7],[1219,5,1219,7],[1222,0,1271,0],[1222,11,1222,12],[1223,2,1223,9],[1223,11,1223,12],[1224,1,1225,3],[1224,4,1224,5],[1225,4,1225,5],[1226,2,1226,7],[1269,3,1269,7],[1270,5,1270,7],[1235,3,1235,7],[1236,3,1236,7],[1237,3,1237,7],[1210,5,1210,7],[1210,9,1211,9],[1184,3,1184,7],[1185,3,1185,7],[1186,3,1186,7],[1189,7,1189,9],[1195,3,1195,7],[1196,7,1196,9],[1175,8,1175,9],[1176,1,1177,2],[1176,3,1177,3],[1176,4,1176,5],[1176,6,1176,7],[1181,7,1181,9],[1074,3,1075,3],[1074,4,1074,5],[1074,6,1074,7],[1079,7,1079,9],[1133,3,1133,7],[1134,3,1134,7],[1135,3,1135,7],[1138,7,1138,9],[1144,3,1144,7],[1145,7,1145,9],[1124,8,1124,9],[1125,1,1126,2],[1125,3,1126,3],[1125,4,1125,5],[1125,6,1125,7],[1130,7,1130,9],[1116,3,1116,7],[1117,5,1117,7],[1120,0,1169,0],[1120,11,1120,12],[1121,2,1121,9],[1121,11,1121,12],[1122,1,1123,3],[1122,4,1122,5],[1123,4,1123,5],[1124,2,1124,7],[1167,3,1167,7],[1168,5,1168,7],[1171,0,1220,0],[1171,11,1171,12],[1172,2,1172,9],[1172,11,1172,12],[1173,1,1174,3],[1173,4,1173,5],[1174,4,1174,5],[1175,2,1175,7],[1149,3,1149,7],[1151,8,1151,9],[1158,3,1158,7],[1159,1,1160,2],[1159,3,1160,3],[1159,4,1160,4],[1159,5,1159,7],[1159,9,1160,9],[1200,3,1200,7],[1202,8,1202,9],[1209,3,1209,7],[1210,1,1211,2],[1210,3,1211,3],[1210,4,1211,4],[1069,0,1118,0],[1069,11,1069,12],[1070,2,1070,9],[1070,11,1070,12],[1071,1,1072,3],[1071,4,1071,5],[1072,4,1072,5],[1073,2,1073,7],[1047,3,1047,7],[1049,8,1049,9],[1056,3,1056,7],[1057,1,1058,2],[1057,3,1058,3],[1057,4,1058,4],[1057,5,1057,7],[1057,9,1058,9],[1098,3,1098,7],[1100,8,1100,9],[1107,3,1107,7],[1108,1,1109,2],[1108,3,1109,3],[1108,4,1109,4],[1108,5,1108,7],[1108,9,1109,9],[1082,3,1082,7],[1083,3,1083,7],[1020,4,1020,5],[1021,4,1021,5],[1022,2,1022,7],[1065,3,1065,7],[1066,5,1066,7],[1006,5,1006,7],[1006,9,1007,9],[980,3,980,7],[981,3,981,7],[982,3,982,7],[985,7,985,9],[991,3,991,7],[992,7,992,9],[1084,3,1084,7],[1087,7,1087,9],[1093,3,1093,7],[1094,7,1094,9],[1073,8,1073,9],[1074,1,1075,2],[1036,7,1036,9],[1042,3,1042,7],[1043,7,1043,9],[1022,8,1022,9],[1023,1,1024,2],[1023,3,1024,3],[1023,4,1023,5],[1023,6,1023,7],[1028,7,1028,9],[1014,3,1014,7],[1015,5,1015,7],[977,7,977,9],[1031,3,1031,7],[1032,3,1032,7],[1033,3,1033,7],[916,0,965,0],[916,11,916,12],[917,2,917,9],[917,11,917,12],[918,1,919,3],[918,4,918,5],[919,4,919,5],[920,2,920,7],[963,3,963,7],[964,5,964,7],[967,0,1016,0],[967,11,967,12],[968,2,968,9],[968,11,968,12],[969,1,970,3],[969,4,969,5],[970,4,970,5],[971,2,971,7],[945,3,945,7],[947,8,947,9],[954,3,954,7],[955,1,956,2],[955,3,956,3],[1018,0,1067,0],[1018,11,1018,12],[1019,2,1019,9],[1019,11,1019,12],[1020,1,1021,3],[955,4,956,4],[955,5,955,7],[955,9,956,9],[996,3,996,7],[998,8,998,9],[1005,3,1005,7],[1006,1,1007,2],[1006,3,1007,3],[1006,4,1007,4],[870,3,871,3],[870,4,870,5],[870,6,870,7],[875,7,875,9],[929,3,929,7],[930,3,930,7],[931,3,931,7],[934,7,934,9],[940,3,940,7],[941,7,941,9],[920,8,920,9],[921,1,922,2],[921,3,922,3],[921,4,921,5],[921,6,921,7],[926,7,926,9],[912,3,912,7],[913,5,913,7],[971,8,971,9],[972,1,973,2],[972,3,973,3],[972,4,972,5],[972,6,972,7],[865,0,914,0],[865,11,865,12],[866,2,866,9],[866,11,866,12],[867,1,868,3],[867,4,867,5],[868,4,868,5],[869,2,869,7],[847,3,847,7],[849,8,849,9],[854,3,854,7],[855,1,856,2],[855,3,856,3],[855,4,856,4],[855,5,855,7],[855,9,856,9],[894,3,894,7],[896,8,896,9],[903,3,903,7],[904,1,905,2],[904,3,905,3],[904,4,905,4],[904,5,904,7],[904,9,905,9],[878,3,878,7],[879,3,879,7],[880,3,880,7],[883,7,883,9],[889,3,889,7],[890,7,890,9],[869,8,869,9],[870,1,871,2],[809,3,810,3],[809,4,810,4],[809,5,809,7],[809,9,810,9],[832,3,832,7],[833,3,833,7],[834,3,834,7],[837,7,837,9],[843,3,843,7],[844,7,844,9],[823,8,823,9],[824,1,825,2],[824,3,825,3],[824,4,824,5],[824,6,824,7],[829,7,829,9],[819,0,863,0],[820,2,820,9],[821,1,822,3],[821,4,821,5],[822,4,822,5],[823,2,823,7],[861,3,861,7],[862,5,862,7],[769,3,769,7],[770,5,770,7],[734,0,771,0],[735,2,735,9],[736,1,737,3],[736,4,736,5],[737,4,737,5],[738,2,738,7],[786,3,786,7],[787,3,787,7],[788,3,788,7],[791,7,791,9],[797,3,797,7],[798,7,798,9],[777,8,777,9],[778,1,779,2],[778,3,779,3],[778,4,778,5],[778,6,778,7],[783,7,783,9],[773,0,817,0],[774,2,774,9],[775,1,776,3],[775,4,775,5],[776,4,776,5],[777,2,777,7],[815,3,815,7],[816,5,816,7],[801,3,801,7],[803,8,803,9],[808,3,808,7],[809,1,810,2],[759,3,759,7],[761,8,761,9],[764,3,764,7],[765,1,766,2],[765,3,766,3],[765,4,766,4],[765,5,765,7],[765,9,766,9],[747,3,747,7],[748,3,748,7],[749,3,749,7],[752,7,752,9],[755,3,755,7],[756,7,756,9],[738,8,738,9],[739,1,740,2],[739,3,740,3],[739,4,739,5],[739,6,739,7],[744,7,744,9],[730,3,730,7],[731,5,731,7],[694,0,732,0],[695,2,695,9],[696,1,697,3],[696,4,696,5],[697,4,697,5],[698,2,698,7],[686,3,687,3],[686,4,687,4],[686,5,686,7],[686,9,687,9],[720,3,720,7],[722,8,722,9],[725,3,725,7],[726,1,727,2],[726,3,727,3],[726,4,727,4],[726,5,726,7],[726,9,727,9],[708,3,708,7],[709,3,709,7],[710,3,710,7],[713,7,713,9],[716,3,716,7],[717,7,717,9],[698,8,698,9],[699,1,700,2],[699,3,700,3],[699,4,699,5],[699,6,699,7],[704,7,704,9],[668,3,668,7],[669,3,669,7],[670,3,670,7],[673,7,673,9],[676,3,676,7],[677,7,677,9],[659,8,659,9],[660,1,661,2],[660,3,661,3],[660,4,660,5],[660,6,660,7],[665,7,665,9],[651,3,651,7],[652,5,652,7],[655,0,692,0],[656,2,656,9],[657,1,658,3],[657,4,657,5],[658,4,658,5],[659,2,659,7],[690,3,690,7],[691,5,691,7],[616,0,653,0],[617,2,617,9],[618,1,619,3],[618,4,618,5],[619,4,619,5],[620,2,620,7],[680,3,680,7],[682,8,682,9],[685,3,685,7],[686,1,687,2],[514,3,514,7],[641,3,641,7],[643,8,643,9],[646,3,646,7],[647,1,648,2],[647,3,648,3],[647,4,648,4],[647,5,647,7],[647,9,648,9],[629,3,629,7],[630,3,630,7],[631,3,631,7],[634,7,634,9],[637,3,637,7],[638,7,638,9],[620,8,620,9],[621,1,622,2],[621,3,622,3],[621,4,621,5],[621,6,621,7],[626,7,626,9],[529,3,529,7],[530,9,531,9],[530,4,531,4],[530,5,530,7],[568,3,568,7],[569,1,570,2],[569,3,570,3],[599,7,599,9],[581,8,581,9],[582,1,583,2],[582,3,583,3],[582,4,582,5],[582,6,582,7],[587,7,587,9],[534,3,534,7],[535,5,535,7],[577,0,614,0],[578,2,578,9],[579,1,580,3],[579,4,579,5],[580,4,580,5],[581,2,581,7],[612,3,612,7],[613,5,613,7],[499,0,536,0],[500,2,500,9],[501,1,502,3],[501,4,501,5],[502,4,502,5],[602,3,602,7],[604,8,604,9],[607,3,607,7],[608,1,609,2],[608,3,609,3],[530,1,531,2],[530,3,531,3],[608,4,609,4],[608,5,608,7],[608,9,609,9],[381,3,381,7],[384,7,384,9],[387,3,387,7],[388,7,388,9],[385,7,385,8],[509,7,509,9],[590,3,590,7],[591,3,591,7],[592,3,592,7],[595,7,595,9],[598,3,598,7],[503,2,503,7],[433,8,433,9],[436,3,436,7],[437,1,438,2],[437,3,438,3],[437,4,438,4],[437,5,437,7],[437,9,438,9],[487,1,488,2],[487,3,488,3],[487,4,488,4],[487,5,487,7],[487,9,488,9],[477,3,477,7],[479,8,479,9],[486,3,486,7],[512,3,512,7],[470,7,470,8],[496,5,496,7],[524,3,524,7],[526,8,526,9],[431,3,431,7],[495,3,495,7],[517,7,517,9],[520,3,520,7],[521,7,521,9],[504,1,505,2],[504,3,505,3],[504,4,504,5],[504,6,504,7],[405,0,443,0],[406,2,406,9],[407,1,408,3],[407,4,407,5],[408,4,408,5],[409,2,409,7],[441,3,441,7],[442,5,442,7],[503,8,503,9],[419,3,419,7],[420,3,420,7],[421,3,421,7],[424,7,424,9],[427,3,427,7],[428,7,428,9],[409,8,409,9],[410,1,411,2],[410,3,411,3],[410,4,410,5],[410,6,410,7],[416,7,416,9],[475,7,475,9],[513,3,513,7],[366,0,403,0],[367,2,367,9],[368,1,369,3],[368,4,368,5],[369,4,369,5],[370,2,370,7],[352,3,352,7],[354,8,354,9],[357,3,357,7],[358,1,359,2],[358,3,359,3],[358,4,359,4],[358,5,358,7],[358,9,359,9],[391,3,391,7],[393,8,393,9],[396,3,396,7],[397,1,398,2],[397,3,398,3],[397,4,398,4],[397,5,397,7],[397,9,398,9],[379,3,379,7],[370,8,370,9],[371,1,372,2],[371,3,372,3],[371,4,371,5],[371,6,371,7],[376,7,376,9],[401,3,401,7],[402,5,402,7],[380,3,380,7],[340,3,340,7],[341,3,341,7],[342,3,342,7],[345,7,345,9],[348,3,348,7],[349,7,349,9],[331,8,331,9],[332,1,333,2],[332,3,333,3],[332,4,332,5],[332,6,332,7],[337,7,337,9],[327,0,364,0],[328,2,328,9],[329,1,330,3],[329,4,329,5],[330,4,330,5],[331,2,331,7],[362,3,362,7],[363,5,363,7],[346,7,346,8],[313,3,313,7],[315,8,315,9],[318,3,318,7],[319,1,320,2],[319,3,320,3],[319,4,320,4],[319,5,319,7],[319,9,320,9],[278,5,278,7],[278,9,279,9],[260,3,260,7],[261,3,261,7],[248,6,248,7],[257,7,257,9],[301,3,301,7],[302,3,302,7],[303,3,303,7],[306,7,306,9],[309,3,309,7],[310,7,310,9],[290,8,290,9],[291,1,292,2],[291,3,292,3],[291,4,291,5],[291,6,291,7],[298,7,298,9],[282,3,282,7],[283,5,283,7],[262,3,262,7],[265,7,265,9],[268,3,268,7],[269,7,269,9],[247,8,247,9],[248,1,249,2],[248,3,249,3],[248,4,248,5],[209,6,209,7],[214,7,214,9],[239,3,239,7],[240,5,240,7],[219,3,219,7],[222,7,222,9],[225,3,225,7],[226,7,226,9],[286,0,325,0],[287,2,287,9],[288,1,289,3],[288,4,288,5],[289,4,289,5],[290,2,290,7],[323,3,323,7],[324,5,324,7],[243,0,284,0],[244,2,244,9],[245,1,246,3],[245,4,245,5],[246,4,246,5],[247,2,247,7],[272,3,272,7],[274,8,274,9],[277,3,277,7],[278,1,279,2],[278,3,279,3],[278,4,279,4],[204,0,241,0],[205,2,205,9],[206,1,207,3],[206,4,206,5],[207,4,207,5],[208,2,208,7],[190,3,190,7],[192,8,192,9],[195,3,195,7],[196,1,197,2],[196,3,197,3],[196,4,197,4],[196,5,196,7],[196,9,197,9],[229,3,229,7],[231,8,231,9],[234,3,234,7],[235,1,236,2],[235,3,236,3],[235,4,236,4],[235,5,235,7],[235,9,236,9],[217,3,217,7],[218,3,218,7],[208,8,208,9],[209,1,210,2],[209,3,210,3],[209,4,209,5],[163,0,202,0],[200,3,200,7],[201,5,201,7],[178,3,178,7],[179,3,179,7],[180,3,180,7],[183,7,183,9],[186,3,186,7],[187,7,187,9],[167,8,167,9],[168,1,169,2],[168,3,169,3],[168,4,168,5],[168,6,168,7],[173,7,173,9],[164,2,164,9],[165,1,166,3],[165,4,165,5],[166,4,166,5],[167,2,167,7],[151,8,151,9],[154,3,154,7],[155,1,156,2],[155,3,156,3],[155,4,156,4],[155,5,155,7],[155,9,156,9],[136,3,136,7],[137,3,137,7],[140,7,140,9],[145,3,145,7],[146,7,146,9],[149,3,149,7],[127,1,128,2],[127,3,128,3],[127,4,127,5],[127,6,127,7],[132,7,132,9],[135,3,135,7],[119,5,119,7],[122,0,161,0],[123,2,123,9],[124,1,125,3],[124,4,124,5],[125,4,125,5],[126,2,126,7],[126,8,126,9],[159,3,159,7],[160,5,160,7],[114,1,115,2],[114,3,115,3],[114,4,115,4],[114,5,114,7],[114,9,115,9],[118,3,118,7],[93,7,93,9],[98,3,98,7],[101,7,101,9],[104,3,104,7],[105,7,105,9],[108,3,108,7],[83,0,120,0],[84,2,84,9],[85,1,86,3],[86,4,86,5],[87,2,87,7],[87,8,87,9],[88,1,89,2],[110,8,110,9],[113,3,113,7],[96,3,96,7],[97,3,97,7],[88,3,89,3],[88,4,88,5],[88,6,88,7],[79,3,79,7],[80,5,80,7],[85,4,85,5],[74,3,74,7],[75,1,76,2],[75,3,76,3],[75,4,76,4],[75,5,75,7],[75,9,76,9],[57,3,57,7],[60,7,60,9],[63,3,63,7],[64,7,64,9],[69,3,69,7],[71,8,71,9],[44,3,45,3],[44,4,44,5],[44,6,44,7],[49,7,49,9],[55,3,55,7],[56,3,56,7],[41,1,42,3],[41,4,41,5],[42,4,42,5],[43,2,43,7],[43,8,43,9],[44,1,45,2],[0,0,37,0],[3,4,3,5],[0,11,0,12],[1,11,1,12],[2,4,2,5],[1,2,1,9],[2,1,3,3],[31,3,32,3],[31,4,32,4],[31,5,31,7],[31,9,32,9],[35,3,35,7],[36,5,36,7],[10,7,10,9],[13,3,13,7],[14,3,14,7],[15,3,15,7],[18,7,18,9],[30,3,30,7],[31,1,32,2],[22,7,22,9],[25,3,25,7],[2,10,2,11],[1567,5,1567,7],[1567,9,1568,9],[1575,3,1575,7],[1576,5,1576,7],[27,8,27,9],[21,3,21,7],[4,2,4,7],[4,8,4,9],[5,1,6,2],[5,3,6,3],[5,4,5,5],[5,6,5,7],[445,0,497,0],[446,2,446,9],[447,1,448,3],[447,4,447,5],[448,4,448,5],[449,2,449,7],[449,8,449,9],[450,1,451,2],[450,3,451,3],[450,4,450,5],[450,6,450,7],[458,7,458,9],[460,3,460,7],[461,3,461,7],[462,3,462,7],[465,7,465,9],[474,3,474,7],[39,0,81,0],[40,2,40,9],[538,0,575,0],[1579,11,1579,12],[1581,4,1581,5],[1592,3,1592,7],[1593,3,1593,7],[1579,0,1628,0],[1580,2,1580,9],[1528,0,1577,0],[1528,11,1528,12],[1529,2,1529,9],[1529,11,1529,12],[1530,1,1531,3],[1530,4,1530,5],[1531,4,1531,5],[1532,2,1532,7],[1532,8,1532,9],[1533,1,1534,2],[1533,3,1534,3],[1533,4,1533,5],[1533,6,1533,7],[1538,7,1538,9],[1541,3,1541,7],[1542,3,1542,7],[1543,3,1543,7],[1546,7,1546,9],[1552,3,1552,7],[1553,7,1553,9],[1557,3,1557,7],[1559,8,1559,9],[1566,3,1566,7],[1567,1,1568,2],[1567,3,1568,3],[1567,4,1568,4],[1661,8,1661,9],[1668,3,1668,7],[1669,1,1670,2],[1669,3,1670,3]],"merged_total":1076,"flags":["merged_cut"]}
[1,"1ª/GRD",{"$nulls":8},{"$f":"J37","v":10988.76}]
[null,"OBRA:","PAVIMENTAÇÃO ASFÁLTICA EM CBUQ - VIAS URBANAS DIVERSAS - BAIRRO MAJOR SALVO (CORINTO / MG)"]
[null,"Custo Unitário de Referência",null,null,"Minas Gerais"]
[{"$nulls":4}," Abril/2025",null,null,"Produção da equipe ",0.5,{"$f":"VLOOKUP(A1,ORÇAMENTO!$A$10:$L$41,7,1)","v":"GL"}]
[null,"CPU.1","MOBILIZAÇÃO E DESMOBILIZAÇÃO",{"$nulls":5},"Valores em reais (R$)"]
[null,"A - EQUIPAMENTOS",null,"Quantidade","Utilização",null,"Custo Horário",null,null,"Custo"]
[{"$nulls":4},"Operativa","Improdutiva","Produtivo","Improdutivo",null,"Horário Total"]
[null,"E9687","Caminhão carroceria com capacidade de 5 t - 115 kW",8,0.6,0.4,146.88079999999999,57.423099999999998,null,{"$f":"D8*(E8*G8+F8*H8)","v":888.78175999999996}]
[null,"E9575","Caminhão basculante com caçamba estanque com capacidade de 14 m³ - 210 kW",12,1,0,309.83940000000001,90.412199999999999,null,{"$f":"D9*(E9*G9+F9*H9)","v":3718.0727999999999}]
[{"$nulls":7},"Custo horário total de equipamentos",null,{"$f":"SUM(J8:J9)","v":4606.8545599999998}]
[null,"B - MÃO DE OBRA",null,"Quantidade","Unidade",null,"Custo Horário","Custo Horário Total"]
[null,"P9824","Servente",8,"h",null,21.3355,null,null,{"$f":"D12*G12","v":170.684}]
[{"$nulls":9},{"$f":"D13*G13","v":0}]
[null,null,null,"Custo horário total de mão de obra",{"$nulls":5},{"$f":"SUM(J12:J13)","v":170.684}]
[null,null,null,"Custo horário total de execução",{"$nulls":5},{"$f":"J10+J14","v":4777.53856}]
[null,null,null,"Custo unitário de execução",{"$nulls":5},{"$f":"J15/I4","v":9555.0771199999999}]
[{"$nulls":7},"Custo do FIC",null,0]
[{"$nulls":7},"Custo do FIT",null,0]
[null,"C - MATERIAL",null,"Quantidade","Unidade",null,"Preço Unitário","Custo Unitário"]
[null,"-",0,null,"-",null,"-",null,null,0]
[null,"-",0,null,"-",null,"-",null,null,0]
[null,null,null,"Custo unitário total de material",{"$nulls":5},0]
[null,"D - ATIVIDADES AUXILIARES",null,"Quantidade","Unidade",null,"Custo Unitário","Custo Unitário"]
[null,5914640,"Transporte com cavalo mecânico com semirreboque com capacidade de 30 t - rodovia pavimentada",2515.2400000000002,"tkm",null,0.56999999999999995,null,null,{"$f":"D24*G24","v":1433.6867999999999}]
[null,"-","-",0,"-",null,0,null,null,0]
[null,null,null,"Custo total de atividades auxiliares",{"$nulls":5},{"$f":"SUM(J24:J25)","v":1433.6867999999999}]
[{"$nulls":7},"Subtotal",null,{"$f":"J16+J22+J26+J17+J18","v":10988.763919999999}]
[null,"E - TEMPO FIXO",null,"Código","Quantidade","Unidade",null,"Custo Unitário","Custo Unitário"]
[null,"-",0,"-",null,"-",null,0,null,{"$f":"ROUNDDOWN(E29*H29,4)","v":0}]
[null,"-",0,"-",null,"-",null,0,null,{"$f":"ROUNDDOWN(E30*H30,4)","v":0}]
[null,null,null,"Custo unitário total de tempo fixo",{"$nulls":5},{"$f":"SUM(J29:J30)","v":0}]
[null,"F - MOMENTO DE TRANSPORTE",null,"Quantidade","Unidade","DMT",null,null,null,"Custo Unitário"]
[{"$nulls":5},"LN","RP","P"]
[null,"-",0,null,"tkm"]
[null,"-",0,null,"tkm"]
[null,null,null,"Custo unitário total de transporte"]
[{"$nulls":5},"Custo unitário direto total",null,null,null,{"$f":"TRUNC(J27+J31,2)","v":10988.76}]
[null,"Obs."]
[]
[{"$f":"A1+1","v":2},"1ª/GRD",{"$nulls":8},{"$f":"J81","v":118885.52}]
[null,"OBRA:","PAVIMENTAÇÃO ASFÁLTICA EM CBUQ - VIAS URBANAS DIVERSAS - BAIRRO MAJOR SALVO (CORINTO / MG)"]
[null,"Custo Unitário de Referência",null,null,"Minas Gerais"]
[{"$nulls":4}," Abril/2025",null,null,"Produção da equipe ",0.2,{"$f":"VLOOKUP(A40,ORÇAMENTO!$A$10:$L$41,7,1)","v":"GL"},"6 MESES"]
[null,"CPU.2","ADMINISTRAÇÃO LOCAL ",{"$nulls":5},"Valores em reais (R$)"]
[null,"A - EQUIPAMENTOS",null,"Quantidade","Utilização",null,"Custo Horário",null,null,"Custo"]
[{"$nulls":4},"Operativa","Improdutiva","Produtivo","Improdutivo",null,"Horário Total"]
[null,"-",0,null,null,null,0,0,null,{"$f":"D47*(E47*G47+F47*H47)","v":0}]
[null,"-",0,null,null,null,0,0,null,{"$f":"D48*(E48*G48+F48*H48)","v":0}]
[{"$nulls":7},"Custo horário total de equipamentos",null,{"$f":"SUM(J47:J48)","v":0}]
[null,"B - MÃO DE OBRA",null,"Quantidade","Unidade",null,"Custo Horário","Custo Horário Total"]
[null,"P9812","Engenheiro",0.23784676745473449,"mês",null,26055.551500000001,null,null,{"$f":"D51*G51","v":6197.2286985253586}]
[null,"P9840","Encarregado geral",1,"mês",null,9988.7388749999991,null,null,{"$f":"D52*G52","v":9988.7388749999991}]
[null,"P9876","Técnico de segurança do trabalho",0.5,"mês",null,5884.1547,null,null,2942.07735]
[null,"P9858","Laboratorista",0.5,"mês",null,4782.9530249999998,null,null,2391.4765124999999]
[null,"P9806","Auxiliar administrativo",0.5,"mês",null,3354.0398249999998,null,null,1677.0199124999999]
[null,null,null,"Custo horário total de mão de obra",{"$nulls":5},{"$f":"SUM(J51:J55)","v":23196.541348525359}]
[null,null,null,"Custo horário total de execução",{"$nulls":5},{"$f":"J49+J56","v":23196.541348525359}]
[null,null,null,"Custo unitário de execução",{"$nulls":5},{"$f":"J57/I43","v":115982.70674262679}]
[{"$nulls":7},"Custo do FIC",null,"-"]
[{"$nulls":7},"Custo do FIT",null,"-"]
[null,"C - MATERIAL",null,"Quantidade","Unidade",null,"Preço Unitário","Custo Unitário"]
[null,"-",0,0,"-",null,0,null,null,{"$f":"D62*G62","v":0}]
[null,"-",0,0,"-",null,0,null,null,0]
[null,null,null,"Custo unitário total de material",{"$nulls":5},{"$f":"SUM(J62:J63)","v":0}]
[null,"D - ATIVIDADES AUXILIARES",null,"Quantidade","Unidade",null,"Custo Unitário","Custo Unitário"]
[null,14250,"Energia Elétrica",200,"kwh",null,0.95,null,null,{"$f":"D66*G66","v":190}]
[null,44480,"Tarifa A - Água e Esgoto",20,"m³",null,17.97,null,null,{"$f":"D67*G67","v":359.4}]
[null,5212560,"Placa de advertência para sinalização de obras montada em suporte metálico móvel, lado 1,00 m - utilização de 600 ciclos - fornecimento, 01 implantação e 01 retirada diária",528,"un.dia",null,3.89,null,null,{"$f":"D68*G68","v":2053.92}]
[null,"Cotação","Telefone",5,"mês",null,59.9,null,null,{"$f":"D69*G69","v":299.5}]
[null,null,null,"Custo total de atividades auxiliares",{"$nulls":5},{"$f":"SUM(J66:J69)","v":2902.82}]
[{"$nulls":7},"Subtotal",null,{"$f":"J58+J64+J70","v":118885.5267426268}]
[null,"E - TEMPO FIXO",null,"Código","Quantidade","Unidade",null,"Custo Unitário","Custo Unitário"]
[null,"-",0,"-",0,"t",null,0,null,{"$f":"ROUNDDOWN(E73*H73,4)","v":0}]
[null,"-",0,"-",0,"t",null,0,null,{"$f":"ROUNDDOWN(E74*H74,4)","v":0}]
[null,null,null,"Custo unitário total de tempo fixo",{"$nulls":5},{"$f":"SUM(J73:J74)","v":0}]
[null,"F - MOMENTO DE TRANSPORTE",null,"Quantidade","Unidade","DMT",null,null,null,"Custo Unitário"]
[{"$nulls":5},"LN","RP","P"]
[null,"-",0,null,"tkm"]
[null,"-",0,null,"tkm"]
[null,null,null,"Custo unitário total de transporte"]
[{"$nulls":5},"Custo unitário direto total",null,null,null,{"$f":"TRUNC(J71+J75,2)","v":118885.52}]
[null,"Obs."]
[]
[{"$f":"A40+1","v":3},"1ª/GRD",{"$nulls":8},{"$f":"J120","v":11570.05}]
[null,"OBRA:","PAVIMENTAÇÃO ASFÁLTICA EM CBUQ - VIAS URBANAS DIVERSAS - BAIRRO MAJOR SALVO (CORINTO / MG)"]
[null,"Custo Unitário de Referência",null,null,"Minas Gerais"]
[{"$nulls":4}," Abril/2025",null,null,"Produção da equipe ",1,{"$f":"VLOOKUP(A84,ORÇAMENTO!$A$10:$L$41,7,1)","v":"GL"}]
[null,"CPU.3","CANTEIRO DE OBRAS ",{"$nulls":5},"Valores em reais (R$)"]
[null,"A - EQUIPAMENTOS",null,"Quantidade","Utilização",null,"Custo Horário",null,null,"Custo"]
[{"$nulls":4},"Operativa","Improdutiva","Produtivo","Improdutivo",null,"Horário Total"]
[null,"-",0,null,null,null,0,0,null,{"$f":"D91*(E91*G91+F91*H91)","v":0}]
[null,"-",0,null,null,null,0,0,null,{"$f":"D92*(E92*G92+F92*H92)","v":0}]
[{"$nulls":7},"Custo horário total de equipamentos",null,{"$f":"SUM(J91:J92)","v":0}]
[null,"B - MÃO DE OBRA",null,"Quantidade","Unidade",null,"Custo Horário","Custo Horário Total"]
[null,"P9824","Servente",8,"h",null,21.3355,null,null,{"$f":"D95*G95","v":170.684}]
[null,"P9808","Carpinteiro",8,"h",null,26.4529,null,null,{"$f":"D96*G96","v":211.6232}]
[null,null,null,"Custo horário total de mão de obra",{"$nulls":5},{"$f":"SUM(J95:J96)","v":382.30719999999997}]
[null,null,null,"Custo horário total de execução",{"$nulls":5},{"$f":"J93+J97","v":382.30719999999997}]
[null,null,null,"Custo unitário de execução",{"$nulls":5},{"$f":"J98/I87","v":382.30719999999997}]
[{"$nulls":7},"Custo do FIC",null,"-"]
[{"$nulls":7},"Custo do FIT",null,"-"]
[null,"C - MATERIAL",null,"Quantidade","Unidade",null,"Preço Unitário","Custo Unitário"]
[null,"M0053","Tela plástica em polipropileno na cor laranja para tapume - L = 1,2 m",60,"m",null,1.7749999999999999,null,null,{"$f":"D103*G103","v":106.5}]
[null,"-",0,0,"-",null,0,null,null,{"$f":"D104*G104","v":0}]
[null,null,null,"Custo unitário total de material",{"$nulls":5},{"$f":"SUM(J103:J104)","v":106.5}]
[null,"D - ATIVIDADES AUXILIARES",null,"Quantidade","Unidade",null,"Custo Unitário","Custo Unitário"]
[null,10775,"Locação de container 2,30 X 6,00 m, alt. 2,50 m, com 1 sanitário, para escritório, completo, sem divisórias internas",5,"mês",null,985,null,null,{"$f":"D107*G107","v":4925}]
[null,10779,"Locação de container 2,30 X 4,30 m, alt. 2,50 M, p/ sanitário, c/ 5 bacias, 1 lavatório e 4 mictórios",5,"mês",null,1231.25,null,null,{"$f":"D108*G108","v":6156.25}]
[null,null,null,"Custo total de atividades auxiliares",{"$nulls":5},{"$f":"SUM(J107:J108)","v":11081.25}]
[{"$nulls":7},"Subtotal",null,{"$f":"J99+J105+J109","v":11570.057199999999}]
[null,"E - TEMPO FIXO",null,"Código","Quantidade","Unidade",null,"Custo Unitário","Custo Unitário"]
[null,"-",0,"-",0,"t",null,0,null,{"$f":"ROUNDDOWN(E112*H112,4)","v":0}]
[null,"-",0,"-",0,"t",null,0,null,{"$f":"ROUNDDOWN(E113*H113,4)","v":0}]
[null,null,null,"Custo unitário total de tempo fixo",{"$nulls":5},{"$f":"SUM(J112:J113)","v":0}]
[null,"F - MOMENTO DE TRANSPORTE",null,"Quantidade","Unidade","DMT",null,null,null,"Custo Unitário"]
[{"$nulls":5},"LN","RP","P"]
[null,"-",0,0,"tkm"]
[null,"-",0,0,"tkm"]
[null,null,null,"Custo unitário total de transporte"]
[{"$nulls":5},"Custo unitário direto total",null,null,null,{"$f":"TRUNC(J110+J114,2)","v":11570.05}]
[null,"Obs."]
[]
[{"$f":"A84+1","v":4},"1ª/GRD",{"$nulls":8},{"$f":"J161","v":351.42}]
[null,"OBRA:","PAVIMENTAÇÃO ASFÁLTICA EM CBUQ - VIAS URBANAS DIVERSAS - BAIRRO MAJOR SALVO (CORINTO / MG)"]
[null,"Custo Unitário de Referência",null,null,"Minas Gerais"]
[{"$nulls":4}," Abril/2025",null,null,"Produção da equipe ",1,{"$f":"VLOOKUP(A123,ORÇAMENTO!$A$10:$L$41,7,1)","v":"M2"}]
[null,103689,"PLACA DE OBRA EM CHAPA DE AÇO GALVANIZADO",{"$nulls":5},"Valores em reais (R$)"]
[null,"A - EQUIPAMENTOS",null,"Quantidade","Utilização",null,"Custo Horário",null,null,"Custo"]
[{"$nulls":4},"Operativa","Improdutiva","Produtivo","Improdutivo",null,"Horário Total"]
[null,"-",0,null,null,null,0,0,null,{"$f":"D130*(E130*G130+F130*H130)","v":0}]
[null,"-",0,null,null,null,0,0,null,{"$f":"D131*(E131*G131+F131*H131)","v":0}]
[{"$nulls":7},"Custo horário total de equipamentos",null,{"$f":"SUM(J130:J131)","v":0}]
[null,"B - MÃO DE OBRA",null,"Quantidade","Unidade",null,"Custo Horário","Custo Horário Total"]
[null,"P9824","Servente",1.1186,"h",null,21.3355,null,null,{"$f":"D134*G134","v":23.8658903}]
[null,"P9808","Carpinteiro",0.37290000000000001,"h",null,26.4529,null,null,{"$f":"D135*G135","v":9.8642864100000001}]
[null,null,null,"Custo horário total de mão de obra",{"$nulls":5},{"$f":"SUM(J134:J135)","v":33.730176710000002}]
[null,null,null,"Custo horário total de execução",{"$nulls":5},{"$f":"J132+J136","v":33.730176710000002}]
[null,null,null,"Custo unitário de execução",{"$nulls":5},{"$f":"J137/I126","v":33.730176710000002}]
[{"$nulls":7},"Custo do FIC",null,"-"]
[{"$nulls":7},"Custo do FIT",null,"-"]
[null,"C - MATERIAL",null,"Quantidade","Unidade",null,"Preço Unitário","Custo Unitário"]
[null,"M1358","Sarrafo em madeira de terceira - E = 2,5 cm e L = 5 cm",6.4165999999999999,"m",null,1.9665999999999999,null,null,{"$f":"D142*G142","v":12.618885559999999}]
[null,"M1205","Prego de ferro",2.4500000000000001E-2,"kg",null,16.544499999999999,null,null,{"$f":"D143*G143","v":0.40534025000000001}]
[null,"M0998","Madeira estrutural de eucalipto",2.2608E-2,"m³",null,2418.0391,null,null,{"$f":"D144*G144","v":54.6670279728}]
[null,4813,"Placa de obra (para construção civil) em chapa galvanizada *N. 22*, adesivada, de *2,4 X 1,2* m (sem postes para fixação)",1,"m²",null,250,null,null,250]
[null,null,null,"Custo unitário total de material",{"$nulls":5},{"$f":"SUM(J142:J145)","v":317.6912537828}]
[null,"D - ATIVIDADES AUXILIARES",null,"Quantidade","Unidade",null,"Custo Unitário","Custo Unitário"]
[null,"-",0,0,"-",null,0,null,null,{"$f":"D148*G148","v":0}]
[null,"-",0,0,"-",null,0,null,null,{"$f":"D149*G149","v":0}]
[null,null,null,"Custo total de atividades auxiliares",{"$nulls":5},{"$f":"SUM(J148:J149)","v":0}]
[{"$nulls":7},"Subtotal",null,{"$f":"J138+J146+J150","v":351.42143049280003}]
[null,"E - TEMPO FIXO",null,"Código","Quantidade","Unidade",null,"Custo Unitário","Custo Unitário"]
[null,"-",0,"-",0,"t",null,0,null,{"$f":"ROUNDDOWN(E153*H153,4)","v":0}]
[null,"-",0,"-",0,"t",null,0,null,{"$f":"ROUNDDOWN(E154*H154,4)","v":0}]
[null,null,null,"Custo unitário total de tempo fixo",{"$nulls":5},{"$f":"SUM(J153:J154)","v":0}]
[null,"F - MOMENTO DE TRANSPORTE",null,"Quantidade","Unidade","DMT",null,null,null,"Custo Unitário"]
[{"$nulls":5},"LN","RP","P"]
[null,"-",0,0,"tkm"]
[null,"-",0,0,"tkm"]
[null,null,null,"Custo unitário total de transporte"]
[{"$nulls":5},"Custo unitário direto total",null,null,null,{"$f":"TRUNC(J151+J155,2)","v":351.42}]
[null,"Obs."]
[]
[6,"1ª/GRD",{"$nulls":8},{"$f":"J202","v":0.49}]
[null,"OBRA:","PAVIMENTAÇÃO ASFÁLTICA EM CBUQ - VIAS URBANAS DIVERSAS - BAIRRO MAJOR SALVO (CORINTO / MG)"]
[null,"Custo Unitário de Referência",null,null,"Minas Gerais"]
[{"$nulls":4}," Abril/2025",null,null,"Produção da equipe ",1,{"$f":"VLOOKUP(A164,ORÇAMENTO!$A$10:$L$41,7,1)","v":"M2"}]
[null,78472,"SERVIÇOS TOPOGRÁFICOS PARA PAVIMENTAÇÃO, INCLUSIVE LEVANTAMENTO PLANIALTIMÉTRICO CADASTRAL, GERAÇÃO DE NOTAS DE SERVIÇO, SEÇÕES TRANSVERSAIS E GREIDE, ESTAQUEAMENTO E ACOMPANHAMENTO EXECUTIVO",{"$nulls":5},"Valores em reais (R$)"]
[null,"A - EQUIPAMENTOS",null,"Quantidade","Utilização",null,"Custo Horário",null,null,"Custo"]
[{"$nulls":4},"Operativa","Improdutiva","Produtivo","Improdutivo",null,"Horário Total"]
[null,92145,"Caminhonete cabine simples com motor 1.6 flex, câmbio manual, potência 101/104 cv, 2 portas",5.0000000000000001E-4,1,0,76.5,0,null,{"$f":"D171*(E171*G171+F171*H171)","v":3.8249999999999999E-2}]
[null,"-",0,0,0,0,0,0,null,{"$f":"D172*(E172*G172+F172*H172)","v":0}]
[{"$nulls":7},"Custo horário total de equipamentos",null,{"$f":"SUM(J171:J172)","v":3.8249999999999999E-2}]
[null,"B - MÃO DE OBRA",null,"Quantidade","Unidade",null,"Custo Horário","Custo Horário Total"]
[null,"P9949","Topógrafo",1.590909090909091E-5,"mês",null,6816.9715999999999,28.404048333333332,null,{"$f":"D175*G175","v":0.10845182090909092}]
[null,"P9950","Auxiliar de topografia",1.590909090909091E-5,"mês",null,6157.8463000000002,22.806838148148149,null,{"$f":"D176*G176","v":9.7965736590909097E-2}]
[null,"P9824","Servente",7.4999999999999997E-3,"h",null,21.3355,8.889791666666666E-2,null,{"$f":"D177*G177","v":0.16001625}]
[null,"P9848","Desenhista",9.090909090909091E-6,"mês",null,10307.748600000001,38.17684666666667,null,{"$f":"D178*G178","v":9.3706805454545461E-2}]
[null,null,null,"Custo horário total de mão de obra",{"$nulls":5},{"$f":"SUM(J175:J178)","v":0.46014061295454545}]
[null,null,null,"Custo horário total de execução",{"$nulls":5},{"$f":"J173+J179","v":0.49839061295454545}]
[null,null,null,"Custo unitário de execução",{"$nulls":5},{"$f":"J180/I167","v":0.49839061295454545}]
[{"$nulls":7},"Custo do FIC",null,"-"]
[{"$nulls":7},"Custo do FIT",null,"-"]
[null,"C - MATERIAL",null,"Quantidade","Unidade",null,"Preço Unitário","Custo Unitário"]
[null,"-",0,0,"-",null,0,null,null,{"$f":"D185*G185","v":0}]
[null,"-",0,0,"-",null,0,null,null,0]
[null,null,null,"Custo unitário total de material",{"$nulls":5},{"$f":"SUM(J185:J186)","v":0}]
[null,"D - ATIVIDADES AUXILIARES",null,"Quantidade","Unidade",null,"Custo Unitário","Custo Unitário"]
[null,"-",0,0,"-",null,0,null,null,{"$f":"D189*G189","v":0}]
[null,"-",0,0,"-",null,0,null,null,{"$f":"D190*G190","v":0}]
[null,null,null,"Custo total de atividades auxiliares",{"$nulls":5},{"$f":"SUM(J189:J190)","v":0}]
[{"$nulls":7},"Subtotal",null,{"$f":"J181+J187+J191","v":0.49839061295454545}]
[null,"E - TEMPO FIXO",null,"Código","Quantidade","Unidade",null,"Custo Unitário","Custo Unitário"]
[null,"-",0,"-",0,"t",null,0,null,{"$f":"ROUNDDOWN(E194*H194,4)","v":0}]
[null,"-",0,"-",0,"t",null,0,null,{"$f":"ROUNDDOWN(E195*H195,4)","v":0}]
[null,null,null,"Custo unitário total de tempo fixo",{"$nulls":5},{"$f":"SUM(J194:J195)","v":0}]
[null,"F - MOMENTO DE TRANSPORTE",null,"Quantidade","Unidade","DMT",null,null,null,"Custo Unitário"]
[{"$nulls":5},"LN","RP","P"]
[null,"-",0,0,"tkm"]
[null,"-",0,0,"tkm"]
[null,null,null,"Custo unitário total de transporte"]
[{"$nulls":5},"Custo unitário direto total",null,null,null,{"$f":"TRUNC(J192+J196,2)","v":0.49}]
[null,"Obs."]
[]
[{"$f":"A164+1","v":7},"1ª/GRD",{"$nulls":8},{"$f":"J241","v":6.74}]
[null,"OBRA:","PAVIMENTAÇÃO ASFÁLTICA EM CBUQ - VIAS URBANAS DIVERSAS - BAIRRO MAJOR SALVO (CORINTO / MG)"]
[null,"Custo Unitário de Referência",null,null,"Minas Gerais"]
[{"$nulls":4}," Abril/2025",null,null,"Produção da equipe ",230.19,{"$f":"VLOOKUP(A205,ORÇAMENTO!$A$10:$L$41,7,1)","v":"M3"}]
[null,5502140,"ESCAVAÇÃO, CARGA E TRANSPORTE DE MATERIAL DE 1ª CATEGORIA - DMT 1.000 A 1.200M, CAMINHO DE SERVIÇO EM REVESTIMENTO PRIMÁRIO",{"$nulls":5},"Valores em reais (R$)"]
[null,"A - EQUIPAMENTOS",null,"Quantidade","Utilização",null,"Custo Horário",null,null,"Custo"]
[{"$nulls":4},"Operativa","Improdutiva","Produtivo","Improdutivo",null,"Horário Total"]
[null,"E9667","Caminhão basculante com capacidade de 14 m³ - 210 kW",4,0.97,0.03,309.83940000000001,90.412199999999999,null,{"$f":"D212*(E212*G212+F212*H212)","v":1213.0263359999999}]
[null,"E9515","Escavadeira hidráulica sobre esteiras com caçamba com capacidade de 1,56 m³ - 118 kW",1,1,0,287.62189999999998,129.0472,null,{"$f":"D213*(E213*G213+F213*H213)","v":287.62189999999998}]
[{"$nulls":7},"Custo horário total de equipamentos",null,{"$f":"SUM(J212:J213)","v":1500.648236}]
[null,"B - MÃO DE OBRA",null,"Quantidade","Unidade",null,"Custo Horário","Custo Horário Total"]
[null,"P9824","Servente",1,"h",null,21.3355,null,null,{"$f":"D216*G216","v":21.3355}]
[{"$nulls":9},{"$f":"D217*G217","v":0}]
[null,null,null,"Custo horário total de mão de obra",{"$nulls":5},{"$f":"SUM(J216:J217)","v":21.3355}]
[null,null,null,"Custo horário total de execução",{"$nulls":5},{"$f":"J214+J218","v":1521.9837359999999}]
[null,null,null,"Custo unitário de execução",{"$nulls":5},{"$f":"J219/I208","v":6.6118586211390591}]
[{"$nulls":7},"Custo do FIC",null,0.1313]
[{"$nulls":7},"Custo do FIT",null,0]
[null,"C - MATERIAL",null,"Quantidade","Unidade",null,"Preço Unitário","Custo Unitário"]
[null,"-",0,null,"-",null,0,null,null,{"$f":"D224*G224","v":0}]
[null,"-",0,null,"-",null,0,null,null,{"$f":"D225*G225","v":0}]
[null,null,null,"Custo unitário total de material",{"$nulls":5},{"$f":"SUM(J224:J225)","v":0}]
[null,"D - ATIVIDADES AUXILIARES",null,"Quantidade","Unidade",null,"Custo Unitário","Custo Unitário"]
[null,"-",0,0,"-",null,0,null,null,{"$f":"D228*G228","v":0}]
[null,"-",0,0,"-",null,0,null,null,{"$f":"D229*G229","v":0}]
[null,null,null,"Custo total de atividades auxiliares",{"$nulls":5},{"$f":"SUM(J228:J229)","v":0}]
[{"$nulls":7},"Subtotal",null,{"$f":"J220+J226+J230+J221+J222","v":6.7431586211390595}]
[null,"E - TEMPO FIXO",null,"Código","Quantidade","Unidade",null,"Custo Unitário","Custo Unitário"]
[null,"-",0,"-",0,"t",null,0,null,{"$f":"ROUNDDOWN(E233*H233,4)","v":0}]
[null,"-",0,"-",0,"t",null,0,null,{"$f":"ROUNDDOWN(E234*H234,4)","v":0}]
[null,null,null,"Custo unitário total de tempo fixo",{"$nulls":5},{"$f":"SUM(J233:J234)","v":0}]
[null,"F - MOMENTO DE TRANSPORTE",null,"Quantidade","Unidade","DMT",null,null,null,"Custo Unitário"]
[{"$nulls":5},"LN","RP","P"]
[null,"-",0,null,"tkm","5914449","5914464","5914479"]
[null,"-",0,null,"tkm","5914449","5914464","5914479"]
[null,null,null,"Custo unitário total de transporte"]
[{"$nulls":5},"Custo unitário direto total",null,null,null,{"$f":"TRUNC(J231+J235,2)","v":6.74}]
[null,"Obs."]
[]
[9,"1ª/GRD",{"$nulls":8},{"$f":"J284","v":1.54}]
[null,"OBRA:","PAVIMENTAÇÃO ASFÁLTICA EM CBUQ - VIAS URBANAS DIVERSAS - BAIRRO MAJOR SALVO (CORINTO / MG)"]
[null,"Custo Unitário de Referência",null,null,"Minas Gerais"]
[{"$nulls":4}," Abril/2025",null,null,"Produção da equipe ",672.8,{"$f":"VLOOKUP(A244,ORÇAMENTO!$A$10:$L$41,7,1)","v":"M2"}]
[null,4011209,"REGULARIZAÇÃO E COMPACTAÇÃO DO SUBLEITO ",{"$nulls":5},"Valores em reais (R$)"]
[null,"A - EQUIPAMENTOS",null,"Quantidade","Utilização",null,"Custo Horário",null,null,"Custo"]
[{"$nulls":4},"Operativa","Improdutiva","Produtivo","Improdutivo",null,"Horário Total"]
[null,"E9571","Caminhão tanque com capacidade de 10.000 l - 188 kW",1,0.61,0.39,323.59019999999998,80.173299999999998,null,{"$f":"D251*(E251*G251+F251*H251)","v":228.65760899999998}]
[null,"E9518","Grade de 24 discos rebocável de D = 60 cm (24\")",1,0.41,0.59,4.9436,3.4426000000000001,null,{"$f":"D252*(E252*G252+F252*H252)","v":4.0580099999999995}]
[null,"E9524","Motoniveladora - 93 kW",1,0.43,0.56999999999999995,288.51479999999998,125.7629,null,195.74621699999997]
[null,"E9762","Rolo compactador de pneus autopropelido de 27 t - 85 kW",1,0.96,0.04,255.65049999999999,124.5621,null,250.40696399999999]
[null,"E9685","Rolo compactador pé de carneiro vibratório autopropelido por pneus de 11,6 t - 82 kW",1,1,0,225.9264,101.55289999999999,null,225.9264]
[null,"E9577","Trator agrícola sobre pneus - 77 kW",1,0.41,0.59,152.69229999999999,55.394399999999997,null,95.286538999999991]
[{"$nulls":7},"Custo horário total de equipamentos",null,{"$f":"SUM(J251:J256)","v":1000.081739}]
[null,"B - MÃO DE OBRA",null,"Quantidade","Unidade",null,"Custo Horário","Custo Horário Total"]
[null,"P9824","Servente",1,"h",null,21.3355,null,null,{"$f":"D259*G259","v":21.3355}]
[null,"-",null,0,0,null,0,null,null,{"$f":"D260*G260","v":0}]
[null,null,null,"Custo horário total de mão de obra",{"$nulls":5},{"$f":"SUM(J259:J260)","v":21.3355}]
[null,null,null,"Custo horário total de execução",{"$nulls":5},{"$f":"J257+J261","v":1021.417239}]
[null,null,null,"Custo unitário de execução",{"$nulls":5},{"$f":"J262/I247","v":1.5181587975624258}]
[{"$nulls":7},"Custo do FIC",null,3.1E-2]
[{"$nulls":7},"Custo do FIT",null,0]
[null,"C - MATERIAL",null,"Quantidade","Unidade",null,"Preço Unitário","Custo Unitário"]
[null,"-",0,null,"-",null,0,null,null,{"$f":"D267*G267","v":0}]
[null,"-",0,null,"-",null,0,null,null,{"$f":"D268*G268","v":0}]
[null,null,null,"Custo unitário total de material",{"$nulls":5},{"$f":"SUM(J267:J268)","v":0}]
[null,"D - ATIVIDADES AUXILIARES",null,"Quantidade","Unidade",null,"Custo Unitário","Custo Unitário"]
[null,"-",0,0,"-",null,0,null,null,{"$f":"D271*G271","v":0}]
[null,"-",0,0,"-",null,0,null,null,{"$f":"D272*G272","v":0}]
[null,null,null,"Custo total de atividades auxiliares",{"$nulls":5},{"$f":"SUM(J271:J272)","v":0}]
[{"$nulls":7},"Subtotal",null,{"$f":"J263+J269+J273+J264+J265","v":1.5491587975624257}]
[null,"E - TEMPO FIXO",null,"Código","Quantidade","Unidade",null,"Custo Unitário","Custo Unitário"]
[null,"-",0,"-",0,"t",null,0,null,{"$f":"ROUNDDOWN(E276*H276,4)","v":0}]
[null,"-",0,"-",0,"t",null,0,null,{"$f":"ROUNDDOWN(E277*H277,4)","v":0}]
[null,null,null,"Custo unitário total de tempo fixo",{"$nulls":5},{"$f":"SUM(J276:J277)","v":0}]
[null,"F - MOMENTO DE TRANSPORTE",null,"Quantidade","Unidade","DMT",null,null,null,"Custo Unitário"]
[{"$nulls":5},"LN","RP","P"]
[null,"-",0,null,"tkm","5914449","5914464","5914479"]
[null,"-",0,null,"tkm","5914449","5914464","5914479"]
[null,null,null,"Custo unitário total de transporte"]
[{"$nulls":5},"Custo unitário direto total",null,null,null,{"$f":"TRUNC(J274+J278,2)","v":1.54}]
[null,"Obs."]
[]
[{"$f":"A244+1","v":10},"1ª/GRD",{"$nulls":8},{"$f":"J325","v":115.23}]
[null,"OBRA:","PAVIMENTAÇÃO ASFÁLTICA EM CBUQ - VIAS URBANAS DIVERSAS - BAIRRO MAJOR SALVO (CORINTO / MG)"]
[null,"Custo Unitário de Referência",null,null,"Minas Gerais"]
[{"$nulls":4}," Abril/2025",null,null,"Produção da equipe ",113.18,{"$f":"VLOOKUP(A287,ORÇAMENTO!$A$10:$L$41,7,1)","v":"M3"}]
[null,4011276,"EXECUÇÃO E COMPACTAÇÃO DE BASE E OU SUB BASE PARA PAVIMENTAÇÃO DE BICA CORRIDA - EXCLUSIVE TRANSPORTE",{"$nulls":5},"Valores em reais (R$)"]
[null,"A - EQUIPAMENTOS",null,"Quantidade","Utilização",null,"Custo Horário",null,null,"Custo"]
[{"$nulls":4},"Operativa","Improdutiva","Produtivo","Improdutivo",null,"Horário Total"]
[null,"E9571","Caminhão tanque com capacidade de 10.000 l - 188 kW",1,0.34,0.66,323.59019999999998,80.173299999999998,null,{"$f":"D294*(E294*G294+F294*H294)","v":162.935046}]
[null,"E9514","Distribuidor de agregados sobre pneus autopropelido - 130 kW",1,1,0,292.00130000000001,107.6279,null,{"$f":"D295*(E295*G295+F295*H295)","v":292.00130000000001}]
[null,"E9762","Rolo compactador de pneus autopropelido de 27 t - 85 kW",1,0.97,0.03,255.65049999999999,124.5621,null,{"$f":"D296*(E296*G296+F296*H296)","v":251.71784799999998}]
[null,"E9530","Rolo compactador liso vibratório autopropelido por pneus de 11 t - 97 kW",1,0.79,0.21,259.53739999999999,112.9601,null,228.756167]
[{"$nulls":7},"Custo horário total de equipamentos",null,{"$f":"SUM(J294:J297)","v":935.41036099999997}]
[null,"B - MÃO DE OBRA",null,"Quantidade","Unidade",null,"Custo Horário","Custo Horário Total"]
[null,"P9824","Servente",1,"h",null,21.3355,null,null,{"$f":"D300*G300","v":21.3355}]
[null,"-",0,0,0,null,0,null,null,{"$f":"D301*G301","v":0}]
[null,null,null,"Custo horário total de mão de obra",{"$nulls":5},{"$f":"SUM(J300:J301)","v":21.3355}]
[null,null,null,"Custo horário total de execução",{"$nulls":5},{"$f":"J298+J302","v":956.74586099999999}]
[null,null,null,"Custo unitário de execução",{"$nulls":5},{"$f":"J303/I290","v":8.4533120781056716}]
[{"$nulls":7},"Custo do FIC",null,5.7599999999999998E-2]
[{"$nulls":7},"Custo do FIT",null,0]
[null,"C - MATERIAL",null,"Quantidade","Unidade",null,"Preço Unitário","Custo Unitário"]
[null,"-",0,null,"-",null,0,null,null,{"$f":"D308*G308","v":0}]
[null,"-",0,null,"-",null,0,null,null,{"$f":"D309*G309","v":0}]
[null,null,null,"Custo unitário total de material",{"$nulls":5},{"$f":"SUM(J308:J309)","v":0}]
[null,"D - ATIVIDADES AUXILIARES",null,"Quantidade","Unidade",null,"Custo Unitário","Custo Unitário"]
[null,6416040,"Usinagem de brita graduada com brita comercial em usina de 300 t/h",1,"m³",null,99,"COTAÇÃO",null,{"$f":"D312*G312","v":99}]
[null,"-",0,0,"-",null,0,null,null,{"$f":"D313*G313","v":0}]
[null,null,null,"Custo total de atividades auxiliares",{"$nulls":5},{"$f":"SUM(J312:J313)","v":99}]
[{"$nulls":7},"Subtotal",null,{"$f":"J304+J310+J314+J305+J306","v":107.51091207810566}]
[null,"E - TEMPO FIXO",null,"Código","Quantidade","Unidade",null,"Custo Unitário","Custo Unitário"]
[null,6416040,"Usinagem de brita graduada com brita comercial em usina de 300 t/h",5914652,2.2000000000000002,"t",null,3.51,null,{"$f":"ROUNDDOWN(E317*H317,4)","v":7.7220000000000004}]
[null,"-",0,"-",null,"t",null,0,null,{"$f":"ROUNDDOWN(E318*H318,4)","v":0}]
[null,null,null,"Custo unitário total de tempo fixo",{"$nulls":5},{"$f":"SUM(J317:J318)","v":7.7220000000000004}]
[null,"F - MOMENTO DE TRANSPORTE",null,"Quantidade","Unidade","DMT",null,null,null,"Custo Unitário"]
[{"$nulls":5},"LN","RP","P"]
[null,6416040,"Usinagem de brita graduada com brita comercial em usina de 300 t/h",2.2000000000000002,"tkm","5914359","5914374","5914389"]
[null,"-",0,0,"tkm"]
[null,null,null,"Custo unitário total de transporte"]
[{"$nulls":5},"Custo unitário direto total",null,null,null,{"$f":"TRUNC(J315+J319,2)","v":115.23}]
[null,"Obs."]
[]
[12,"1ª/GRD",{"$nulls":8},{"$f":"J364","v":0.4}]
[null,"OBRA:","PAVIMENTAÇÃO ASFÁLTICA EM CBUQ - VIAS URBANAS DIVERSAS - BAIRRO MAJOR SALVO (CORINTO / MG)"]
[null,"Custo Unitário de Referência",null,null,"Minas Gerais"]
[{"$nulls":4}," Abril/2025",null,null,"Produção da equipe ",1038.46,{"$f":"VLOOKUP(A328,ORÇAMENTO!$A$10:$L$41,7,1)","v":"M2"}]
[null,4011352,"IMPRIMAÇÃO COM EMULSÃO ASFÁLTICA (EAI)",{"$nulls":5},"Valores em reais (R$)"]
[null,"A - EQUIPAMENTOS",null,"Quantidade","Utilização",null,"Custo Horário",null,null,"Custo"]
[{"$nulls":4},"Operativa","Improdutiva","Produtivo","Improdutivo",null,"Horário Total"]
[null,"E9509","Caminhão tanque distribuidor de asfalto com capacidade de 6.000 l - 7 kW/136 kW",1,1,0,261.03050000000002,72.388300000000001,null,{"$f":"D335*(E335*G335+F335*H335)","v":261.03050000000002}]
[null,"E9558","Tanque de estocagem de asfalto com capacidade de 30.000 l",2,1,0,56.138500000000001,38.346699999999998,null,{"$f":"D336*(E336*G336+F336*H336)","v":112.277}]
[{"$nulls":7},"Custo horário total de equipamentos",null,{"$f":"SUM(J335:J336)","v":373.3075}]
[null,"B - MÃO DE OBRA",null,"Quantidade","Unidade",null,"Custo Horário","Custo Horário Total"]
[null,"P9824","Servente",2,"h",null,21.3355,null,null,{"$f":"D339*G339","v":42.670999999999999}]
[null,"-",{"$nulls":7},{"$f":"D340*G340","v":0}]
[null,null,null,"Custo horário total de mão de obra",{"$nulls":5},{"$f":"SUM(J339:J340)","v":42.670999999999999}]
[null,null,null,"Custo horário total de execução",{"$nulls":5},{"$f":"J337+J341","v":415.9785}]
[null,null,null,"Custo unitário de execução",{"$nulls":5},{"$f":"J342/I331","v":0.40057248232960341}]
[{"$nulls":7},"Custo do FIC",null,1.4E-3]
[{"$nulls":7},"Custo do FIT",null,0]
[null,"C - MATERIAL",null,"Quantidade","Unidade",null,"Preço Unitário","Custo Unitário"]
[null,"M2092","Emulsão asfáltica para imprimação",1.2999999999999999E-3,"t",null,0,"FORNECIMENTO COM BDI DIFERENCIADO",null,{"$f":"D347*G347","v":0}]
[null,"-",0,89.28,"-",null,0,null,null,{"$f":"D348*G348","v":0}]
[null,null,null,"Custo unitário total de material",{"$nulls":5},{"$f":"SUM(J347:J348)","v":0}]
[null,"D - ATIVIDADES AUXILIARES",null,"Quantidade","Unidade",null,"Custo Unitário","Custo Unitário"]
[null,"-",0,0,"-",null,0,null,null,{"$f":"D351*G351","v":0}]
[null,"-",0,0,"-",null,0,null,null,{"$f":"D352*G352","v":0}]
[null,null,null,"Custo total de atividades auxiliares",{"$nulls":5},{"$f":"SUM(J351:J352)","v":0}]
[{"$nulls":7},"Subtotal",null,{"$f":"J343+J349+J353+J344+J345","v":0.40197248232960342}]
[null,"E - TEMPO FIXO",null,"Código","Quantidade","Unidade",null,"Custo Unitário","Custo Unitário"]
[null,"-",0,"-",0,"t",null,0,null,{"$f":"ROUNDDOWN(E356*H356,4)","v":0}]
[null,"-",0,"-",0,"t",null,0,null,{"$f":"ROUNDDOWN(E357*H357,4)","v":0}]
[null,null,null,"Custo unitário total de tempo fixo",{"$nulls":5},{"$f":"SUM(J356:J357)","v":0}]
[null,"F - MOMENTO DE TRANSPORTE",null,"Quantidade","Unidade","DMT",null,null,null,"Custo Unitário"]
[{"$nulls":5},"LN","RP","P"]
[null,"-",0,null,"tkm"]
[null,"-",0,null,"tkm"]
[null,null,null,"Custo unitário total de transporte"]
[{"$nulls":5},"Custo unitário direto total",null,null,null,{"$f":"TRUNC(J354+J358,2)","v":0.4}]
[null,"Obs."]
[]
[{"$f":"A328+1","v":13},"1ª/GRD",{"$nulls":8},{"$f":"J403","v":0.27}]
[null,"OBRA:","PAVIMENTAÇÃO ASFÁLTICA EM CBUQ - VIAS URBANAS DIVERSAS - BAIRRO MAJOR SALVO (CORINTO / MG)"]
[null,"Custo Unitário de Referência",null,null,"Minas Gerais"]
[{"$nulls":4}," Abril/2025",null,null,"Produção da equipe ",1500,{"$f":"VLOOKUP(A367,ORÇAMENTO!$A$10:$L$41,7,1)","v":"M2"}]
[null,4011353,"PINTURA DE LIGAÇÃO COM EMULSÃO ASFÁLTICA RR-1C",{"$nulls":5},"Valores em reais (R$)"]
[null,"A - EQUIPAMENTOS",null,"Quantidade","Utilização",null,"Custo Horário",null,null,"Custo"]
[{"$nulls":4},"Operativa","Improdutiva","Produtivo","Improdutivo",null,"Horário Total"]
[null,"E9509","Caminhão tanque distribuidor de asfalto com capacidade de 6.000 l - 7 kW/136 kW",1,1,0,261.03050000000002,72.388300000000001,null,{"$f":"D374*(E374*G374+F374*H374)","v":261.03050000000002}]
[null,"E9558","Tanque de estocagem de asfalto com capacidade de 30.000 l",2,1,0,56.138500000000001,38.346699999999998,null,{"$f":"D375*(E375*G375+F375*H375)","v":112.277}]
[{"$nulls":7},"Custo horário total de equipamentos",null,{"$f":"SUM(J374:J375)","v":373.3075}]
[null,"B - MÃO DE OBRA",null,"Quantidade","Unidade",null,"Custo Horário","Custo Horário Total"]
[null,"P9824","Servente",2,"h",null,21.3355,null,null,{"$f":"D378*G378","v":42.670999999999999}]
[null,"-",{"$nulls":7},{"$f":"D379*G379","v":0}]
[null,null,null,"Custo horário total de mão de obra",{"$nulls":5},{"$f":"SUM(J378:J379)","v":42.670999999999999}]
[null,null,null,"Custo horário total de execução",{"$nulls":5},{"$f":"J376+J380","v":415.9785}]
[null,null,null,"Custo unitário de execução",{"$nulls":5},{"$f":"J381/I370","v":0.27731899999999998}]
[{"$nulls":7},"Custo do FIC",null,8.9999999999999998E-4]
[{"$nulls":7},"Custo do FIT",null,0]
[null,"C - MATERIAL",null,"Quantidade","Unidade",null,"Preço Unitário","Custo Unitário"]
[null,"M1946","Emulsão asfáltica - RR-1C",4.4999999999999999E-4,"t",null,0,"FORNECIMENTO COM BDI DIFERENCIADO",null,{"$f":"D386*G386","v":0}]
[null,"-",0,null,"-",null,0,null,null,{"$f":"D387*G387","v":0}]
[null,null,null,"Custo unitário total de material",{"$nulls":5},{"$f":"SUM(J386:J387)","v":0}]
[null,"D - ATIVIDADES AUXILIARES",null,"Quantidade","Unidade",null,"Custo Unitário","Custo Unitário"]
[null,"-",0,0,"-",null,0,null,null,{"$f":"D390*G390","v":0}]
[null,"-",0,0,"-",null,0,null,null,{"$f":"D391*G391","v":0}]
[null,null,null,"Custo total de atividades auxiliares",{"$nulls":5},{"$f":"SUM(J390:J391)","v":0}]
[{"$nulls":7},"Subtotal",null,{"$f":"J382+J388+J392+J383+J384","v":0.27821899999999999}]
[null,"E - TEMPO FIXO",null,"Código","Quantidade","Unidade",null,"Custo Unitário","Custo Unitário"]
[null,"-",0,"-",0,"t",null,0,null,{"$f":"ROUNDDOWN(E395*H395,4)","v":0}]
[null,"-",0,"-",0,"t",null,0,null,{"$f":"ROUNDDOWN(E396*H396,4)","v":0}]
[null,null,null,"Custo unitário total de tempo fixo",{"$nulls":5},{"$f":"SUM(J395:J396)","v":0}]
[null,"F - MOMENTO DE TRANSPORTE",null,"Quantidade","Unidade","DMT",null,null,null,"Custo Unitário"]
[{"$nulls":5},"LN","RP","P"]
[null,"-",0,null,"tkm"]
[null,"-",0,null,"tkm"]
[null,null,null,"Custo unitário total de transporte"]
[{"$nulls":5},"Custo unitário direto total",null,null,null,{"$f":"TRUNC(J393+J397,2)","v":0.27}]
[null,"Obs."]
[]
[{"$f":"A367+1","v":14},"1ª/GRD",{"$nulls":8},{"$f":"J443","v":175.46}]
[null,"OBRA:","PAVIMENTAÇÃO ASFÁLTICA EM CBUQ - VIAS URBANAS DIVERSAS - BAIRRO MAJOR SALVO (CORINTO / MG)"]
[null,"Custo Unitário de Referência",null,null,"Minas Gerais"]
[{"$nulls":4}," Abril/2025",null,null,"Produção da equipe ",99.6,{"$f":"VLOOKUP(A406,ORÇAMENTO!$A$10:$L$41,7,1)","v":"T"}]
[null,4011463,"EXECUÇÃO DE PAVIMENTO COM APLICAÇÃO DE CONCRETO ASFÁLTICO USINADO A QUENTE (CBUQ), CAMADA DE ROLAMENTO - EXCLUSIVE TRANSPORTE",{"$nulls":5},"Valores em reais (R$)"]
[null,"A - EQUIPAMENTOS",null,"Quantidade","Utilização",null,"Custo Horário",null,null,"Custo"]
[{"$nulls":4},"Operativa","Improdutiva","Produtivo","Improdutivo",null,"Horário Total"]
[null,"E9762","Rolo compactador de pneus autopropelido de 27 t - 85 kW",1,0.71,0.28999999999999998,255.65049999999999,124.5621,null,{"$f":"D413*(E413*G413+F413*H413)","v":217.63486399999999}]
[null,"E9681","Rolo compactador liso tandem vibratório autopropelido de 10,4 t - 82 kW",1,0.82,0.18,296.77460000000002,113.3899,null,{"$f":"D414*(E414*G414+F414*H414)","v":263.765354}]
[null,"E9545","Vibroacabadora de asfalto sobre esteiras - 97 kW",1,1,0,359.27379999999999,154.22659999999999,null,{"$f":"D415*(E415*G415+F415*H415)","v":359.27379999999999}]
[{"$nulls":7},"Custo horário total de equipamentos",null,{"$f":"SUM(J413:J415)","v":840.67401799999993}]
[null,"B - MÃO DE OBRA",null,"Quantidade","Unidade",null,"Custo Horário","Custo Horário Total"]
[null,"P9824","Servente",8,"h",null,21.3355,null,null,{"$f":"D418*G418","v":170.684}]
[null,"-",0,null,0,null,0,null,null,{"$f":"D419*G419","v":0}]
[null,null,null,"Custo horário total de mão de obra",{"$nulls":5},{"$f":"SUM(J418:J419)","v":170.684}]
[null,null,null,"Custo horário total de execução",{"$nulls":5},{"$f":"J416+J420","v":1011.3580179999999}]
[null,null,null,"Custo unitário de execução",{"$nulls":5},{"$f":"J421/I409","v":10.154196967871485}]
[{"$nulls":7},"Custo do FIC",null,3.4500000000000003E-2]
[{"$nulls":7},"Custo do FIT",null,0]
[null,"C - MATERIAL",null,"Quantidade","Unidade",null,"Preço Unitário","Custo Unitário"]
[null,"-",0,null,"-",null,0,null,null,{"$f":"D426*G426","v":0}]
[null,"-",0,null,"-",null,0,null,null,{"$f":"D427*G427","v":0}]
[null,null,null,"Custo unitário total de material",{"$nulls":5},{"$f":"SUM(J426:J427)","v":0}]
[null,"D - ATIVIDADES AUXILIARES",null,"Quantidade","Unidade",null,"Custo Unitário","Custo Unitário"]
[null,6416078,"Usinagem de concreto asfáltico - faixa C-12,5 - areia e brita comerciais",1,"t",null,157.22819719476303,"CPU-AUXILIAR",null,{"$f":"D430*G430","v":157.22819719476303}]
[null,"-",0,0,"-",null,0,null,null,{"$f":"D431*G431","v":0}]
[null,null,null,"Custo total de atividades auxiliares",{"$nulls":5},{"$f":"SUM(J430:J431)","v":157.22819719476303}]
[{"$nulls":7},"Subtotal",null,{"$f":"J422+J428+J432+J423+J424","v":167.41689416263452}]
[null,"E - TEMPO FIXO",null,"Código","Quantidade","Unidade",null,"Custo Unitário","Custo Unitário"]
[null,6416078,"Usinagem de concreto asfáltico - faixa C-12,5 - areia e brita comerciais",5914649,1,"t",null,8.0500000000000007,null,{"$f":"ROUNDDOWN(E435*H435,4)","v":8.0500000000000007}]
[null,"-",0,"-",0,"t",null,0,null,{"$f":"ROUNDDOWN(E436*H436,4)","v":0}]
[null,null,null,"Custo unitário total de tempo fixo",{"$nulls":5},{"$f":"SUM(J435:J436)","v":8.0500000000000007}]
[null,"F - MOMENTO DE TRANSPORTE",null,"Quantidade","Unidade","DMT",null,null,null,"Custo Unitário"]
[{"$nulls":5},"LN","RP","P"]
[null,6416078,"Usinagem de concreto asfáltico - faixa C-12,5 - areia e brita comerciais",1,"tkm"]
[null,"-",0,0,"tkm"]
[null,null,null,"Custo unitário total de transporte"]
[{"$nulls":5},"Custo unitário direto total",null,null,null,{"$f":"TRUNC(J433+J437,2)","v":175.46}]
[null,"Obs."]
[]
[null,"1ª/GRD",{"$nulls":8},{"$f":"J497","v":157.22819719476303}]
[null,"OBRA:","PAVIMENTAÇÃO ASFÁLTICA EM CBUQ - VIAS URBANAS DIVERSAS - BAIRRO MAJOR SALVO (CORINTO / MG)"]
[null,"Custo Unitário de Referência - Auxiliar",null,null,"Minas Gerais"]
[{"$nulls":4}," Abril/2025",null,null,"Produção da equipe ",99.6,"t"]
[null,6416078,"Usinagem de concreto asfáltico - faixa C - 12,5 - areia e brita comerciais",{"$nulls":5},"Valores em reais (R$)"]
[null,"A - EQUIPAMENTOS",null,"Quantidade","Utilização",null,"Custo Horário",null,null,"Custo"]
[{"$nulls":4},"Operativa","Improdutiva","Produtivo","Improdutivo",null,"Horário Total"]
[null,"E9559","Aquecedor de fluido térmico - 12 kW",1,1,0,70.491399999999999,40.1297,null,{"$f":"D453*(E453*G453+F453*H453)","v":70.491399999999999}]
[null,"E9584","Carregadeira de pneus com capacidade de 1,72 m³ - 113 kW",1,0.86,0.14000000000000001,207.59360000000001,103.7398,null,{"$f":"D454*(E454*G454+F454*H454)","v":193.054068}]
[null,"E9021","Grupo gerador - 456 kVA",1,1,0,415.94510000000002,22.186399999999999,null,415.94510000000002]
[null,"E9558","Tanque de estocagem de asfalto com capacidade de 30.000 l",2,1,0,56.138500000000001,38.346699999999998,null,112.277]
[null,"E9689","Usina de asfalto a quente gravimétrica com capacidade de 100/140 t/h - 260 kW",1,1,0,1239.9634000000001,657.78120000000001,null,{"$f":"D457*(E457*G457+F457*H457)","v":1239.9634000000001}]
[{"$nulls":7},"Custo horário total de equipamentos",null,{"$f":"SUM(J453:J457)","v":2031.7309680000003}]
[null,"B - MÃO DE OBRA",null,"Quantidade","Unidade",null,"Custo Horário","Custo Horário Total"]
[null,"P9824","Servente",4,"h",null,21.3355,null,null,{"$f":"D460*G460","v":85.341999999999999}]
[null,null,null,"Custo horário total de mão de obra",{"$nulls":5},{"$f":"SUM(J460:J460)","v":85.341999999999999}]
[null,null,null,"Custo horário total de execução",{"$nulls":5},{"$f":"J458+J461","v":2117.0729680000004}]
[null,null,null,"Custo unitário de execução",{"$nulls":5},{"$f":"J462/I449","v":21.255752690763057}]
[{"$nulls":7},"Custo do FIC",null,0]
[{"$nulls":7},"Custo do FIT",null,0]
[null,"C - MATERIAL",null,"Quantidade","Unidade",null,"Preço Unitário","Custo Unitário"]
[null,"M0028","Areia média",2.7009999999999999E-2,"m³",null,158.15639999999999,null,null,{"$f":"D467*G467","v":4.2718043639999994}]
[null,"M0005","Brita 0",9.0029999999999999E-2,"m³",null,116.2,null,null,{"$f":"D468*G468","v":10.461486000000001}]
[null,"M0191","Brita 1",3.2149999999999998E-2,"m³",null,116.2,null,null,3.73583]
[null,"M0344","Cal hidratada - a granel",14.4636,"kg",null,0.61650000000000005,null,null,8.9168094]
[null,"M1943","Cimento asfáltico de petróleo - CAP 50/70",5.5449999999999999E-2,"t",null,0,"FORNECIMENTO COM BDI DIFERENCIADO",null,0]
[null,"M1941","Óleo tipo A1",8,"l",null,6.3849,null,null,51.0792]
[null,"M1103","Pedrisco",0.1479,"m³",null,176.94059999999999,null,null,26.16951474]
[null,"M1135","Pó de pedra",0.33631,"m³",null,90,null,null,30.267900000000001]
[null,null,null,"Custo unitário total de material",{"$nulls":5},{"$f":"SUM(J467:J474)","v":134.90254450399999}]
[null,"D - ATIVIDADES AUXILIARES",null,"Quantidade","Unidade",null,"Custo Unitário","Custo Unitário"]
[null,"-",0,"-","-",null,"-"]
[null,null,null,"Custo total de atividades auxiliares",{"$nulls":5},{"$f":"SUM(J477:J477)","v":0}]
[{"$nulls":7},"Subtotal",null,{"$f":"J463+J475+J478+J464+J465","v":156.15829719476304}]
[null,"E - TEMPO FIXO",null,"Código","Quantidade","Unidade",null,"Custo Unitário","Custo Unitário"]
[null,"M0028","Areia média",5914647,4.052E-2,"t",null,1.83,null,{"$f":"ROUNDDOWN(E481*H481,4)","v":7.4099999999999999E-2}]
[null,"M0005","Brita 0",5914647,0.13505,"t",null,1.83,null,0.24709999999999999]
[null,"M0191","Brita 1",5914647,4.8230000000000002E-2,"t",null,1.83,null,8.8200000000000001E-2]
[null,"M0344","Cal hidratada - a granel",5914363,1.4460000000000001E-2,"t",null,17.61,null,0.25459999999999999]
[null,"M1103","Pedrisco",5914647,0.22184999999999999,"t",null,1.83,null,{"$f":"ROUNDDOWN(E485*H485,4)","v":0.40589999999999998}]
[null,"M1135","Pó de pedra",5914647,0.50446999999999997,"t",null,1.83,null,0.92310000000000003]
[null,null,null,"Custo unitário total de tempo fixo",{"$nulls":5},{"$f":"SUM(J481:J485)","v":1.0698999999999999}]
[null,"F - MOMENTO DE TRANSPORTE",null,"Quantidade","Unidade","DMT",null,null,null,"Custo Unitário"]
[{"$nulls":5},"LN","RP","P"]
[null,"M0028","Areia média",4.052E-2,"tkm",5914359,5914374,5914389]
[null,"M0005","Brita 0",0.13505,"tkm",5914359,5914374,5914389]
[null,"M0191","Brita 1",4.8230000000000002E-2,"tkm",5914359,5914374,5914389]
[null,"M0344","Cal hidratada - a granel",1.4460000000000001E-2,"tkm",5914364,5914365,5914366]
[null,"M1103","Pedrisco",0.22184999999999999,"tkm",5914359,5914374,5914389]
[null,"M1135","Pó de pedra",0.50446999999999997,"tkm",5914359,5914374,5914389]
[null,null,null,"Custo unitário total de transporte"]
[{"$nulls":5},"Custo unitário direto total",null,null,null,{"$f":"J479+J487","v":157.22819719476303}]
[null,"Obs."]
[]
[{"$f":"A406+1","v":15},"1ª/GRD",{"$nulls":8},{"$f":"J536","v":0.65}]
[null,"OBRA:","PAVIMENTAÇÃO ASFÁLTICA EM CBUQ - VIAS URBANAS DIVERSAS - BAIRRO MAJOR SALVO (CORINTO / MG)"]
[null,"Custo Unitário de Referência",null,null,"Minas Gerais"]
[{"$nulls":4}," Abril/2025",null,null,"Produção da equipe ",470.61,{"$f":"VLOOKUP(A500,ORÇAMENTO!$A$10:$L$41,7,1)","v":"TXKM"}]
[null,5915321,"TRANSPORTE COM CAMINHÃO BASCULANTE, EM RODOVIA PAVIMENTADA",{"$nulls":5},"Valores em reais (R$)"]
[null,"A - EQUIPAMENTOS",null,"Quantidade","Utilização",null,"Custo Horário",null,null,"Custo"]
[{"$nulls":4},"Operativa","Improdutiva","Produtivo","Improdutivo",null,"Horário Total"]
[null,"E9667","Caminhão basculante com capacidade de 14 m³ - 210 kW",1,1,0,309.83940000000001,90.412199999999999,null,{"$f":"D507*(E507*G507+F507*H507)","v":309.83940000000001}]
[null,"-",0,null,null,null,0,0,null,{"$f":"D508*(E508*G508+F508*H508)","v":0}]
[{"$nulls":7},"Custo horário total de equipamentos",null,{"$f":"SUM(J507:J508)","v":309.83940000000001}]
[null,"B - MÃO DE OBRA",null,"Quantidade","Unidade",null,"Custo Horário","Custo Horário Total"]
[null,"-",0,null,0,null,0,null,null,{"$f":"D511*G511","v":0}]
[null,"-",0,null,0,null,0,null,null,{"$f":"D512*G512","v":0}]
[null,null,null,"Custo horário total de mão de obra",{"$nulls":5},{"$f":"SUM(J511:J512)","v":0}]
[null,null,null,"Custo horário total de execução",{"$nulls":5},{"$f":"J509+J513","v":309.83940000000001}]
[null,null,null,"Custo unitário de execução",{"$nulls":5},{"$f":"J514/I503","v":0.65837827500478108}]
[{"$nulls":7},"Custo do FIC",null,0]
[{"$nulls":7},"Custo do FIT",null,0]
[null,"C - MATERIAL",null,"Quantidade","Unidade",null,"Preço Unitário","Custo Unitário"]
[null,"-",0,0,"-",null,0,null,null,{"$f":"D519*G519","v":0}]
[null,"-",0,0,"-",null,0,null,null,{"$f":"D520*G520","v":0}]
[null,null,null,"Custo unitário total de material",{"$nulls":5},{"$f":"SUM(J519:J520)","v":0}]
[null,"D - ATIVIDADES AUXILIARES",null,"Quantidade","Unidade",null,"Custo Unitário","Custo Unitário"]
[null,"-",0,0,"-",null,0,null,null,{"$f":"D523*G523","v":0}]
[null,"-",0,0,"-",null,0,null,null,{"$f":"D524*G524","v":0}]
[null,null,null,"Custo total de atividades auxiliares",{"$nulls":5},{"$f":"SUM(J523:J524)","v":0}]
[{"$nulls":7},"Subtotal",null,{"$f":"J515+J521+J525+J516+J517","v":0.65837827500478108}]
[null,"E - TEMPO FIXO",null,"Código","Quantidade","Unidade",null,"Custo Unitário","Custo Unitário"]
[null,"-",0,"-",0,"t",null,0,null,{"$f":"ROUNDDOWN(E528*H528,4)","v":0}]
[null,"-",0,"-",0,"t",null,0,null,{"$f":"ROUNDDOWN(E529*H529,4)","v":0}]
[null,null,null,"Custo unitário total de tempo fixo",{"$nulls":5},{"$f":"SUM(J528:J529)","v":0}]
[null,"F - MOMENTO DE TRANSPORTE",null,"Quantidade","Unidade","DMT",null,null,null,"Custo Unitário"]
[{"$nulls":5},"LN","RP","P"]
[null,"-",0,0,"tkm"]
[null,"-",0,0,"tkm"]
[null,null,null,"Custo unitário total de transporte"]
[{"$nulls":5},"Custo unitário direto total",null,null,null,{"$f":"TRUNC(J526+J530,2)","v":0.65}]
[null,"Obs."]
[]
[16,"1ª/GRD",{"$nulls":8},{"$f":"J575","v":0.72}]
[null,"OBRA:","PAVIMENTAÇÃO ASFÁLTICA EM CBUQ - VIAS URBANAS DIVERSAS - BAIRRO MAJOR SALVO (CORINTO / MG)"]
[null,"Custo Unitário de Referência",null,null,"Minas Gerais"]
[{"$nulls":4}," Abril/2025",null,null,"Produção da equipe ",435.75,{"$f":"VLOOKUP(A539,ORÇAMENTO!$A$10:$L$41,7,1)","v":"TXKM"}]
[null,5915320,"TRANSPORTE COM CAMINHÃO BASCULANTE, RODOVIA EM REVESTIMENTO PRIMÁRIO",{"$nulls":5},"Valores em reais (R$)"]
[null,"A - EQUIPAMENTOS",null,"Quantidade","Utilização",null,"Custo Horário",null,null,"Custo"]
[{"$nulls":4},"Operativa","Improdutiva","Produtivo","Improdutivo",null,"Horário Total"]
[null,"E9667","Caminhão basculante com capacidade de 14 m³ - 210 kW",1,1,0,309.83940000000001,90.412199999999999,null,{"$f":"D546*(E546*G546+F546*H546)","v":309.83940000000001}]
[null,"-",0,null,null,null,0,0,null,{"$f":"D547*(E547*G547+F547*H547)","v":0}]
[{"$nulls":7},"Custo horário total de equipamentos",null,{"$f":"SUM(J546:J547)","v":309.83940000000001}]
[null,"B - MÃO DE OBRA",null,"Quantidade","Unidade",null,"Custo Horário","Custo Horário Total"]
[null,"-",0,null,0,null,0,null,null,{"$f":"D550*G550","v":0}]
[null,"-",0,null,0,null,0,null,null,{"$f":"D551*G551","v":0}]
[null,null,null,"Custo horário total de mão de obra",{"$nulls":5},{"$f":"SUM(J550:J551)","v":0}]
[null,null,null,"Custo horário total de execução",{"$nulls":5},{"$f":"J548+J552","v":309.83940000000001}]
[null,null,null,"Custo unitário de execução",{"$nulls":5},{"$f":"J553/I542","v":0.71104853700516357}]
[{"$nulls":7},"Custo do FIC",null,1.4E-2]
[{"$nulls":7},"Custo do FIT",null,0]
[null,"C - MATERIAL",null,"Quantidade","Unidade",null,"Preço Unitário","Custo Unitário"]
[null,"-",0,0,"-",null,0,null,null,{"$f":"D558*G558","v":0}]
[null,"-",0,0,"-",null,0,null,null,{"$f":"D559*G559","v":0}]
[null,null,null,"Custo unitário total de material",{"$nulls":5},{"$f":"SUM(J558:J559)","v":0}]
[null,"D - ATIVIDADES AUXILIARES",null,"Quantidade","Unidade",null,"Custo Unitário","Custo Unitário"]
[null,"-",0,0,"-",null,0,null,null,{"$f":"D562*G562","v":0}]
[null,"-",0,0,"-",null,0,null,null,{"$f":"D563*G563","v":0}]
[null,null,null,"Custo total de atividades auxiliares",{"$nulls":5},{"$f":"SUM(J562:J563)","v":0}]
[{"$nulls":7},"Subtotal",null,{"$f":"J554+J560+J564+J555+J556","v":0.72504853700516358}]
[null,"E - TEMPO FIXO",null,"Código","Quantidade","Unidade",null,"Custo Unitário","Custo Unitário"]
[null,"-",0,"-",0,"t",null,0,null,{"$f":"ROUNDDOWN(E567*H567,4)","v":0}]
[null,"-",0,"-",0,"t",null,0,null,{"$f":"ROUNDDOWN(E568*H568,4)","v":0}]
[null,null,null,"Custo unitário total de tempo fixo",{"$nulls":5},{"$f":"SUM(J567:J568)","v":0}]
[null,"F - MOMENTO DE TRANSPORTE",null,"Quantidade","Unidade","DMT",null,null,null,"Custo Unitário"]
[{"$nulls":5},"LN","RP","P"]
[null,"-",0,0,"tkm"]
[null,"-",0,0,"tkm"]
[null,null,null,"Custo unitário total de transporte"]
[{"$nulls":5},"Custo unitário direto total",null,null,null,{"$f":"TRUNC(J565+J569,2)","v":0.72}]
[null,"Obs."]
[]
[{"$f":"A539+1","v":17},"1ª/GRD",{"$nulls":8},{"$f":"J614","v":0.74}]
[null,"OBRA:","PAVIMENTAÇÃO ASFÁLTICA EM CBUQ - VIAS URBANAS DIVERSAS - BAIRRO MAJOR SALVO (CORINTO / MG)"]
[null,"Custo Unitário de Referência",null,null,"Minas Gerais"]
[{"$nulls":4}," Abril/2025",null,null,"Produção da equipe ",241.03,{"$f":"VLOOKUP(A578,ORÇAMENTO!$A$10:$L$41,7,1)","v":"TXKM"}]
[null,5914434,"TRANSPORTE COM CAMINHÃO CARROCERIA 9T, EM VIA URBANA PREDOMINANTEMENTE PAVIMENTADA",{"$nulls":5},"Valores em reais (R$)"]
[null,"A - EQUIPAMENTOS",null,"Quantidade","Utilização",null,"Custo Horário",null,null,"Custo"]
[{"$nulls":4},"Operativa","Improdutiva","Produtivo","Improdutivo",null,"Horário Total"]
[null,"E9508","Caminhão carroceria com capacidade de 9 t - 136 kW",1,1,0,178.82759999999999,67.927099999999996,null,{"$f":"D585*(E585*G585+F585*H585)","v":178.82759999999999}]
[null,"-",0,null,null,null,0,0,null,{"$f":"D586*(E586*G586+F586*H586)","v":0}]
[{"$nulls":7},"Custo horário total de equipamentos",null,{"$f":"SUM(J585:J586)","v":178.82759999999999}]
[null,"B - MÃO DE OBRA",null,"Quantidade","Unidade",null,"Custo Horário","Custo Horário Total"]
[null,"-",0,0,0,null,0,null,null,{"$f":"D589*G589","v":0}]
[null,"-",0,0,0,null,0,null,null,{"$f":"D590*G590","v":0}]
[null,null,null,"Custo horário total de mão de obra",{"$nulls":5},{"$f":"SUM(J589:J590)","v":0}]
[null,null,null,"Custo horário total de execução",{"$nulls":5},{"$f":"J587+J591","v":178.82759999999999}]
[null,null,null,"Custo unitário de execução",{"$nulls":5},{"$f":"J592/I581","v":0.7419308799734472}]
[{"$nulls":7},"Custo do FIC",null,0]
[{"$nulls":7},"Custo do FIT",null,0]
[null,"C - MATERIAL",null,"Quantidade","Unidade",null,"Preço Unitário","Custo Unitário"]
[null,"-",0,0,"-",null,0,null,null,{"$f":"D597*G597","v":0}]
[null,"-",0,0,"-",null,0,null,null,{"$f":"D598*G598","v":0}]
[null,null,null,"Custo unitário total de material",{"$nulls":5},{"$f":"SUM(J597:J598)","v":0}]
[null,"D - ATIVIDADES AUXILIARES",null,"Quantidade","Unidade",null,"Custo Unitário","Custo Unitário"]
[null,"-",0,0,"-",null,0,null,null,{"$f":"D601*G601","v":0}]
[null,"-",0,0,"-",null,0,null,null,{"$f":"D602*G602","v":0}]
[null,null,null,"Custo total de atividades auxiliares",{"$nulls":5},{"$f":"SUM(J601:J602)","v":0}]
[{"$nulls":7},"Subtotal",null,{"$f":"J593+J599+J603+J594+J595","v":0.7419308799734472}]
[null,"E - TEMPO FIXO",null,"Código","Quantidade","Unidade",null,"Custo Unitário","Custo Unitário"]
[null,"-",0,"-",0,"t",null,0,null,{"$f":"ROUNDDOWN(E606*H606,4)","v":0}]
[null,"-",0,"-",0,"t",null,0,null,{"$f":"ROUNDDOWN(E607*H607,4)","v":0}]
[null,null,null,"Custo unitário total de tempo fixo",{"$nulls":5},{"$f":"SUM(J606:J607)","v":0}]
[null,"F - MOMENTO DE TRANSPORTE",null,"Quantidade","Unidade","DMT",null,null,null,"Custo Unitário"]
[{"$nulls":5},"LN","RP","P"]
[null,"-",0,0,"tkm"]
[null,"-",0,0,"tkm"]
[null,null,null,"Custo unitário total de transporte"]
[{"$nulls":5},"Custo unitário direto total",null,null,null,{"$f":"TRUNC(J604+J608,2)","v":0.74}]
[null,"Obs."]
[]
[{"$f":"A578+1","v":18},"1ª/GRD",{"$nulls":8},{"$f":"J653","v":0.93}]
[null,"OBRA:","PAVIMENTAÇÃO ASFÁLTICA EM CBUQ - VIAS URBANAS DIVERSAS - BAIRRO MAJOR SALVO (CORINTO / MG)"]
[null,"Custo Unitário de Referência",null,null,"Minas Gerais"]
[{"$nulls":4}," Abril/2025",null,null,"Produção da equipe ",284.10000000000002,{"$f":"VLOOKUP(A617,ORÇAMENTO!$A$10:$L$41,7,1)","v":"TXKM"}]
[null,5914612,"TRANSPORTE DE MASSA ASFÁLTICA COM CAMINHÃO BASCULANTE, EM VIA URBANA PREDOMINANTEMENTE PAVIMENTADA",{"$nulls":5},"Valores em reais (R$)"]
[null,"A - EQUIPAMENTOS",null,"Quantidade","Utilização",null,"Custo Horário",null,null,"Custo"]
[{"$nulls":4},"Operativa","Improdutiva","Produtivo","Improdutivo",null,"Horário Total"]
[null,"E9520","Caminhão com caçamba térmica com capacidade de 6 m³ - 188 kW",1,1,0,265.74349999999998,76.6511,null,{"$f":"D624*(E624*G624+F624*H624)","v":265.74349999999998}]
[null,"-",0,null,null,null,0,0,null,{"$f":"D625*(E625*G625+F625*H625)","v":0}]
[{"$nulls":7},"Custo horário total de equipamentos",null,{"$f":"SUM(J624:J625)","v":265.74349999999998}]
[null,"B - MÃO DE OBRA",null,"Quantidade","Unidade",null,"Custo Horário","Custo Horário Total"]
[null,"-",0,0,0,null,0,null,null,{"$f":"D628*G628","v":0}]
[null,"-",0,0,0,null,0,null,null,{"$f":"D629*G629","v":0}]
[null,null,null,"Custo horário total de mão de obra",{"$nulls":5},{"$f":"SUM(J628:J629)","v":0}]
[null,null,null,"Custo horário total de execução",{"$nulls":5},{"$f":"J626+J630","v":265.74349999999998}]
[null,null,null,"Custo unitário de execução",{"$nulls":5},{"$f":"J631/I620","v":0.9353871876099964}]
[{"$nulls":7},"Custo do FIC",null,0]
[{"$nulls":7},"Custo do FIT",null,0]
[null,"C - MATERIAL",null,"Quantidade","Unidade",null,"Preço Unitário","Custo Unitário"]
[null,"-",0,0,"-",null,0,null,null,{"$f":"D636*G636","v":0}]
[null,"-",0,0,"-",null,0,null,null,{"$f":"D637*G637","v":0}]
[null,null,null,"Custo unitário total de material",{"$nulls":5},{"$f":"SUM(J636:J637)","v":0}]
[null,"D - ATIVIDADES AUXILIARES",null,"Quantidade","Unidade",null,"Custo Unitário","Custo Unitário"]
[null,"-",0,0,"-",null,0,null,null,{"$f":"D640*G640","v":0}]
[null,"-",0,0,"-",null,0,null,null,{"$f":"D641*G641","v":0}]
[null,null,null,"Custo total de atividades auxiliares",{"$nulls":5},{"$f":"SUM(J640:J641)","v":0}]
[{"$nulls":7},"Subtotal",null,{"$f":"J632+J638+J642+J633+J634","v":0.9353871876099964}]
[null,"E - TEMPO FIXO",null,"Código","Quantidade","Unidade",null,"Custo Unitário","Custo Unitário"]
[null,"-",0,"-",0,"t",null,0,null,{"$f":"ROUNDDOWN(E645*H645,4)","v":0}]
[null,"-",0,"-",0,"t",null,0,null,{"$f":"ROUNDDOWN(E646*H646,4)","v":0}]
[null,null,null,"Custo unitário total de tempo fixo",{"$nulls":5},{"$f":"SUM(J645:J646)","v":0}]
[null,"F - MOMENTO DE TRANSPORTE",null,"Quantidade","Unidade","DMT",null,null,null,"Custo Unitário"]
[{"$nulls":5},"LN","RP","P"]
[null,"-",0,0,"tkm"]
[null,"-",0,0,"tkm"]
[null,null,null,"Custo unitário total de transporte"]
[{"$nulls":5},"Custo unitário direto total",null,null,null,{"$f":"TRUNC(J643+J647,2)","v":0.93}]
[null,"Obs."]
[]
[{"$f":"A617+1","v":19},"1ª/GRD",{"$nulls":8},{"$f":"J692","v":1.74}]
[null,"OBRA:","PAVIMENTAÇÃO ASFÁLTICA EM CBUQ - VIAS URBANAS DIVERSAS - BAIRRO MAJOR SALVO (CORINTO / MG)"]
[null,"Custo Unitário de Referência",null,null,"Minas Gerais"]
[{"$nulls":4}," Abril/2025",null,null,"Produção da equipe ",149.4,{"$f":"VLOOKUP(A656,ORÇAMENTO!$A$10:$L$41,7,1)","v":"TXKM"}]
[null,5914622,"TRANSPORTE COM CAMINHÃO TANQUE DE TRANSPORTE DE MATERIAL ASFÁLTICO DE 30000 L, EM VIA URBANA PREDOMINANTEMENTE PAVIMENTADA",{"$nulls":5},"Valores em reais (R$)"]
[null,"A - EQUIPAMENTOS",null,"Quantidade","Utilização",null,"Custo Horário",null,null,"Custo"]
[{"$nulls":4},"Operativa","Improdutiva","Produtivo","Improdutivo",null,"Horário Total"]
[null,"E9509","Caminhão tanque distribuidor de asfalto com capacidade de 6.000 l - 7 kW/136 kW",1,1,0,261.03050000000002,72.388300000000001,null,{"$f":"D663*(E663*G663+F663*H663)","v":261.03050000000002}]
[null,"-",0,null,null,null,0,0,null,{"$f":"D664*(E664*G664+F664*H664)","v":0}]
[{"$nulls":7},"Custo horário total de equipamentos",null,{"$f":"SUM(J663:J664)","v":261.03050000000002}]
[null,"B - MÃO DE OBRA",null,"Quantidade","Unidade",null,"Custo Horário","Custo Horário Total"]
[null,"-",0,0,0,null,0,null,null,{"$f":"D667*G667","v":0}]
[null,"-",0,0,0,null,0,null,null,{"$f":"D668*G668","v":0}]
[null,null,null,"Custo horário total de mão de obra",{"$nulls":5},{"$f":"SUM(J667:J668)","v":0}]
[null,null,null,"Custo horário total de execução",{"$nulls":5},{"$f":"J665+J669","v":261.03050000000002}]
[null,null,null,"Custo unitário de execução",{"$nulls":5},{"$f":"J670/I659","v":1.7471921017402945}]
[{"$nulls":7},"Custo do FIC",null,0]
[{"$nulls":7},"Custo do FIT",null,0]
[null,"C - MATERIAL",null,"Quantidade","Unidade",null,"Preço Unitário","Custo Unitário"]
[null,"-",0,996,"-",null,0,null,null,{"$f":"D675*G675","v":0}]
[null,"-",0,89.28,"-",null,0,null,null,{"$f":"D676*G676","v":0}]
[null,null,null,"Custo unitário total de material",{"$nulls":5},{"$f":"SUM(J675:J676)","v":0}]
[null,"D - ATIVIDADES AUXILIARES",null,"Quantidade","Unidade",null,"Custo Unitário","Custo Unitário"]
[null,"-",0,0,"-",null,0,null,null,{"$f":"D679*G679","v":0}]
[null,"-",0,0,"-",null,0,null,null,{"$f":"D680*G680","v":0}]
[null,null,null,"Custo total de atividades auxiliares",{"$nulls":5},{"$f":"SUM(J679:J680)","v":0}]
[{"$nulls":7},"Subtotal",null,{"$f":"J671+J677+J681+J672+J673","v":1.7471921017402945}]
[null,"E - TEMPO FIXO",null,"Código","Quantidade","Unidade",null,"Custo Unitário","Custo Unitário"]
[null,"-",0,"-",0,"t",null,0,null,{"$f":"ROUNDDOWN(E684*H684,4)","v":0}]
[null,"-",0,"-",0,"t",null,0,null,{"$f":"ROUNDDOWN(E685*H685,4)","v":0}]
[null,null,null,"Custo unitário total de tempo fixo",{"$nulls":5},{"$f":"SUM(J684:J685)","v":0}]
[null,"F - MOMENTO DE TRANSPORTE",null,"Quantidade","Unidade","DMT",null,null,null,"Custo Unitário"]
[{"$nulls":5},"LN","RP","P"]
[null,"-",0,0,"tkm"]
[null,"-",0,0,"tkm"]
[null,null,null,"Custo unitário total de transporte"]
[{"$nulls":5},"Custo unitário direto total",null,null,null,{"$f":"TRUNC(J682+J686,2)","v":1.74}]
[null,"Obs."]
[]
[{"$f":"A656+1","v":20},"1ª/GRD",{"$nulls":8},{"$f":"J732","v":48.38}]
[null,"OBRA:","PAVIMENTAÇÃO ASFÁLTICA EM CBUQ - VIAS URBANAS DIVERSAS - BAIRRO MAJOR SALVO (CORINTO / MG)"]
[null,"Custo Unitário de Referência",null,null,"Minas Gerais"]
[{"$nulls":4}," Abril/2025",null,null,"Produção da equipe ",9.1491000000000007,{"$f":"VLOOKUP(A695,ORÇAMENTO!$A$10:$L$41,7,1)","v":"M"}]
[null,94267,"GUIA (MEIO-FIO) E SARJETA CONJUGADOS DE CONCRETO, MOLDADA  IN LOCO  EM TRECHO RETO COM EXTRUSORA, 45 CM BASE (15 CM BASE DA GUIA + 30 CM BASE DA SARJETA) X 22 CM ALTURA",{"$nulls":5},"Valores em reais (R$)"]
[null,"A - EQUIPAMENTOS",null,"Quantidade","Utilização",null,"Custo Horário",null,null,"Custo"]
[{"$nulls":4},"Operativa","Improdutiva","Produtivo","Improdutivo",null,"Horário Total"]
[null,"E9102","Extrusora para sarjeta de concreto - 10,44 kW",1,0.17,0.83,47.246899999999997,32.960700000000003,null,{"$f":"D702*(E702*G702+F702*H702)","v":35.389353999999997}]
[null,"-",0,null,null,null,0,0,null,{"$f":"D703*(E703*G703+F703*H703)","v":0}]
[{"$nulls":7},"Custo horário total de equipamentos",null,{"$f":"SUM(J702:J703)","v":35.389353999999997}]
[null,"B - MÃO DE OBRA",null,"Quantidade","Unidade",null,"Custo Horário","Custo Horário Total"]
[null,"P9824","Servente",0.45300000000000001,"h",null,21.3355,null,null,{"$f":"D706*G706","v":9.6649814999999997}]
[null,"P9802","Ajudante especializado",0.10929999999999999,"h",null,27.0715,null,null,{"$f":"D707*G707","v":2.95891495}]
[null,"P9821","Pedreiro",0.22650000000000001,"h",null,26.6785,null,null,{"$f":"D708*G708","v":6.0426802500000001}]
[null,null,null,"Custo horário total de mão de obra",{"$nulls":5},{"$f":"SUM(J706:J708)","v":18.6665767}]
[null,null,null,"Custo horário total de execução",{"$nulls":5},{"$f":"J704+J709","v":54.055930699999998}]
[null,null,null,"Custo unitário de execução",{"$nulls":5},{"$f":"J710/I698","v":5.9083331365926695}]
[{"$nulls":7},"Custo do FIC",null,0]
[{"$nulls":7},"Custo do FIT",null,0]
[null,"C - MATERIAL",null,"Quantidade","Unidade",null,"Preço Unitário","Custo Unitário"]
[null,"M0082","Areia média lavada",1.49E-2,"m³",null,164.1893,null,null,{"$f":"D715*G715","v":2.4464205699999999}]
[null,"M0451","Concreto usinado - fck = 20 MPa (comercial)",6.7299999999999999E-2,"m³",null,570,null,null,{"$f":"D716*G716","v":38.360999999999997}]
[null,null,null,"Custo unitário total de material",{"$nulls":5},{"$f":"SUM(J715:J716)","v":40.807420569999998}]
[null,"D - ATIVIDADES AUXILIARES",null,"Quantidade","Unidade",null,"Custo Unitário","Custo Unitário"]
[null,1109669,"Argamassa de cimento e areia 1:3 - confecção em betoneira e lançamento manual - areia comercial",3.3E-3,"m³",null,507.26,null,null,{"$f":"D719*G719","v":1.6739580000000001}]
[null,"-",0,0,"-",null,0,null,null,{"$f":"D720*G720","v":0}]
[null,null,null,"Custo total de atividades auxiliares",{"$nulls":5},{"$f":"SUM(J719:J720)","v":1.6739580000000001}]
[{"$nulls":7},"Subtotal",null,{"$f":"J711+J717+J721+J712+J713","v":48.389711706592664}]
[null,"E - TEMPO FIXO",null,"Código","Quantidade","Unidade",null,"Custo Unitário","Custo Unitário"]
[null,"-",0,"-",0,"t",null,0,null,{"$f":"ROUNDDOWN(E724*H724,4)","v":0}]
[null,"-",0,"-",0,"t",null,0,null,{"$f":"ROUNDDOWN(E725*H725,4)","v":0}]
[null,null,null,"Custo unitário total de tempo fixo",{"$nulls":5},{"$f":"SUM(J724:J725)","v":0}]
[null,"F - MOMENTO DE TRANSPORTE",null,"Quantidade","Unidade","DMT",null,null,null,"Custo Unitário"]
[{"$nulls":5},"LN","RP","P"]
[null,"-",0,0,"tkm","5914449","5914464","5914479"]
[null,"-",0,0,"tkm","5914449","5914464","5914479"]
[null,null,null,"Custo unitário total de transporte"]
[{"$nulls":5},"Custo unitário direto total",null,null,null,{"$f":"TRUNC(J722+J726,2)","v":48.38}]
[null,"Obs."]
[]
[46,"1ª/GRD",{"$nulls":8},{"$f":"J771","v":259.45999999999998}]
[null,"OBRA:","PAVIMENTAÇÃO ASFÁLTICA EM CBUQ - VIAS URBANAS DIVERSAS - BAIRRO MAJOR SALVO (CORINTO / MG)"]
[null,"Custo Unitário de Referência",null,null,"Minas Gerais"]
[{"$nulls":4}," Abril/2025",null,null,"Produção da equipe ",3,{"$f":"VLOOKUP(A735,ORÇAMENTO!$A$10:$L$41,7,1)","v":"UN."}]
[null,5213440,"PLACA DE REGULAMENTAÇÃO EM AÇO, D=60CM - PELÍCULA RETRORREFLETIVA - FORNECIMENTO E INSTALAÇÃO, INCLUSIVE  SUPORTE",{"$nulls":5},"Valores em reais (R$)"]
[null,"A - EQUIPAMENTOS",null,"Quantidade","Utilização",null,"Custo Horário",null,null,"Custo"]
[{"$nulls":4},"Operativa","Improdutiva","Produtivo","Improdutivo",null,"Horário Total"]
[null,"E9687","Caminhão carroceria com capacidade de 5 t - 115 kW",1,0.3,0.7,146.88079999999999,57.423099999999998,null,{"$f":"D742*(E742*G742+F742*H742)","v":84.260409999999993}]
[null,"-",0,null,null,null,0,0,null,{"$f":"D743*(E743*G743+F743*H743)","v":0}]
[{"$nulls":7},"Custo horário total de equipamentos",null,{"$f":"SUM(J742:J743)","v":84.260409999999993}]
[null,"B - MÃO DE OBRA",null,"Quantidade","Unidade",null,"Custo Horário","Custo Horário Total"]
[null,"P9830","Montador",1,"h",null,36.409500000000001,null,null,{"$f":"D746*G746","v":36.409500000000001}]
[null,"P9824","Servente",2,"h",null,21.3355,null,null,{"$f":"D747*G747","v":42.670999999999999}]
[null,null,null,"Custo horário total de mão de obra",{"$nulls":5},{"$f":"SUM(J746:J747)","v":79.080500000000001}]
[null,null,null,"Custo horário total de execução",{"$nulls":5},{"$f":"J744+J748","v":163.34091000000001}]
[null,null,null,"Custo unitário de execução",{"$nulls":5},{"$f":"J749/I738","v":54.44697}]
[{"$nulls":7},"Custo do FIC",null,0]
[{"$nulls":7},"Custo do FIT",null,0]
[null,"C - MATERIAL",null,"Quantidade","Unidade",null,"Preço Unitário","Custo Unitário"]
[null,"-",0,null,"-",null,0,null,null,{"$f":"D754*G754","v":0}]
[null,"-",0,null,"-",null,0,null,null,{"$f":"D755*G755","v":0}]
[null,null,null,"Custo unitário total de material",{"$nulls":5},{"$f":"SUM(J754:J755)","v":0}]
[null,"D - ATIVIDADES AUXILIARES",null,"Quantidade","Unidade",null,"Custo Unitário","Custo Unitário"]
[null,5213414,"Placa em aço nº 16 galvanizado com película retrorrefletiva tipo I + SI - confecção",0.35993999999999998,"m²",null,569.58000000000004,null,null,{"$f":"D758*G758","v":205.01462520000001}]
[null,"-",0,null,"-",null,0,null,null,{"$f":"D759*G759","v":0}]
[null,null,null,"Custo total de atividades auxiliares",{"$nulls":5},{"$f":"SUM(J758:J759)","v":205.01462520000001}]
[{"$nulls":7},"Subtotal",null,{"$f":"J750+J756+J760+J751+J752","v":259.46159520000003}]
[null,"E - TEMPO FIXO",null,"Código","Quantidade","Unidade",null,"Custo Unitário","Custo Unitário"]
[null,"-",0,"-",null,"t",null,0,null,{"$f":"ROUNDDOWN(E763*H763,4)","v":0}]
[null,"-",0,"-",null,"t",null,0,null,{"$f":"ROUNDDOWN(E764*H764,4)","v":0}]
[null,null,null,"Custo unitário total de tempo fixo",{"$nulls":5},{"$f":"SUM(J763:J764)","v":0}]
[null,"F - MOMENTO DE TRANSPORTE",null,"Quantidade","Unidade","DMT",null,null,null,"Custo Unitário"]
[{"$nulls":5},"LN","RP","P"]
[null,"-",0,null,"tkm"]
[null,"-",0,null,"tkm"]
[null,null,null,"Custo unitário total de transporte"]
[{"$nulls":5},"Custo unitário direto total",null,null,null,{"$f":"TRUNC(J761+J765,2)","v":259.45999999999998}]
[null,"Obs."]
[]
[49,"1ª/GRD",{"$nulls":8},{"$f":"J817","v":29.17}]
[null,"OBRA:","PAVIMENTAÇÃO ASFÁLTICA EM CBUQ - VIAS URBANAS DIVERSAS - BAIRRO MAJOR SALVO (CORINTO / MG)"]
[null,"Custo Unitário de Referência",null,null,"Minas Gerais"]
[{"$nulls":4}," Abril/2025",null,null,"Produção da equipe ",149.4,{"$f":"VLOOKUP(A774,ORÇAMENTO!$A$10:$L$41,7,1)","v":"M2"}]
[null,5213401,"PINTURA DE EIXO VIÁRIO SOBRE ASFALTO COM TINTA RETRORREFLETIVA A BASE DE RESINA ACRÍLICA COM MICROESFERAS DE VIDRO, APLICAÇÃO MECÂNICA COM DEMARCADORA AUTOPROPELIDA",{"$nulls":5},"Valores em reais (R$)"]
[null,"A - EQUIPAMENTOS",null,"Quantidade","Utilização",null,"Custo Horário",null,null,"Custo"]
[{"$nulls":4},"Operativa","Improdutiva","Produtivo","Improdutivo",null,"Horário Total"]
[null,"E9644","Caminhão demarcador de faixas com sistema de pintura a frio - 28 kW/115 kW",1,1,0,374.84390000000002,155.3843,null,{"$f":"D781*(E781*G781+F781*H781)","v":374.84390000000002}]
[null,"-",0,null,null,null,0,0,null,{"$f":"D782*(E782*G782+F782*H782)","v":0}]
[{"$nulls":7},"Custo horário total de equipamentos",null,{"$f":"SUM(J781:J782)","v":374.84390000000002}]
[null,"B - MÃO DE OBRA",null,"Quantidade","Unidade",null,"Custo Horário","Custo Horário Total"]
[null,"P9853","Pré-marcador",1,"h",null,22.8993,null,null,{"$f":"D785*G785","v":22.8993}]
[null,"P9824","Servente",4,"h",null,21.3355,null,null,{"$f":"D786*G786","v":85.341999999999999}]
[null,null,null,"Custo horário total de mão de obra",{"$nulls":5},{"$f":"SUM(J785:J786)","v":108.2413}]
[null,null,null,"Custo horário total de execução",{"$nulls":5},{"$f":"J783+J787","v":483.08519999999999}]
[null,null,null,"Custo unitário de execução",{"$nulls":5},{"$f":"J788/I777","v":3.2335020080321284}]
[{"$nulls":7},"Custo do FIC",null,0]
[{"$nulls":7},"Custo do FIT",null,0]
[null,"C - MATERIAL",null,"Quantidade","Unidade",null,"Preço Unitário","Custo Unitário"]
[null,"M2037","Microesferas refletivas de vidro tipo I-B",0.12,"kg",null,8.7245000000000008,null,null,{"$f":"D793*G793","v":1.04694}]
[null,"M2038","Microesferas refletivas de vidro tipo II-A",0.35,"kg",null,8.9086999999999996,null,null,{"$f":"D794*G794","v":3.1180449999999995}]
[null,"M2034","Solvente para tinta à base de resina acrílica",0.03,"l",null,16.8491,null,null,0.50547299999999995]
[null,"M2044","Tinta à base de resina acrílica emulsionada em água para pré-marcação viária",9.7000000000000005E-4,"l",null,21.025400000000001,null,null,2.0394638000000003E-2]
[null,"M2027","Tinta à base de resina acrílica estirenada para demarcação viária",0.6,"l",null,35.350499999999997,null,null,21.210299999999997]
[null,null,null,"Custo unitário total de material",{"$nulls":5},{"$f":"SUM(J793:J797)","v":25.901152637999996}]
[null,"D - ATIVIDADES AUXILIARES",null,"Quantidade","Unidade",null,"Custo Unitário","Custo Unitário"]
[null,"-",0,null,"-",null,0,null,null,{"$f":"D800*G800","v":0}]
[null,"-",0,null,"-",null,0,null,null,{"$f":"D801*G801","v":0}]
[null,null,null,"Custo total de atividades auxiliares",{"$nulls":5},{"$f":"SUM(J800:J801)","v":0}]
[{"$nulls":7},"Subtotal",null,{"$f":"J789+J798+J802+J790+J791","v":29.134654646032125}]
[null,"E - TEMPO FIXO",null,"Código","Quantidade","Unidade",null,"Custo Unitário","Custo Unitário"]
[null,"M2037","Microesferas refletivas de vidro tipo I-B",5914655,1.2E-4,"t",null,32.520000000000003,null,{"$f":"ROUNDDOWN(E805*H805,4)","v":3.8999999999999998E-3}]
[null,"M2038","Microesferas refletivas de vidro tipo II-A",5914655,3.5E-4,"t",null,32.520000000000003,null,{"$f":"ROUNDDOWN(E806*H806,4)","v":1.1299999999999999E-2}]
[null,"M2034","Solvente para tinta à base de resina acrílica",5914655,3.0000000000000001E-5,"t",null,32.520000000000003,null,8.9999999999999998E-4]
[null,"M2027","Tinta à base de resina acrílica estirenada para demarcação viária",5914655,8.3000000000000001E-4,"t",null,32.520000000000003,null,2.69E-2]
[null,null,null,"Custo unitário total de tempo fixo",{"$nulls":5},{"$f":"SUM(J805:J808)","v":4.2999999999999997E-2}]
[null,"F - MOMENTO DE TRANSPORTE",null,"Quantidade","Unidade","DMT",null,null,null,"Custo Unitário"]
[{"$nulls":5},"LN","RP","P"]
[null,"M2037","Microesferas refletivas de vidro tipo I-B",1.2E-4,"tkm"]
[null,"M2038","Microesferas refletivas de vidro tipo II-A",3.5E-4,"tkm"]
[null,"M2034","Solvente para tinta à base de resina acrílica",3.0000000000000001E-5,"tkm"]
[null,"M2027","Tinta à base de resina acrílica estirenada para demarcação viária",8.3000000000000001E-4,"tkm"]
[null,null,null,"Custo unitário total de transporte"]
[{"$nulls":5},"Custo unitário direto total",null,null,null,{"$f":"TRUNC(J803+J809,2)","v":29.17}]
[null,"Obs."]
[]
[51,"1ª/GRD",{"$nulls":8},{"$f":"J863","v":41.95}]
[null,"OBRA:","PAVIMENTAÇÃO ASFÁLTICA EM CBUQ - VIAS URBANAS DIVERSAS - BAIRRO MAJOR SALVO (CORINTO / MG)"]
[null,"Custo Unitário de Referência",null,null,"Minas Gerais"]
[{"$nulls":4}," Abril/2025",null,null,"Produção da equipe ",30.18,{"$f":"VLOOKUP(A820,ORÇAMENTO!$A$10:$L$41,7,1)","v":"M2"}]
[null,5213405,"PINTURA DE FAIXA DE PEDESTRE OU ZEBRADA TINTA RETRORREFLETIVA A BASE DE RESINA ACRÍLICA COM MICROESFERAS DE VIDRO, APLICAÇÃO MANUAL",{"$nulls":5},"Valores em reais (R$)"]
[null,"A - EQUIPAMENTOS",null,"Quantidade","Utilização",null,"Custo Horário",null,null,"Custo"]
[{"$nulls":4},"Operativa","Improdutiva","Produtivo","Improdutivo",null,"Horário Total"]
[null,"E9644","Caminhão demarcador de faixas com sistema de pintura a frio - 28 kW/115 kW",1,1,0,374.84390000000002,155.3843,null,{"$f":"D827*(E827*G827+F827*H827)","v":374.84390000000002}]
[null,"-",0,null,null,null,0,0,null,{"$f":"D828*(E828*G828+F828*H828)","v":0}]
[{"$nulls":7},"Custo horário total de equipamentos",null,{"$f":"SUM(J827:J828)","v":374.84390000000002}]
[null,"B - MÃO DE OBRA",null,"Quantidade","Unidade",null,"Custo Horário","Custo Horário Total"]
[null,"P9853","Pré-marcador",1,"h",null,22.8993,null,null,{"$f":"D831*G831","v":22.8993}]
[null,"P9824","Servente",4,"h",null,21.3355,null,null,{"$f":"D832*G832","v":85.341999999999999}]
[null,null,null,"Custo horário total de mão de obra",{"$nulls":5},{"$f":"SUM(J831:J832)","v":108.2413}]
[null,null,null,"Custo horário total de execução",{"$nulls":5},{"$f":"J829+J833","v":483.08519999999999}]
[null,null,null,"Custo unitário de execução",{"$nulls":5},{"$f":"J834/I823","v":16.006799204771372}]
[{"$nulls":7},"Custo do FIC",null,0]
[{"$nulls":7},"Custo do FIT",null,0]
[null,"C - MATERIAL",null,"Quantidade","Unidade",null,"Preço Unitário","Custo Unitário"]
[null,"M2037","Microesferas refletivas de vidro tipo I-B",0.12,"kg",null,8.7245000000000008,null,null,{"$f":"D839*G839","v":1.04694}]
[null,"M2038","Microesferas refletivas de vidro tipo II-A",0.35,"kg",null,8.9086999999999996,null,null,{"$f":"D840*G840","v":3.1180449999999995}]
[null,"M2034","Solvente para tinta à base de resina acrílica",0.03,"l",null,16.8491,null,null,0.50547299999999995]
[null,"M2044","Tinta à base de resina acrílica emulsionada em água para pré-marcação viária",9.7000000000000005E-4,"l",null,21.025400000000001,null,null,2.0394638000000003E-2]
[null,"M2027","Tinta à base de resina acrílica estirenada para demarcação viária",0.6,"l",null,35.350499999999997,null,null,21.210299999999997]
[null,null,null,"Custo unitário total de material",{"$nulls":5},{"$f":"SUM(J839:J843)","v":25.901152637999996}]
[null,"D - ATIVIDADES AUXILIARES",null,"Quantidade","Unidade",null,"Custo Unitário","Custo Unitário"]
[null,"-",0,null,"-",null,0,null,null,{"$f":"D846*G846","v":0}]
[null,"-",0,null,"-",null,0,null,null,{"$f":"D847*G847","v":0}]
[null,null,null,"Custo total de atividades auxiliares",{"$nulls":5},{"$f":"SUM(J846:J847)","v":0}]
[{"$nulls":7},"Subtotal",null,{"$f":"J835+J844+J848+J836+J837","v":41.907951842771368}]
[null,"E - TEMPO FIXO",null,"Código","Quantidade","Unidade",null,"Custo Unitário","Custo Unitário"]
[null,"M2037","Microesferas refletivas de vidro tipo I-B",5914655,1.2E-4,"t",null,32.520000000000003,null,{"$f":"ROUNDDOWN(E851*H851,4)","v":3.8999999999999998E-3}]
[null,"M2038","Microesferas refletivas de vidro tipo II-A",5914655,3.5E-4,"t",null,32.520000000000003,null,{"$f":"ROUNDDOWN(E852*H852,4)","v":1.1299999999999999E-2}]
[null,"M2034","Solvente para tinta à base de resina acrílica",5914655,3.0000000000000001E-5,"t",null,32.520000000000003,null,8.9999999999999998E-4]
[null,"M2027","Tinta à base de resina acrílica estirenada para demarcação viária",5914655,8.3000000000000001E-4,"t",null,32.520000000000003,null,2.69E-2]
[null,null,null,"Custo unitário total de tempo fixo",{"$nulls":5},{"$f":"SUM(J851:J854)","v":4.2999999999999997E-2}]
[null,"F - MOMENTO DE TRANSPORTE",null,"Quantidade","Unidade","DMT",null,null,null,"Custo Unitário"]
[{"$nulls":5},"LN","RP","P"]
[null,"M2037","Microesferas refletivas de vidro tipo I-B",1.2E-4,"tkm"]
[null,"M2038","Microesferas refletivas de vidro tipo II-A",3.5E-4,"tkm"]
[null,"M2034","Solvente para tinta à base de resina acrílica",3.0000000000000001E-5,"tkm"]
[null,"M2027","Tinta à base de resina acrílica estirenada para demarcação viária",8.3000000000000001E-4,"tkm"]
[null,null,null,"Custo unitário total de transporte"]
[{"$nulls":5},"Custo unitário direto total",null,null,null,{"$f":"TRUNC(J849+J855,2)","v":41.95}]
[null,"Obs."]
[]
[{"$f":"A820+1","v":52}]
{"$rows_empty":50}
[{"$f":"A866+1","v":53}]
{"$rows_empty":50}
[{"$f":"A917+1","v":54}]
{"$rows_empty":50}
[{"$f":"A968+1","v":55}]
{"$rows_empty":50}
[{"$f":"A1019+1","v":56}]
{"$rows_empty":50}
[{"$f":"A1070+1","v":57}]
{"$rows_empty":50}
[{"$f":"A1121+1","v":58}]
{"$rows_empty":50}
[{"$f":"A1172+1","v":59}]
{"$rows_empty":50}
[{"$f":"A1223+1","v":60}]
{"$rows_empty":50}
[{"$f":"A1274+1","v":61}]
{"$rows_empty":50}
[{"$f":"A1325+1","v":62}]
{"$rows_empty":50}
[{"$f":"A1376+1","v":63}]
{"$rows_empty":50}
[{"$f":"A1427+1","v":64}]
{"$rows_empty":50}
[{"$f":"A1478+1","v":65}]
{"$rows_empty":50}
[{"$f":"A1529+1","v":66}]
{"$rows_empty":50}
[{"$f":"A1580+1","v":67}]
{"$rows_empty":48}
[null,"Obs."]

{"sheet":"CPU-FORNEC","index":2,"n_rows":92,"n_cols":14,"rows_kept":92,"cut":false,"hidden":false,"merged":[[81,1,81,7],[82,0,91,0],[82,1,82,3],[82,4,82,7],[83,2,83,5],[84,2,84,3],[85,1,85,7],[88,1,88,3],[88,5,88,6],[89,1,89,6],[90,1,90,6],[91,1,91,6],[60,0,69,0],[60,1,60,3],[60,4,60,7],[61,2,61,5],[62,2,62,3],[63,1,63,7],[66,1,66,3],[66,5,66,6],[67,1,67,6],[68,1,68,6],[69,1,69,6],[38,0,47,0],[38,1,38,3],[38,4,38,7],[39,2,39,5],[40,2,40,3],[41,1,41,7],[44,1,44,3],[44,5,44,6],[45,1,45,6],[46,1,46,6],[47,1,47,6],[22,5,22,6],[23,1,23,6],[24,1,24,6],[25,1,25,6],[5,1,5,7],[9,1,9,7],[13,1,13,7],[17,1,17,7],[0,10,0,11],[1,2,1,5],[1,10,1,11],[2,2,2,3],[3,1,3,7],[27,4,27,7],[28,2,28,5],[27,0,36,0],[29,2,29,3],[30,1,30,7],[33,1,33,3],[33,5,33,6],[34,1,34,6],[35,1,35,6],[36,1,36,6],[0,0,26,0],[0,1,0,3],[0,4,0,7],[22,1,22,3],[49,0,58,0],[49,1,49,3],[49,4,49,7],[50,2,50,5],[51,2,51,3],[52,1,52,7],[55,1,55,3],[55,5,55,6],[56,1,56,6],[57,1,57,6],[58,1,58,6],[27,1,27,3],[71,0,80,0],[71,1,71,3],[71,4,71,7],[72,2,72,5],[73,2,73,3],[74,1,74,7],[77,1,77,3],[77,5,77,6],[78,1,78,6],[79,1,79,6],[80,1,80,6]]}
[1,"CODEVASF",null,null," COMPOSIÇÃO DE PREÇO UNITÁRIO",null,null,null,{"$f":"H24","v":0},{"$f":"H26","v":0},"BDI CALCULADO:",null,{"$f":"ORÇAMENTO!L6","v":15}]
[null,"OBRA:  ",0,null,null,null,"DATA: ",{"$f":"ORÇAMENTO!E6","v":" JULHO / 2024"},null,null,"BDI DIFERENCIADO:",null,{"$f":"'BDI FORN'!D31/100","v":0.15}]
[null,"SERVIÇO:  ","CPU.1",null,"Referência:","CODEVASF","UNIDADE: ",{"$f":"VLOOKUP(A1,ORÇAMENTO!A11:L30,5)","v":"MOBILIZAÇÃO E DESMOBILIZAÇÃO"}]
[]
[null,"TIPO ITEM","CODIGO ITEM","DESCRIÇÃO ITEM","UNIDADE ITEM","COEFICIENTE","PRECO UNITARIO","CUSTO TOTAL",null,"distancia =",90,"B.DESPACHO"]
[null,"EQUIPAMENTOS",{"$nulls":7},"Pá carregadeira ",null,null,10.1," ton"]
[null,null,"E9001","E9001","E9001",null,"E9001"]
[]
[]
[null,"MÃO DE OBRA"]
[]
[]
[]
[null,"MATERIAIS"]
[]
[]
[{"$nulls":7},{"$f":"ROUNDDOWN(F17*G17,2)","v":0},null,"Motoniveladora ",null,null,12.47," ton"]
[null,"ATIVIDADES AUXILIARES",{"$nulls":7},"Trator de pneus",null,null,2.8," ton"]
[{"$nulls":7},{"$f":"ROUNDDOWN(F19*G19,2)","v":0}]
[{"$nulls":7},0]
[{"$nulls":7},0]
[{"$nulls":7},{"$f":"ROUNDDOWN(F22*G22,2)","v":0},null,"Rolo Compactador ",null,null,15.33," ton"]
[null,"PRODUÇÃO DA EQUIPE",null,null,1,"CUSTO ",null,{"$f":"SUM(H6:H22)","v":0},null,"Grade de disco",null,null,1," ton"]
[null,"TOTAL",{"$nulls":5},{"$f":"H23/E23","v":0},"OK","RETROESCAVADEIRA",null,null,6.67," ton"]
[null,"BDI                %",{"$nulls":5},{"$f":"1+$M$1","v":16}]
[null,"TOTAL DO SERVIÇO - R$",{"$nulls":5},{"$f":"ROUND(H24*H25,2)","v":0}]
[]
["F1","CODEVASF",null,null," COMPOSIÇÃO DE PREÇO UNITÁRIO",null,null,null,{"$f":"H35","v":3189.94},{"$f":"H37","v":3668.43}]
[null,"OBRA:  ","PAVIMENTAÇÃO ASFÁLTICA EM CBUQ - VIAS URBANAS DIVERSAS - BAIRRO MAJOR SALVO (CORINTO / MG)",null,null,null,"DATA: ",{"$f":"ORÇAMENTO!$C$6","v":" ABRIL/2025"}]
[null,"SERVIÇO:  ","AQUISIÇÃO DE EMULSÃO ASFÁLTICA PARA IMPRIMAÇÃO (EAI) - EXCLUSIVE TRANSPORTE",null,"FONTE","CPU.7","UNIDADE: ",{"$f":"VLOOKUP(A28,ORÇAMENTO!$A$11:$L$48,7)","v":"T"}]
[]
[null,"TIPO ITEM","CODIGO ITEM","DESCRIÇÃO ITEM","UNIDADE ITEM","COEFICIENTE","PRECO UNITARIO","CUSTO TOTAL"]
[null,"INSUMO","ANP","EMULSÃO ASFÁLTICA PARA SERVIÇO DE IMPRIMAÇÃO (MEMÓRIA EM ANEXO)","T",1,3189.9460041300972,{"$f":"ROUNDDOWN(F33*G33,2)","v":3189.94}]
[null,"PRODUÇÃO DA EQUIPE",null,null,1,"CUSTO ",null,{"$f":"SUM(H33:H33)","v":3189.94}]
[null,"TOTAL",{"$nulls":5},{"$f":"H34/E34","v":3189.94}]
[null,"BDI                %",{"$nulls":5},{"$f":"1+$M$2","v":1.1499999999999999}]
[null,"TOTAL DO SERVIÇO - R$",{"$nulls":5},{"$f":"ROUND(H35*H36,2)","v":3668.43},"OK"]
[]
["F2","CODEVASF",null,null," COMPOSIÇÃO DE PREÇO UNITÁRIO",null,null,null,{"$f":"H46","v":196.94},{"$f":"H48","v":226.48}]
[null,"OBRA:  ","PAVIMENTAÇÃO ASFÁLTICA EM CBUQ - VIAS URBANAS DIVERSAS - BAIRRO MAJOR SALVO (CORINTO / MG)",null,null,null,"DATA: ",{"$f":"ORÇAMENTO!$C$6","v":" ABRIL/2025"}]
[null,"SERVIÇO:  ","TRANSPORTE DE EMULSÃO ASFÁLTICA PARA IMPRIMAÇÃO (EAI)",null,"FONTE","CPU.8","UNIDADE: ",{"$f":"VLOOKUP(A39,ORÇAMENTO!$A$11:$L$48,7)","v":"T"}]
[]
[null,"TIPO ITEM","CODIGO ITEM","DESCRIÇÃO ITEM","UNIDADE ITEM","COEFICIENTE","PRECO UNITARIO","CUSTO TOTAL"]
[null,"INSUMO"," - ","TRANSPORTE DE EMULSÃO ASFÁLTICA PARA IMPRIMAÇÃO (EAI), INCLUINDO CUSTO TOTAL DO TRANSPORTE (COMBUSTÍVEL, PEDÁGIOS, ETC.) E ICMS - MEMÓRIA ANEXA","T",1,196.94441860465116,{"$f":"ROUNDDOWN(F44*G44,2)","v":196.94}]
[null,"PRODUÇÃO DA EQUIPE",null,null,1,"CUSTO ",null,{"$f":"SUM(H44:H44)","v":196.94}]
[null,"TOTAL",{"$nulls":5},{"$f":"H45/E45","v":196.94}]
[null,"BDI                %",{"$nulls":5},{"$f":"1+$M$2","v":1.1499999999999999}]
[null,"TOTAL DO SERVIÇO - R$",{"$nulls":5},{"$f":"ROUND(H46*H47,2)","v":226.48},"OK"]
[]
["F3","CODEVASF",null,null," COMPOSIÇÃO DE PREÇO UNITÁRIO",null,null,null,{"$f":"H57","v":3510.21},{"$f":"H59","v":4036.74}]
[null,"OBRA:  ","PAVIMENTAÇÃO ASFÁLTICA EM CBUQ - VIAS URBANAS DIVERSAS - BAIRRO MAJOR SALVO (CORINTO / MG)",null,null,null,"DATA: ",{"$f":"ORÇAMENTO!$C$6","v":" ABRIL/2025"}]
[null,"SERVIÇO:  ","AQUISIÇÃO DE EMULSAO ASFALTICA CATIONICA RR-1C - EXCLUSIVE TRANSPORTE",null,"FONTE","CPU.9","UNIDADE: ",{"$f":"VLOOKUP(A50,ORÇAMENTO!$A$11:$L$48,7)","v":"T"}]
[]
[null,"TIPO ITEM","CODIGO ITEM","DESCRIÇÃO ITEM","UNIDADE ITEM","COEFICIENTE","PRECO UNITARIO","CUSTO TOTAL"]
[null,"INSUMO","ANP","EMULSÃO ASFÁLTICA CATIÔNICA RR-1C(MEMÓRIA EM ANEXO)","T",1,3510.2129251456049,{"$f":"ROUNDDOWN(F55*G55,2)","v":3510.21}]
[null,"PRODUÇÃO DA EQUIPE",null,null,1,"CUSTO ",null,{"$f":"SUM(H55:H55)","v":3510.21}]
[null,"TOTAL",{"$nulls":5},{"$f":"H56/E56","v":3510.21},"OK"]
[null,"BDI                %",{"$nulls":5},{"$f":"1+$M$2","v":1.1499999999999999}]
[null,"TOTAL DO SERVIÇO - R$",{"$nulls":5},{"$f":"ROUND(H57*H58,2)","v":4036.74}]
[]
["F4","CODEVASF",null,null," COMPOSIÇÃO DE PREÇO UNITÁRIO",null,null,null,{"$f":"H68","v":220.02},{"$f":"H70","v":253.02}]
[null,"OBRA:  ","PAVIMENTAÇÃO ASFÁLTICA EM CBUQ - VIAS URBANAS DIVERSAS - BAIRRO MAJOR SALVO (CORINTO / MG)",null,null,null,"DATA: ",{"$f":"ORÇAMENTO!$C$6","v":" ABRIL/2025"}]
[null,"SERVIÇO:  ","TRANSPORTE DE EMULSÃO ASFÁLTICA CATIONICA RR-1C",null,"FONTE","CPU.10","UNIDADE: ",{"$f":"VLOOKUP(A61,ORÇAMENTO!$A$11:$L$48,7)","v":"T"}]
[]
[null,"TIPO ITEM","CODIGO ITEM","DESCRIÇÃO ITEM","UNIDADE ITEM","COEFICIENTE","PRECO UNITARIO","CUSTO TOTAL"]
[null,"INSUMO"," - ","TRANSPORTE DE EMULSÃO ASFÁLTICA CATIONICA TIPO RR-1C, INCLUINDO CUSTO TOTAL DO TRANSPORTE (COMBUSTÍVEL, PEDÁGIOS, ETC.) E ICMS - MEMÓRIA ANEXA","T",1,220.02006357824052,{"$f":"ROUNDDOWN(F66*G66,2)","v":220.02}]
[null,"PRODUÇÃO DA EQUIPE",null,null,1,"CUSTO ",null,{"$f":"SUM(H66:H66)","v":220.02}]
[null,"TOTAL",{"$nulls":5},{"$f":"H67/E67","v":220.02},"OK"]
[null,"BDI                %",{"$nulls":5},{"$f":"1+$M$2","v":1.1499999999999999}]
[null,"TOTAL DO SERVIÇO - R$",{"$nulls":5},{"$f":"ROUND(H68*H69,2)","v":253.02}]
[]
["F5","CODEVASF",null,null," COMPOSIÇÃO DE PREÇO UNITÁRIO",null,null,null,{"$f":"H79","v":4816.4799999999996},{"$f":"H81","v":5538.95}]
[null,"OBRA:  ","PAVIMENTAÇÃO ASFÁLTICA EM CBUQ - VIAS URBANAS DIVERSAS - BAIRRO MAJOR SALVO (CORINTO / MG)",null,null,null,"DATA: ",{"$f":"ORÇAMENTO!$C$6","v":" ABRIL/2025"}]
[null,"SERVIÇO:  ","AQUISIÇÃO DE CONCRETO ASFÁLTICO DE PETRÓLEO - CAP 50/70 - EXCLUSIVE TRANSPORTE",null,"FONTE","CPU.11","UNIDADE: ",{"$f":"VLOOKUP(A72,ORÇAMENTO!$A$11:$L$48,7)","v":"T"}]
[]
[null,"TIPO ITEM","CODIGO ITEM","DESCRIÇÃO ITEM","UNIDADE ITEM","COEFICIENTE","PRECO UNITARIO","CUSTO TOTAL"]
[null,"INSUMO",1518,"CIMENTOS ASFÁLTICO DE PETRÓLEO TIPO CAP 50/70 (MEMÓRIA EM ANEXO)","T",1,4816.4872247825624,{"$f":"ROUNDDOWN(F77*G77,2)","v":4816.4799999999996}]
[null,"PRODUÇÃO DA EQUIPE",null,null,1,"CUSTO ",null,{"$f":"SUM(H77:H77)","v":4816.4799999999996}]
[null,"TOTAL",{"$nulls":5},{"$f":"H78/E78","v":4816.4799999999996}]
[null,"BDI                %",{"$nulls":5},{"$f":"1+$M$2","v":1.1499999999999999}]
[null,"TOTAL DO SERVIÇO - R$",{"$nulls":5},{"$f":"ROUND(H79*H80,2)","v":5538.95}]
[]
["F6","CODEVASF",null,null," COMPOSIÇÃO DE PREÇO UNITÁRIO",null,null,null,{"$f":"H90","v":388.74},{"$f":"H92","v":447.05}]
[null,"OBRA:  ","PAVIMENTAÇÃO ASFÁLTICA EM CBUQ - VIAS URBANAS DIVERSAS - BAIRRO MAJOR SALVO (CORINTO / MG)",null,null,null,"DATA: ",{"$f":"ORÇAMENTO!$C$6","v":" ABRIL/2025"}]
[null,"SERVIÇO:  ","TRANSPORTE DE CONCRETO ASFÁLTICO DE PETRÓLEO - CAP 50/70",null,"FONTE","CPU.12","UNIDADE: ",{"$f":"VLOOKUP(A83,ORÇAMENTO!$A$11:$L$48,7)","v":"T"}]
[]
[null,"TIPO ITEM","CODIGO ITEM","DESCRIÇÃO ITEM","UNIDADE ITEM","COEFICIENTE","PRECO UNITARIO","CUSTO TOTAL"]
[null,"INSUMO"," - ","TRANSPORTE DE CIMENTO ASFÁLTICO DE PETRÓLEO TIPO CAP 50-70, INCLUINDO CUSTO TOTAL DO TRANSPORTE (COMBUSTÍVEL, PEDÁGIOS, ETC.) E ICMS - MEMÓRIA ANEXA","T",1,388.7424878614392,{"$f":"ROUNDDOWN(F88*G88,2)","v":388.74}]
[null,"PRODUÇÃO DA EQUIPE",null,null,1,"CUSTO ",null,{"$f":"SUM(H88:H88)","v":388.74}]
[null,"TOTAL",{"$nulls":5},{"$f":"H89/E89","v":388.74}]
[null,"BDI                %",{"$nulls":5},{"$f":"1+$M$2","v":1.1499999999999999}]
[null,"TOTAL DO SERVIÇO - R$",{"$nulls":5},{"$f":"ROUND(H90*H91,2)","v":447.05}]

{"sheet":"BDI SERV","index":3,"n_rows":60,"n_cols":5,"rows_kept":60,"cut":false,"hidden":false,"merged":[[35,0,35,5],[36,0,36,5],[38,1,38,4],[39,2,39,3],[0,1,2,4],[25,1,25,3],[26,1,26,2],[26,3,26,4],[27,3,27,4]]}
[null,"DETALHAMENTO DO BDI - SERVIÇOS"]
[]
[]
[null,"Item","Descrição dos Serviços","% - PV","% - CD"]
[]
[null,1,"ADMINISTRAÇÃO CENTRAL"," ",{"$f":"SUM(E7:E9)","v":4.01}]
[null,"1.1","ESCRITÓRIO CENTRAL",null,4.01]
[null,"1.2","VIAGENS"]
[null,"1.3","OUTROS"]
[null," "," "," "," "]
[null,2,"IMPOSTOS E TAXAS",{"$f":"SUM(D12:D15)","v":8.65},{"$f":"SUM(E12:E15)","v":0}]
[null,"2.1","ISS - Proposta",{"$f":"D34*100","v":5}]
[null,"2.2","PIS",0.65]
[null,"2.3","Cofins",3]
[null,"2.4","Contribuição Previdenciaria (CPRB)"]
[]
[null,3,"TAXA DE RISCO",null,{"$f":"SUM(E18:E20)","v":0.96}]
[null,"3.1","SEGURO",null,0.2]
[null,"3.2","RISCO",null,0.56000000000000005]
[null,"3.3","GARANTIA",null,0.2]
[]
[null,4,"DESPESAS FINANCEIRAS",null,1.1100000000000001]
[]
[null,5,"LUCRO",null,7.3]
[]
[null,"BDI APRESENTADO:",null,null,{"$f":"IF($D$41=$C$43,$D$43,IF($D$41=$C$44,$D$44,IF($D$41=$C$44,$D$44,IF($D$41=$C$45,$D$45,0))))","v":24.67}]
[]
[null,null,"Legislação Municipal:","Lei Municipal nº 1.576/2009 e Lei Complementar nº 01/2019"]
[null,null,"Município:","Corinto"]
[null,null,"Alíquota ISSQN:",0.05,"Município"]
[null,null,"Base de Cálculo:",1,"Art. 90 e 91"]
[null,null,"Valor Serviço:",1182708.1499999999]
[null,null,"Dedução - Material (estimado):",0,{"$f":"D33/D32","v":0}]
[null,null,"ISSQN BDI:",{"$f":"IF(D32=\"\",0,ROUND(IF(D31=D49,((1-(D33/D32))*D30),D30*D31),4))","v":0.05},"(*)"]
[]
["Acórdão nº 2.622/2013 - TCU Plenário"]
["BDI = ARRED((((((1+(AC+TR)/100)*(1+DF/100)*(1+L/100))/(1-IMP/100))-1)*100);2)"]
[]
[null,"(*) É obrigação da licitante a verificação da Legislação Tributária vigente no município, bem como o cálculo dos valores totais de serviços e materiais estimados, para apresentação de sua proposta."]
[]
[null,null,"Forma de Cálculo do BDI:","BDI - Acórdão nº 2.622/2013 - TCU"]
[]
[null,null,"BDI - Digitado",{"$f":"ROUND(E6+E11+E17+E22+E24,2)","v":13.38}]
[null,null,"BDI - Calculado",{"$f":"ROUND((((1+(E6/100+E22/100+E17/100))/(1-(D11/100+E24/100)))-1)*100,2)","v":26.21}]
[null,null,"BDI - Acórdão nº 2.622/2013 - TCU",{"$f":"ROUND((((((1+(E6+E17)/100)*(1+E22/100)*(1+E24/100))/(1-D11/100))-1)*100),2)","v":24.67}]
[]
[]
[]
[null,null,null,"Dedução - Material","Município"]
[null,null,null,0.1,"Simples Nacional"]
[null,null,null,0.2,"Municípios Indefinidos"]
[null,null,null,0.3]
[null,null,null,0.4]
[null,null,null,0.5]
[null,null,null,0.6]
[null,null,null,0.7]
[null,null,null,0.8]
[null,null,null,0.9]
[null,null,null,1]
[null,null,null,{"$f":"E31","v":"Art. 90 e 91"}]

{"sheet":"BDI FORN","index":4,"n_rows":37,"n_cols":5,"rows_kept":37,"cut":false,"hidden":false,"merged":[[31,1,31,2],[32,0,34,5],[36,0,36,5],[0,1,2,4],[3,1,4,1],[3,2,4,2],[28,0,28,5],[30,1,30,2]]}
[null,"DETALHAMENTO DO BDI - FORNECIMENTO \n(MATERIAL ASFÁLTICO)"]
[]
[]
[null,"Item","Descrição dos Serviços","%","%"]
[null,null,null,"PV","CD"]
[]
[null,1,"ADMINISTRAÇÃO CENTRAL"," ",3.45]
[null,"1.1","ESCRITÓRIO CENTRAL"," "," "]
[null,"1.2","VIAGENS"," "," "]
[null,"1.3","OUTROS"," "," "]
[null," "," "," "," "]
[null,2,"IMPOSTOS E TAXAS",{"$f":"SUM(D13:D16)","v":3.65},{"$f":"SUM(E13:E16)","v":4.5600000000000005}]
[null,"2.1","ISS (*)",null,{"$f":"ROUND(D13*1.2515,2)","v":0}]
[null,"2.2","PIS",0.65,{"$f":"ROUND(D14*1.2515,2)","v":0.81}]
[null,"2.3","Cofins",3,{"$f":"ROUND(D15*1.2515,2)","v":3.75}]
[null,"2.4","CONTRIBUIÇÃO PREVIDENCIÁRIA SOBRE A RENDA BRUTA",0,{"$f":"ROUND(D16*1.2515,2)","v":0}]
[]
[null,3,"TAXA DE RISCO"," ",{"$f":"SUM(E19:E22)","v":1.08}]
[null,"3.1","SEGURO",null,0.24]
[null,"3.2","RISCO",null,0.6]
[null,"3.3","GARANTIA",null,0.24]
[]
[null,4,"DESPESAS FINANCEIRAS"," ",0.85]
[]
[null,5,"LUCRO",null,5.1100000000000003]
[]
[null," ","BDI - CALCULADO"," ",{"$f":"ROUND((((1+(E7+E18)/100)*(1+E23/100)*(1+E25/100)/(1-D12/100)-1)*100),2)","v":15}]
[]
["BDI = ((1+((AC+S+R+G)/100))x(1+DF/100)x(1+L/100)/(1-I/100)-1)*100"]
[]
[null,"BDI (CALCULADO):",null,{"$f":"ROUND((((1+((E7+E18)/100))*(1+E23/100)*(1+E25/100))/(1-D12/100)-1)*100,2)","v":15},"%"]
[null," "]
[]
[]
[]
[]
["BDI EM CONFORMIDADE COM OS ACÓRDÃOS Nº 2369/2011 e ACÓRDÃO Nº 2.622/2013 - TCU - PLENÁRIO"]

{"sheet":"CRONOGRAMA","index":5,"n_rows":19,"n_cols":12,"rows_kept":19,"cut":false,"hidden":false,"merged":[[0,1,0,11],[1,1,2,1],[1,2,2,4],[1,6,1,11],[2,6,2,11],[9,0,10,0],[9,1,10,1],[9,2,10,2],[3,1,3,10],[5,0,6,0],[5,1,6,1],[5,2,6,2],[7,0,8,0],[7,1,8,1],[7,2,8,2],[15,1,16,2],[18,1,22,11],[11,0,12,0],[11,1,12,1],[11,2,12,2],[13,0,14,0],[13,1,14,1],[13,2,14,2]]}
[null,"CRONOGRAMA FÍSICO-FINANCEIRO"]
[null,"OBRA: ",{"$f":"ORÇAMENTO!C5","v":"PAVIMENTAÇÃO ASFÁLTICA EM CBUQ - VIAS URBANAS DIVERSAS - BAIRRO MAJOR SALVO (CORINTO / MG)"},null,null,"VALOR:",{"$f":"ORÇAMENTO!L41","v":1999943.2300000002}]
[{"$nulls":5},"PRAZO: ","180 DIAS "]
[]
[null,"ITEM","ETAPAS/DESCRIÇAO","FISICO/  FINANCEIRO","TOTAL    ETAPAS","MÊS 1","MÊS 2","MÊS 3","MÊS 4","MÊS 5","MÊS 6","TOTAL"]
["A",{"$f":"VLOOKUP(A6,ORÇAMENTO!$A$10:$L$41,2)","v":1},{"$f":"VLOOKUP(A6,ORÇAMENTO!$A$10:$L$41,5)","v":"SERVIÇOS PRELIMINARES "},"FISICO ",{"$f":"ROUND(E7/$G$2,4)","v":9.3700000000000006E-2},0.25,0.15,0.15,0.15,0.15,0.15,{"$f":"SUM(F6:K6)","v":1}]
[null,null,null,"FINANCEIRO",{"$f":"ORÇAMENTO!L10","v":187368.30000000002},{"$f":"ROUND($E$7*F6,2)","v":46842.080000000002},{"$f":"ROUND($E$7*G6,2)","v":28105.25},{"$f":"ROUND($E$7*H6,2)","v":28105.25},{"$f":"ROUND($E$7*I6,2)","v":28105.25},28105.25,28105.25,{"$f":"SUM(F7:K7)","v":187368.33000000002}]
["B",{"$f":"VLOOKUP(A8,ORÇAMENTO!$A$10:$L$41,2)","v":2},{"$f":"VLOOKUP(A8,ORÇAMENTO!$A$10:$L$41,5)","v":"TERRAPLANAGEM E PAVIMENTAÇÃO"},"FISICO ",{"$f":"ROUND(E9/$G$2,4)","v":0.34970000000000001},0.1,0.2,0.2,0.2,0.2,0.1,{"$f":"SUM(F8:K8)","v":0.99999999999999989}]
[null,null,null,"FINANCEIRO",{"$f":"ORÇAMENTO!L16","v":699394.87000000011},{"$f":"ROUND($E$9*F8,2)","v":69939.490000000005},{"$f":"ROUND($E$9*G8,2)","v":139878.97},{"$f":"ROUND($E$9*H8,2)","v":139878.97},{"$f":"ROUND($E$9*I8,2)","v":139878.97},139878.97,69939.490000000005,{"$f":"SUM(F9:K9)","v":699394.86}]
["C",{"$f":"VLOOKUP(A10,ORÇAMENTO!$A$10:$L$41,2)","v":3},{"$f":"VLOOKUP(A10,ORÇAMENTO!$A$10:$L$41,5)","v":"TRANSPORTE DE MATERIAIS"},"FISICO ",{"$f":"ROUND(E11/$G$2,4)","v":0.12790000000000001},0.25,0.5,0.25,null,null,null,{"$f":"SUM(F10:K10)","v":1}]
[null,null,null,"FINANCEIRO",{"$f":"ORÇAMENTO!L23","v":255850.46999999997},{"$f":"ROUND($E$11*F10,2)","v":63962.62},{"$f":"ROUND($E$11*G10,2)","v":127925.24},{"$f":"ROUND($E$11*H10,2)","v":63962.62},{"$f":"ROUND($E$11*I10,2)","v":0},0,0,{"$f":"SUM(F11:K11)-0.04","v":255850.44}]
["E",{"$f":"VLOOKUP(A12,ORÇAMENTO!$A$10:$L$41,2)","v":4},{"$f":"VLOOKUP(A12,ORÇAMENTO!$A$10:$L$41,5)","v":"DRENAGEM E OBRAS COMPLEMENTARES"},"FISICO ",{"$f":"ROUND(E13/$G$2,4)","v":0.1653},0.1,0.2,0.2,0.2,0.2,0.1,{"$f":"SUM(F12:K12)","v":0.99999999999999989}]
[null,null,null,"FINANCEIRO",{"$f":"ORÇAMENTO!L29","v":330559.87},{"$f":"ROUND($E$13*F12,2)","v":33055.99},{"$f":"ROUND($E$13*G12,2)","v":66111.97},{"$f":"ROUND($E$13*H12,2)","v":66111.97},{"$f":"ROUND($E$13*I12,2)","v":66111.97},66111.97,33055.99,{"$f":"SUM(F13:K13)-0.02","v":330559.83999999997}]
["F",{"$f":"VLOOKUP(A14,ORÇAMENTO!$A$10:$L$41,2)","v":5},{"$f":"VLOOKUP(A14,ORÇAMENTO!$A$10:$L$41,5)","v":"FORNECIMENTOS - MATERIAL ASFÁLTICO (BDI DIFERENCIADO)"},"FISICO ",{"$f":"ROUND(E15/$G$2,4)","v":0.26340000000000002},null,0.2,0.2,0.2,0.2,0.2,{"$f":"SUM(F14:K14)","v":1}]
[null,null,null,"FINANCEIRO",{"$f":"ORÇAMENTO!L34","v":526769.72},{"$f":"ROUND($E$15*F14,2)","v":0},105353.94,105353.94,105353.94,105353.94,105353.94,{"$f":"SUM(F15:K15)-0.02","v":526769.67999999993}]
[null,"TOTAL",null,"FISICO ",{"$f":"SUM(F16:K16)","v":1},{"$f":"F17/$E$17","v":0.10690312444518738},{"$f":"G17/$E$17","v":0.23369431841322816},{"$f":"H17/$E$17","v":0.20171210059797548},{"$f":"I17/$E$17","v":0.1697298827827228},0.1697298827827228,0.11823069097816341,{"$f":"SUM(F16:K16)","v":1}]
[null,null,null,"FINANCEIRO",{"$f":"E11+E9+E7+E15+E13","v":1999943.23},{"$f":"F11+F9+F7+F15+F13","v":213800.18},{"$f":"G11+G9+G7+G15+G13","v":467375.37},403412.75,339450.13,339450.13,236454.66999999998,{"$f":"SUM(F17:K17)-0.01","v":1999943.22}]
[]
[null,"OBSERVAÇÕES:"]