{"text_format":"2","workbook":"xlsx","n_sheets":6,"sheets":["ORÇAMENTO","CPU-SERV","CPU-FORNEC","BDI SERV","BDI FORN","CRONOGRAMA"],"not_rendered":{"charts":0,"images":3,"macros":0,"external_links":1,"defined_names":8,"comments":2,"pivot_tables":0},"unopened":[],"bounds":{"document_bytes":16777216,"sheet_cells":100000,"run_cost":"one","rows_first":2000,"rows_last":500,"rows_between":2000,"halvings":0,"cell_chars":16384,"cell_head_chars":4096},"cells_cut":0,"cells_raw":0,"read":"whole","date_system":"1900"}

{"sheet":"ORÇAMENTO","index":0,"n_rows":41,"n_cols":12,"rows_kept":41,"cut":false,"hidden":false,"merged":[[40,1,40,4],[40,14,40,15],[0,0,8,0],[0,4,0,11],[1,4,1,11],[2,4,2,11],[9,14,9,15],[4,2,4,8],[4,9,4,10],[5,2,5,7],[5,8,5,10],[6,8,6,10],[7,1,7,11],[6,1,6,7],[6,14,8,15]]}
["<---- NUMERAR SERVIÇOS PARA CPU",null,null,null,"Ministério do Desenvolvimento Regional"]
[{"$nulls":4},"Companhia de Desenvolvimento dos Vales do São Francisco e do Parnaíba"]
[{"$nulls":4},"1ª Superintendência Regional"]
[]
[null,"OBRA: ","PAVIMENTAÇÃO ASFÁLTICA EM CBUQ - VIAS URBANAS DIVERSAS - BAIRRO MAJOR SALVO (CORINTO / MG)",{"$nulls":6},"BDI Serviços (%):",null,{"$f":"'BDI SERV'!E26","v":24.67}]
[null,"DATA:"," ABRIL/2025",null," JULHO / 2024",null,null,null,"BDI Diferenciado Serviços (%):",null,null,{"$f":"'BDI FORN'!D31","v":15}]
[null,"PRAZO DE EXECUÇÃO:     180 DIAS",{"$nulls":6},"BDI Fornecimentos (%):",null,null,{"$f":"'BDI FORN'!D31","v":15}]
[null,"PLANILHA DE ORÇAMENTAÇÃO"]
[null,"ITEM","CÓDIGO","FONTE","DISCRIMINAÇÃO","TIPO","UNID.","QUANT.","VR. UNIT.S/BDI","PR. UNIT.C/BDI","C. TOT.S/BDI","P. TOT.C/BDI"]
["A",1,null,null,"SERVIÇOS PRELIMINARES ",{"$nulls":6},{"$f":"SUM(L11:L15)","v":187368.30000000002}]
{"$rows_left_out":32}
{"sheet":"CPU-SERV","index":1,"n_rows":1680,"n_cols":11,"rows_kept":1680,"cut":false,"hidden":false,"merged":[[1477,11,1477,12],[1478,2,1478,9],[1478,11,1478,12],[1444,7,1444,9],[1450,3,1450,7],[1451,7,1451,9],[1479,1,1480,3],[1479,4,1479,5],[1480,4,1480,5],[1481,2,1481,7],[1455,3,1455,7],[1457,8,1457,9],[1464,3,1464,7],[1465,1,1466,2],[1465,3,1466,3],[1465,4,1466,4],[1465,5,1465,7],[1465,9,1466,9],[1524,3,1524,7],[1525,5,1525,7],[1506,3,1506,7],[1508,8,1508,9],[1515,3,1515,7],[1516,1,1517,2],[1516,3,1517,3],[1516,4,1517,4],[1516,5,1516,7],[1516,9,1517,9],[1501,3,1501,7],[1502,7,1502,9],[1430,2,1430,7],[1473,3,1473,7],[1474,5,1474,7],[1477,0,1526,0],[1399,3,1399,7],[1400,7,1400,9],[1490,3,1490,7],[1491,3,1491,7],[1492,3,1492,7],[1495,7,1495,9],[1487,7,1487,9],[1385,7,1385,9],[1439,3,1439,7],[1440,3,1440,7],[1441,3,1441,7],[1324,0,1373,0],[1426,0,1475,0],[1430,8,1430,9],[1431,1,1432,2],[1431,3,1432,3],[1431,4,1431,5],[1431,6,1431,7],[1436,7,1436,9],[1422,3,1422,7],[1423,5,1423,7],[1481,8,1481,9],[1482,1,1483,2],[1482,3,1483,3],[1482,4,1482,5],[1482,6,1482,7],[1428,4,1428,5],[1429,4,1429,5],[1324,11,1324,12],[1325,2,1325,9],[1325,11,1325,12],[1326,1,1327,3],[1326,4,1326,5],[1327,4,1327,5],[1328,2,1328,7],[1371,3,1371,7],[1372,5,1372,7],[1375,0,1424,0],[1375,11,1375,12],[1376,2,1376,9],[1376,11,1376,12],[1377,1,1378,3],[1377,4,1377,5],[1378,4,1378,5],[1379,2,1379,7],[1353,3,1353,7],[1355,8,1355,9],[1362,3,1362,7],[1363,1,1364,2],[1363,3,1364,3],[1380,1,1381,2],[1380,3,1381,3],[1380,4,1380,5],[1380,6,1380,7],[1414,5,1414,7],[1414,9,1415,9],[1388,3,1388,7],[1389,3,1389,7],[1390,3,1390,7],[1393,7,1393,9],[1426,11,1426,12],[1427,2,1427,9],[1427,11,1427,12],[1428,1,1429,3],[1363,4,1364,4],[1363,5,1363,7],[1363,9,1364,9],[1404,3,1404,7],[1406,8,1406,9],[1413,3,1413,7],[1414,1,1415,2],[1414,3,1415,3],[1414,4,1415,4],[1379,8,1379,9],[1278,3,1279,3],[1278,4,1278,5],[1278,6,1278,7],[1283,7,1283,9],[1337,3,1337,7],[1338,3,1338,7],[1339,3,1339,7],[1342,7,1342,9],[1348,3,1348,7],[1349,7,1349,9],[1328,8,1328,9],[1329,1,1330,2],[1329,3,1330,3],[1329,4,1329,5],[1329,6,1329,7],[1334,7,1334,9],[1320,3,1320,7],[1321,5,1321,7],[1273,0,1322,0],[1273,11,1273,12],[1274,2,1274,9],[1274,11,1274,12],[1275,1,1276,3],[1275,4,1275,5],[1276,4,1276,5],[1277,2,1277,7],[1251,3,1251,7],[1253,8,1253,9],[1260,3,1260,7],[1261,1,1262,2],[1261,3,1262,3],[1261,4,1262,4],[1261,5,1261,7],[1261,9,1262,9],[1302,3,1302,7],[1304,8,1304,9],[1311,3,1311,7],[1312,1,1313,2],[1312,3,1313,3],[1312,4,1313,4],[1312,5,1312,7],[1312,9,1313,9],[1286,3,1286,7],[1287,3,1287,7],[1288,3,1288,7],[1291,7,1291,9],[1297,3,1297,7],[1298,7,1298,9],[1277,8,1277,9],[1278,1,1279,2],[1240,7,1240,9],[1246,3,1246,7],[1247,7,1247,9],[1226,8,1226,9],[1227,1,1228,2],[1227,3,1228,3],[1227,4,1227,5],[1227,6,1227,7],[1232,7,1232,9],[1218,3,1218,7],[1219,5,1219,7],[1222,0,1271,0],[1222,11,1222,12],[1223,2,1223,9],[1223,11,1223,12],[1224,1,1225,3],[1224,4,1224,5],[1225,4,1225,5],[1226,2,1226,7],[1269,3,1269,7],[1270,5,1270,7],[1235,3,1235,7],[1236,3,1236,7],[1237,3,1237,7],[1210,5,1210,7],[1210,9,1211,9],[1184,3,1184,7],[1185,3,1185,7],[1186,3,1186,7],[1189,7,1189,9],[1195,3,1195,7],[1196,7,1196,9],[1175,8,1175,9],[1176,1,1177,2],[1176,3,1177,3],[1176,4,1176,5],[1176,6,1176,7],[1181,7,1181,9],[1074,3,1075,3],[1074,4,1074,5],[1074,6,1074,7],[1079,7,1079,9],[1133,3,1133,7],[1134,3,1134,7],[1135,3,1135,7],[1138,7,1138,9],[1144,3,1144,7],[1145,7,1145,9],[1124,8,1124,9],[1125,1,1126,2],[1125,3,1126,3],[1125,4,1125,5],[1125,6,1125,7],[1130,7,1130,9],[1116,3,1116,7],[1117,5,1117,7],[1120,0,1169,0],[1120,11,1120,12],[1121,2,1121,9],[1121,11,1121,12],[1122,1,1123,3],[1122,4,1122,5],[1123,4,1123,5],[1124,2,1124,7],[1167,3,1167,7],[1168,5,1168,7],[1171,0,1220,0],[1171,11,1171,12],[1172,2,1172,9],[1172,11,1172,12],[1173,1,1174,3],[1173,4,1173,5],[1174,4,1174,5],[1175,2,1175,7],[1149,3,1149,7],[1151,8,1151,9],[1158,3,1158,7],[1159,1,1160,2],[1159,3,1160,3],[1159,4,1160,4],[1159,5,1159,7],[1159,9,1160,9],[1200,3,1200,7],[1202,8,1202,9],[1209,3,1209,7],[1210,1,1211,2],[1210,3,1211,3],[1210,4,1211,4],[1069,0,1118,0],[1069,11,1069,12],[1070,2,1070,9],[1070,11,1070,12],[1071,1,1072,3],[1071,4,1071,5],[1072,4,1072,5],[1073,2,1073,7],[1047,3,1047,7],[1049,8,1049,9],[1056,3,1056,7],[1057,1,1058,2],[1057,3,1058,3],[1057,4,1058,4],[1057,5,1057,7],[1057,9,1058,9],[1098,3,1098,7],[1100,8,1100,9],[1107,3,1107,7],[1108,1,1109,2],[1108,3,1109,3],[1108,4,1109,4],[1108,5,1108,7],[1108,9,1109,9],[1082,3,1082,7],[1083,3,1083,7],[1020,4,1020,5],[1021,4,1021,5],[1022,2,1022,7],[1065,3,1065,7],[1066,5,1066,7],[1006,5,1006,7],[1006,9,1007,9],[980,3,980,7],[981,3,981,7],[982,3,982,7],[985,7,985,9],[991,3,991,7],[992,7,992,9],[1084,3,1084,7],[1087,7,1087,9],[1093,3,1093,7],[1094,7,1094,9],[1073,8,1073,9],[1074,1,1075,2],[1036,7,1036,9],[1042,3,1042,7],[1043,7,1043,9],[1022,8,1022,9],[1023,1,1024,2],[1023,3,1024,3],[1023,4,1023,5],[1023,6,1023,7],[1028,7,1028,9],[1014,3,1014,7],[1015,5,1015,7],[977,7,977,9],[1031,3,1031,7],[1032,3,1032,7],[1033,3,1033,7],[916,0,965,0],[916,11,916,12],[917,2,917,9],[917,11,917,12],[918,1,919,3],[918,4,918,5],[919,4,919,5],[920,2,920,7],[963,3,963,7],[964,5,964,7],[967,0,1016,0],[967,11,967,12],[968,2,968,9],[968,11,968,12],[969,1,970,3],[969,4,969,5],[970,4,970,5],[971,2,971,7],[945,3,945,7],[947,8,947,9],[954,3,954,7],[955,1,956,2],[955,3,956,3],[1018,0,1067,0],[1018,11,1018,12],[1019,2,1019,9],[1019,11,1019,12],[1020,1,1021,3],[955,4,956,4],[955,5,955,7],[955,9,956,9],[996,3,996,7],[998,8,998,9],[1005,3,1005,7],[1006,1,1007,2],[1006,3,1007,3],[1006,4,1007,4],[870,3,871,3],[870,4,870,5],[870,6,870,7],[875,7,875,9],[929,3,929,7],[930,3,930,7],[931,3,931,7],[934,7,934,9],[940,3,940,7],[941,7,941,9],[920,8,920,9],[921,1,922,2],[921,3,922,3],[921,4,921,5],[921,6,921,7],[926,7,926,9],[912,3,912,7],[913,5,913,7],[971,8,971,9],[972,1,973,2],[972,3,973,3],[972,4,972,5],[972,6,972,7],[865,0,914,0],[865,11,865,12],[866,2,866,9],[866,11,866,12],[867,1,868,3],[867,4,867,5],[868,4,868,5],[869,2,869,7],[847,3,847,7],[849,8,849,9],[854,3,854,7],[855,1,856,2],[855,3,856,3],[855,4,856,4],[855,5,855,7],[855,9,856,9],[894,3,894,7],[896,8,896,9],[903,3,903,7],[904,1,905,2],[904,3,905,3],[904,4,905,4],[904,5,904,7],[904,9,905,9],[878,3,878,7],[879,3,879,7],[880,3,880,7],[883,7,883,9],[889,3,889,7],[890,7,890,9],[869,8,869,9],[870,1,871,2],[809,3,810,3],[809,4,810,4],[809,5,809,7],[809,9,810,9],[832,3,832,7],[833,3,833,7],[834,3,834,7],[837,7,837,9],[843,3,843,7],[844,7,844,9],[823,8,823,9],[824,1,825,2],[824,3,825,3],[824,4,824,5],[824,6,824,7],[829,7,829,9],[819,0,863,0],[820,2,820,9],[821,1,822,3],[821,4,821,5],[822,4,822,5],[823,2,823,7],[861,3,861,7],[862,5,862,7],[769,3,769,7],[770,5,770,7],[734,0,771,0],[735,2,735,9],[736,1,737,3],[736,4,736,5],[737,4,737,5],[738,2,738,7],[786,3,786,7],[787,3,787,7],[788,3,788,7],[791,7,791,9],[797,3,797,7],[798,7,798,9],[777,8,777,9],[778,1,779,2],[778,3,779,3],[778,4,778,5],[778,6,778,7],[783,7,783,9],[773,0,817,0],[774,2,774,9],[775,1,776,3],[775,4,775,5],[776,4,776,5],[777,2,777,7],[815,3,815,7],[816,5,816,7],[801,3,801,7],[803,8,803,9],[808,3,808,7],[809,1,810,2],[759,3,759,7],[761,8,761,9],[764,3,764,7],[765,1,766,2],[765,3,766,3],[765,4,766,4],[765,5,765,7],[765,9,766,9],[747,3,747,7],[748,3,748,7],[749,3,749,7],[752,7,752,9],[755,3,755,7],[756,7,756,9],[738,8,738,9],[739,1,740,2],[739,3,740,3],[739,4,739,5],[739,6,739,7],[744,7,744,9],[730,3,730,7],[731,5,731,7],[694,0,732,0],[695,2,695,9],[696,1,697,3],[696,4,696,5],[697,4,697,5],[698,2,698,7],[686,3,687,3],[686,4,687,4],[686,5,686,7],[686,9,687,9],[720,3,720,7],[722,8,722,9],[725,3,725,7],[726,1,727,2],[726,3,727,3],[726,4,727,4],[726,5,726,7],[726,9,727,9],[708,3,708,7],[709,3,709,7],[710,3,710,7],[713,7,713,9],[716,3,716,7],[717,7,717,9],[698,8,698,9],[699,1,700,2],[699,3,700,3],[699,4,699,5],[699,6,699,7],[704,7,704,9],[668,3,668,7],[669,3,669,7],[670,3,670,7],[673,7,673,9],[676,3,676,7],[677,7,677,9],[659,8,659,9],[660,1,661,2],[660,3,661,3],[660,4,660,5],[660,6,660,7],[665,7,665,9],[651,3,651,7],[652,5,652,7],[655,0,692,0],[656,2,656,9],[657,1,658,3],[657,4,657,5],[658,4,658,5],[659,2,659,7],[690,3,690,7],[691,5,691,7],[616,0,653,0],[617,2,617,9],[618,1,619,3],[618,4,618,5],[619,4,619,5],[620,2,620,7],[680,3,680,7],[682,8,682,9],[685,3,685,7],[686,1,687,2],[514,3,514,7],[641,3,641,7],[643,8,643,9],[646,3,646,7],[647,1,648,2],[647,3,648,3],[647,4,648,4],[647,5,647,7],[647,9,648,9],[629,3,629,7],[630,3,630,7],[631,3,631,7],[634,7,634,9],[637,3,637,7],[638,7,638,9],[620,8,620,9],[621,1,622,2],[621,3,622,3],[621,4,621,5],[621,6,621,7],[626,7,626,9],[529,3,529,7],[530,9,531,9],[530,4,531,4],[530,5,530,7],[568,3,568,7],[569,1,570,2],[569,3,570,3],[599,7,599,9],[581,8,581,9],[582,1,583,2],[582,3,583,3],[582,4,582,5],[582,6,582,7],[587,7,587,9],[534,3,534,7],[535,5,535,7],[577,0,614,0],[578,2,578,9],[579,1,580,3],[579,4,579,5],[580,4,580,5],[581,2,581,7],[612,3,612,7],[613,5,613,7],[499,0,536,0],[500,2,500,9],[501,1,502,3],[501,4,501,5],[502,4,502,5],[602,3,602,7],[604,8,604,9],[607,3,607,7],[608,1,609,2],[608,3,609,3],[530,1,531,2],[530,3,531,3],[608,4,609,4],[608,5,608,7],[608,9,609,9],[381,3,381,7],[384,7,384,9],[387,3,387,7],[388,7,388,9],[385,7,385,8],[509,7,509,9],[590,3,590,7],[591,3,591,7],[592,3,592,7],[595,7,595,9],[598,3,598,7],[503,2,503,7],[433,8,433,9],[436,3,436,7],[437,1,438,2],[437,3,438,3],[437,4,438,4],[437,5,437,7],[437,9,438,9],[487,1,488,2],[487,3,488,3],[487,4,488,4],[487,5,487,7],[487,9,488,9],[477,3,477,7],[479,8,479,9],[486,3,486,7],[512,3,512,7],[470,7,470,8],[496,5,496,7],[524,3,524,7],[526,8,526,9],[431,3,431,7],[495,3,495,7],[517,7,517,9],[520,3,520,7],[521,7,521,9],[504,1,505,2],[504,3,505,3],[504,4,504,5],[504,6,504,7],[405,0,443,0],[406,2,406,9],[407,1,408,3],[407,4,407,5],[408,4,408,5],[409,2,409,7],[441,3,441,7],[442,5,442,7],[503,8,503,9],[419,3,419,7],[420,3,420,7],[421,3,421,7],[424,7,424,9],[427,3,427,7],[428,7,428,9],[409,8,409,9],[410,1,411,2],[410,3,411,3],[410,4,410,5],[410,6,410,7],[416,7,416,9],[475,7,475,9],[513,3,513,7],[366,0,403,0],[367,2,367,9],[368,1,369,3],[368,4,368,5],[369,4,369,5],[370,2,370,7],[352,3,352,7],[354,8,354,9],[357,3,357,7],[358,1,359,2],[358,3,359,3],[358,4,359,4],[358,5,358,7],[358,9,359,9],[391,3,391,7],[393,8,393,9],[396,3,396,7],[397,1,398,2],[397,3,398,3],[397,4,398,4],[397,5,397,7],[397,9,398,9],[379,3,379,7],[370,8,370,9],[371,1,372,2],[371,3,372,3],[371,4,371,5],[371,6,371,7],[376,7,376,9],[401,3,401,7],[402,5,402,7],[380,3,380,7],[340,3,340,7],[341,3,341,7],[342,3,342,7],[345,7,345,9],[348,3,348,7],[349,7,349,9],[331,8,331,9],[332,1,333,2],[332,3,333,3],[332,4,332,5],[332,6,332,7],[337,7,337,9],[327,0,364,0],[328,2,328,9],[329,1,330,3],[329,4,329,5],[330,4,330,5],[331,2,331,7],[362,3,362,7],[363,5,363,7],[346,7,346,8],[313,3,313,7],[315,8,315,9],[318,3,318,7],[319,1,320,2],[319,3,320,3],[319,4,320,4],[319,5,319,7],[319,9,320,9],[278,5,278,7],[278,9,279,9],[260,3,260,7],[261,3,261,7],[248,6,248,7],[257,7,257,9],[301,3,301,7],[302,3,302,7],[303,3,303,7],[306,7,306,9],[309,3,309,7],[310,7,310,9],[290,8,290,9],[291,1,292,2],[291,3,292,3],[291,4,291,5],[291,6,291,7],[298,7,298,9],[282,3,282,7],[283,5,283,7],[262,3,262,7],[265,7,265,9],[268,3,268,7],[269,7,269,9],[247,8,247,9],[248,1,249,2],[248,3,249,3],[248,4,248,5],[209,6,209,7],[214,7,214,9],[239,3,239,7],[240,5,240,7],[219,3,219,7],[222,7,222,9],[225,3,225,7],[226,7,226,9],[286,0,325,0],[287,2,287,9],[288,1,289,3],[288,4,288,5],[289,4,289,5],[290,2,290,7],[323,3,323,7],[324,5,324,7],[243,0,284,0],[244,2,244,9],[245,1,246,3],[245,4,245,5],[246,4,246,5],[247,2,247,7],[272,3,272,7],[274,8,274,9],[277,3,277,7],[278,1,279,2],[278,3,279,3],[278,4,279,4],[204,0,241,0],[205,2,205,9],[206,1,207,3],[206,4,206,5],[207,4,207,5],[208,2,208,7],[190,3,190,7],[192,8,192,9],[195,3,195,7],[196,1,197,2],[196,3,197,3],[196,4,197,4],[196,5,196,7],[196,9,197,9],[229,3,229,7],[231,8,231,9],[234,3,234,7],[235,1,236,2],[235,3,236,3],[235,4,236,4],[235,5,235,7],[235,9,236,9],[217,3,217,7],[218,3,218,7],[208,8,208,9],[209,1,210,2],[209,3,210,3],[209,4,209,5],[163,0,202,0],[200,3,200,7],[201,5,201,7],[178,3,178,7],[179,3,179,7],[180,3,180,7],[183,7,183,9],[186,3,186,7],[187,7,187,9],[167,8,167,9],[168,1,169,2],[168,3,169,3],[168,4,168,5],[168,6,168,7],[173,7,173,9],[164,2,164,9],[165,1,166,3],[165,4,165,5],[166,4,166,5],[167,2,167,7],[151,8,151,9],[154,3,154,7],[155,1,156,2],[155,3,156,3],[155,4,156,4],[155,5,155,7],[155,9,156,9],[136,3,136,7],[137,3,137,7],[140,7,140,9],[145,3,145,7],[146,7,146,9],[149,3,149,7],[127,1,128,2],[127,3,128,3],[127,4,127,5],[127,6,127,7],[132,7,132,9],[135,3,135,7],[119,5,119,7],[122,0,161,0],[123,2,123,9],[124,1,125,3],[124,4,124,5],[125,4,125,5],[126,2,126,7],[126,8,126,9],[159,3,159,7],[160,5,160,7],[114,1,115,2],[114,3,115,3],[114,4,115,4],[114,5,114,7],[114,9,115,9],[118,3,118,7],[93,7,93,9],[98,3,98,7],[101,7,101,9],[104,3,104,7],[105,7,105,9],[108,3,108,7],[83,0,120,0],[84,2,84,9],[85,1,86,3],[86,4,86,5],[87,2,87,7],[87,8,87,9],[88,1,89,2],[110,8,110,9],[113,3,113,7],[96,3,96,7],[97,3,97,7],[88,3,89,3],[88,4,88,5],[88,6,88,7],[79,3,79,7],[80,5,80,7],[85,4,85,5],[74,3,74,7],[75,1,76,2],[75,3,76,3],[75,4,76,4],[75,5,75,7],[75,9,76,9],[57,3,57,7],[60,7,60,9],[63,3,63,7],[64,7,64,9],[69,3,69,7],[71,8,71,9],[44,3,45,3],[44,4,44,5],[44,6,44,7],[49,7,49,9],[55,3,55,7],[56,3,56,7],[41,1,42,3],[41,4,41,5],[42,4,42,5],[43,2,43,7],[43,8,43,9],[44,1,45,2],[0,0,37,0],[3,4,3,5],[0,11,0,12],[1,11,1,12],[2,4,2,5],[1,2,1,9],[2,1,3,3],[31,3,32,3],[31,4,32,4],[31,5,31,7],[31,9,32,9],[35,3,35,7],[36,5,36,7],[10,7,10,9],[13,3,13,7],[14,3,14,7],[15,3,15,7],[18,7,18,9],[30,3,30,7],[31,1,32,2],[22,7,22,9],[25,3,25,7],[2,10,2,11],[1567,5,1567,7],[1567,9,1568,9],[1575,3,1575,7],[1576,5,1576,7],[27,8,27,9],[21,3,21,7],[4,2,4,7],[4,8,4,9],[5,1,6,2],[5,3,6,3],[5,4,5,5],[5,6,5,7],[445,0,497,0],[446,2,446,9],[447,1,448,3],[447,4,447,5],[448,4,448,5],[449,2,449,7],[449,8,449,9],[450,1,451,2],[450,3,451,3],[450,4,450,5],[450,6,450,7],[458,7,458,9],[460,3,460,7],[461,3,461,7],[462,3,462,7],[465,7,465,9],[474,3,474,7],[39,0,81,0],[40,2,40,9],[538,0,575,0],[1579,11,1579,12],[1581,4,1581,5],[1592,3,1592,7],[1593,3,1593,7],[1579,0,1628,0],[1580,2,1580,9],[1528,0,1577,0],[1528,11,1528,12],[1529,2,1529,9],[1529,11,1529,12],[1530,1,1531,3],[1530,4,1530,5],[1531,4,1531,5],[1532,2,1532,7],[1532,8,1532,9],[1533,1,1534,2],[1533,3,1534,3],[1533,4,1533,5],[1533,6,1533,7],[1538,7,1538,9],[1541,3,1541,7],[1542,3,1542,7],[1543,3,1543,7],[1546,7,1546,9],[1552,3,1552,7],[1553,7,1553,9],[1557,3,1557,7],[1559,8,1559,9],[1566,3,1566,7],[1567,1,1568,2],[1567,3,1568,3],[1567,4,1568,4],[1661,8,1661,9],[1668,3,1668,7],[1669,1,1670,2],[1669,3,1670,3]],"merged_total":1076,"flags":["merged_cut"]}
[1,"1ª/GRD",{"$nulls":8},{"$f":"J37","v":10988.76}]
[null,"OBRA:","PAVIMENTAÇÃO ASFÁLTICA EM CBUQ - VIAS URBANAS DIVERSAS - BAIRRO MAJOR SALVO (CORINTO / MG)"]
[null,"Custo Unitário de Referência",null,null,"Minas Gerais"]
[{"$nulls":4}," Abril/2025",null,null,"Produção da equipe ",0.5,{"$f":"VLOOKUP(A1,ORÇAMENTO!$A$10:$L$41,7,1)","v":"GL"}]
[null,"CPU.1","MOBILIZAÇÃO E DESMOBILIZAÇÃO",{"$nulls":5},"Valores em reais (R$)"]
[null,"A - EQUIPAMENTOS",null,"Quantidade","Utilização",null,"Custo Horário",null,null,"Custo"]
[{"$nulls":4},"Operativa","Improdutiva","Produtivo","Improdutivo",null,"Horário Total"]
[null,"E9687","Caminhão carroceria com capacidade de 5 t - 115 kW",8,0.6,0.4,146.88079999999999,57.423099999999998,null,{"$f":"D8*(E8*G8+F8*H8)","v":888.78175999999996}]
[null,"E9575","Caminhão basculante com caçamba estanque com capacidade de 14 m³ - 210 kW",12,1,0,309.83940000000001,90.412199999999999,null,{"$f":"D9*(E9*G9+F9*H9)","v":3718.0727999999999}]
[{"$nulls":7},"Custo horário total de equipamentos",null,{"$f":"SUM(J8:J9)","v":4606.8545599999998}]
{"$rows_left_out":889}
{"sheet":"CPU-FORNEC","index":2,"n_rows":92,"n_cols":14,"rows_kept":92,"cut":false,"hidden":false,"merged":[[81,1,81,7],[82,0,91,0],[82,1,82,3],[82,4,82,7],[83,2,83,5],[84,2,84,3],[85,1,85,7],[88,1,88,3],[88,5,88,6],[89,1,89,6],[90,1,90,6],[91,1,91,6],[60,0,69,0],[60,1,60,3],[60,4,60,7],[61,2,61,5],[62,2,62,3],[63,1,63,7],[66,1,66,3],[66,5,66,6],[67,1,67,6],[68,1,68,6],[69,1,69,6],[38,0,47,0],[38,1,38,3],[38,4,38,7],[39,2,39,5],[40,2,40,3],[41,1,41,7],[44,1,44,3],[44,5,44,6],[45,1,45,6],[46,1,46,6],[47,1,47,6],[22,5,22,6],[23,1,23,6],[24,1,24,6],[25,1,25,6],[5,1,5,7],[9,1,9,7],[13,1,13,7],[17,1,17,7],[0,10,0,11],[1,2,1,5],[1,10,1,11],[2,2,2,3],[3,1,3,7],[27,4,27,7],[28,2,28,5],[27,0,36,0],[29,2,29,3],[30,1,30,7],[33,1,33,3],[33,5,33,6],[34,1,34,6],[35,1,35,6],[36,1,36,6],[0,0,26,0],[0,1,0,3],[0,4,0,7],[22,1,22,3],[49,0,58,0],[49,1,49,3],[49,4,49,7],[50,2,50,5],[51,2,51,3],[52,1,52,7],[55,1,55,3],[55,5,55,6],[56,1,56,6],[57,1,57,6],[58,1,58,6],[27,1,27,3],[71,0,80,0],[71,1,71,3],[71,4,71,7],[72,2,72,5],[73,2,73,3],[74,1,74,7],[77,1,77,3],[77,5,77,6],[78,1,78,6],[79,1,79,6],[80,1,80,6]]}
[1,"CODEVASF",null,null," COMPOSIÇÃO DE PREÇO UNITÁRIO",null,null,null,{"$f":"H24","v":0},{"$f":"H26","v":0},"BDI CALCULADO:",null,{"$f":"ORÇAMENTO!L6","v":15}]
[null,"OBRA:  ",0,null,null,null,"DATA: ",{"$f":"ORÇAMENTO!E6","v":" JULHO / 2024"},null,null,"BDI DIFERENCIADO:",null,{"$f":"'BDI FORN'!D31/100","v":0.15}]
[null,"SERVIÇO:  ","CPU.1",null,"Referência:","CODEVASF","UNIDADE: ",{"$f":"VLOOKUP(A1,ORÇAMENTO!A11:L30,5)","v":"MOBILIZAÇÃO E DESMOBILIZAÇÃO"}]
[]
[null,"TIPO ITEM","CODIGO ITEM","DESCRIÇÃO ITEM","UNIDADE ITEM","COEFICIENTE","PRECO UNITARIO","CUSTO TOTAL",null,"distancia =",90,"B.DESPACHO"]
[null,"EQUIPAMENTOS",{"$nulls":7},"Pá carregadeira ",null,null,10.1," ton"]
[null,null,"E9001","E9001","E9001",null,"E9001"]
[]
[]
[null,"MÃO DE OBRA"]
{"$rows_left_out":83}
{"sheet":"BDI SERV","index":3,"n_rows":60,"n_cols":5,"rows_kept":60,"cut":false,"hidden":false,"merged":[[35,0,35,5],[36,0,36,5],[38,1,38,4],[39,2,39,3],[0,1,2,4],[25,1,25,3],[26,1,26,2],[26,3,26,4],[27,3,27,4]]}
[null,"DETALHAMENTO DO BDI - SERVIÇOS"]
[]
[]
[null,"Item","Descrição dos Serviços","% - PV","% - CD"]
[]
[null,1,"ADMINISTRAÇÃO CENTRAL"," ",{"$f":"SUM(E7:E9)","v":4.01}]
[null,"1.1","ESCRITÓRIO CENTRAL",null,4.01]
[null,"1.2","VIAGENS"]
[null,"1.3","OUTROS"]
[null," "," "," "," "]
{"$rows_left_out":51}
{"sheet":"BDI FORN","index":4,"n_rows":37,"n_cols":5,"rows_kept":37,"cut":false,"hidden":false,"merged":[[31,1,31,2],[32,0,34,5],[36,0,36,5],[0,1,2,4],[3,1,4,1],[3,2,4,2],[28,0,28,5],[30,1,30,2]]}
[null,"DETALHAMENTO DO BDI - FORNECIMENTO \n(MATERIAL ASFÁLTICO)"]
[]
[]
[null,"Item","Descrição dos Serviços","%","%"]
[null,null,null,"PV","CD"]
[]
[null,1,"ADMINISTRAÇÃO CENTRAL"," ",3.45]
[null,"1.1","ESCRITÓRIO CENTRAL"," "," "]
[null,"1.2","VIAGENS"," "," "]
[null,"1.3","OUTROS"," "," "]
{"$rows_left_out":28}
{"sheet":"CRONOGRAMA","index":5,"n_rows":19,"n_cols":12,"rows_kept":19,"cut":false,"hidden":false,"merged":[[0,1,0,11],[1,1,2,1],[1,2,2,4],[1,6,1,11],[2,6,2,11],[9,0,10,0],[9,1,10,1],[9,2,10,2],[3,1,3,10],[5,0,6,0],[5,1,6,1],[5,2,6,2],[7,0,8,0],[7,1,8,1],[7,2,8,2],[15,1,16,2],[18,1,22,11],[11,0,12,0],[11,1,12,1],[11,2,12,2],[13,0,14,0],[13,1,14,1],[13,2,14,2]]}
[null,"CRONOGRAMA FÍSICO-FINANCEIRO"]
[null,"OBRA: ",{"$f":"ORÇAMENTO!C5","v":"PAVIMENTAÇÃO ASFÁLTICA EM CBUQ - VIAS URBANAS DIVERSAS - BAIRRO MAJOR SALVO (CORINTO / MG)"},null,null,"VALOR:",{"$f":"ORÇAMENTO!L41","v":1999943.2300000002}]
[{"$nulls":5},"PRAZO: ","180 DIAS "]
[]
[null,"ITEM","ETAPAS/DESCRIÇAO","FISICO/  FINANCEIRO","TOTAL    ETAPAS","MÊS 1","MÊS 2","MÊS 3","MÊS 4","MÊS 5","MÊS 6","TOTAL"]
["A",{"$f":"VLOOKUP(A6,ORÇAMENTO!$A$10:$L$41,2)","v":1},{"$f":"VLOOKUP(A6,ORÇAMENTO!$A$10:$L$41,5)","v":"SERVIÇOS PRELIMINARES "},"FISICO ",{"$f":"ROUND(E7/$G$2,4)","v":9.3700000000000006E-2},0.25,0.15,0.15,0.15,0.15,0.15,{"$f":"SUM(F6:K6)","v":1}]
[null,null,null,"FINANCEIRO",{"$f":"ORÇAMENTO!L10","v":187368.30000000002},{"$f":"ROUND($E$7*F6,2)","v":46842.080000000002},{"$f":"ROUND($E$7*G6,2)","v":28105.25},{"$f":"ROUND($E$7*H6,2)","v":28105.25},{"$f":"ROUND($E$7*I6,2)","v":28105.25},28105.25,28105.25,{"$f":"SUM(F7:K7)","v":187368.33000000002}]
["B",{"$f":"VLOOKUP(A8,ORÇAMENTO!$A$10:$L$41,2)","v":2},{"$f":"VLOOKUP(A8,ORÇAMENTO!$A$10:$L$41,5)","v":"TERRAPLANAGEM E PAVIMENTAÇÃO"},"FISICO ",{"$f":"ROUND(E9/$G$2,4)","v":0.34970000000000001},0.1,0.2,0.2,0.2,0.2,0.1,{"$f":"SUM(F8:K8)","v":0.99999999999999989}]
[null,null,null,"FINANCEIRO",{"$f":"ORÇAMENTO!L16","v":699394.87000000011},{"$f":"ROUND($E$9*F8,2)","v":69939.490000000005},{"$f":"ROUND($E$9*G8,2)","v":139878.97},{"$f":"ROUND($E$9*H8,2)","v":139878.97},{"$f":"ROUND($E$9*I8,2)","v":139878.97},139878.97,69939.490000000005,{"$f":"SUM(F9:K9)","v":699394.86}]
["C",{"$f":"VLOOKUP(A10,ORÇAMENTO!$A$10:$L$41,2)","v":3},{"$f":"VLOOKUP(A10,ORÇAMENTO!$A$10:$L$41,5)","v":"TRANSPORTE DE MATERIAIS"},"FISICO ",{"$f":"ROUND(E11/$G$2,4)","v":0.12790000000000001},0.25,0.5,0.25,null,null,null,{"$f":"SUM(F10:K10)","v":1}]
{"$rows_left_out":9}