{"text_format":"2","workbook":"xlsx","n_sheets":4,"sheets":["ORÇAMENTO","CPU-SERV","BDI SERV","CRONOGRAMA"],"not_rendered":{"charts":0,"images":2,"macros":0,"external_links":0,"defined_names":4,"comments":2,"pivot_tables":0},"unopened":[],"bounds":{"document_bytes":16777216,"sheet_cells":100000,"run_cost":"one","rows_first":2000,"rows_last":500,"rows_between":2000,"halvings":0,"cell_chars":16384,"cell_head_chars":4096},"cells_cut":0,"cells_raw":0,"read":"whole","date_system":"1900"}

{"sheet":"ORÇAMENTO","index":0,"n_rows":30,"n_cols":12,"rows_kept":30,"cut":false,"hidden":false,"merged":[[8,13,9,13],[29,1,29,4],[0,0,8,0],[0,4,0,11],[1,4,1,11],[2,4,2,11],[7,1,7,11],[4,2,4,7],[5,2,5,7],[4,8,4,10],[5,8,5,10],[6,8,6,10]]}
["<---- NUMERAR SERVIÇOS PARA CPU",null,null,null,"Ministério do Desenvolvimento Regional"]
[{"$nulls":4},"Companhia de Desenvolvimento dos Vales do São Francisco e do Parnaíba"]
[{"$nulls":4},"1ª Superintendência Regional"]
[]
[null,"OBRA: "," PAVIMENTAÇÃO EM BLOQUETE SEXTAVADOS - RUAS DIVERSAS - NOVORIZONTE / MG",{"$nulls":5},"BDI Serviços (%):",null,null,{"$f":"'BDI SERV'!E26","v":24.12}]
[null,"DATA:"," ABRIL/2025",{"$nulls":5},"BDI Diferenciado Serviços (%):",null,null,15]
[null,"PRAZO DE EXECUÇÃO:    240 DIAS",{"$nulls":6},"BDI Fornecimentos (%):",null,null,15]
[null,"PLANILHA DE ORÇAMENTAÇÃO"]
[null,"ITEM","CÓDIGO","FONTE","DISCRIMINAÇÃO","TIPO","UNID.","QUANT.","VR.UNIT.S/BDI","PR. UNIT.C/BDI","C. TOT.S/BDI","P. TOT.C/BDI"]
["A",1,null,null,"SERVIÇOS PRELIMINARES ",{"$nulls":5},{"$f":"SUM(K11:K15)","v":245224.62999999998},{"$f":"SUM(L11:L15)","v":304351.83}]
[1,"1.1","CPU.1","CODEVASF","MOBILIZAÇÃO E DESMOBILIZAÇÃO","SERV","GL",1,{"$f":"VLOOKUP(A11,'CPU-SERV'!A:K,11,0)","v":13688.04},{"$f":"TRUNC(_xlfn.IFS(F11=\"SERV\",I11*(1+$L$5/100),F11=\"SERV DIF\",I11*(1+$L$6/100),F11=\"FORN\",I11*(1+$L$7/100)),2)","v":16989.59},{"$f":"TRUNC(H11*I11,2)","v":13688.04},{"$f":"TRUNC(H11*J11,2)","v":16989.59}]
[2,"1.2","CPU.2","CODEVASF","ADMINISTRAÇÃO LOCAL","SERV","GL",1,{"$f":"VLOOKUP(A12,'CPU-SERV'!A:K,11,0)","v":200315.43},{"$f":"TRUNC(_xlfn.IFS(F12=\"SERV\",I12*(1+$L$5/100),F12=\"SERV DIF\",I12*(1+$L$6/100),F12=\"FORN\",I12*(1+$L$7/100)),2)","v":248631.51},{"$f":"TRUNC(H12*I12,2)","v":200315.43},{"$f":"TRUNC(H12*J12,2)","v":248631.51}]
[3,"1.3","CPU.3","CODEVASF","CANTEIRO DE OBRAS","SERV","GL",1,{"$f":"VLOOKUP(A13,'CPU-SERV'!A:K,11,0)","v":18289.8},{"$f":"TRUNC(_xlfn.IFS(F13=\"SERV\",I13*(1+$L$5/100),F13=\"SERV DIF\",I13*(1+$L$6/100),F13=\"FORN\",I13*(1+$L$7/100)),2)","v":22701.29},18289.8,22701.29]
[4,"1.4",103689,"SINAPI","PLACA DE OBRA EM CHAPA DE AÇO GALVANIZADO","SERV","M2",8,{"$f":"VLOOKUP(A14,'CPU-SERV'!A:K,11,0)","v":351.42},{"$f":"TRUNC(_xlfn.IFS(F14=\"SERV\",I14*(1+$L$5/100),F14=\"SERV DIF\",I14*(1+$L$6/100),F14=\"FORN\",I14*(1+$L$7/100)),2)","v":436.18},2811.36,3489.44]
[6,"1.5",78472,"SINAPI","SERVIÇOS TOPOGRÁFICOS PARA PAVIMENTAÇÃO, INCLUSIVE LEVANTAMENTO PLANIALTIMÉTRICO CADASTRAL, GERAÇÃO DE NOTAS DE SERVIÇO, SEÇÕES TRANSVERSAIS E GREIDE, ESTAQUEAMENTO E ACOMPANHAMENTO EXECUTIVO","SERV","M2",22000,{"$f":"VLOOKUP(A15,'CPU-SERV'!A:K,11,0)","v":0.46},{"$f":"TRUNC(_xlfn.IFS(F15=\"SERV\",I15*(1+$L$5/100),F15=\"SERV DIF\",I15*(1+$L$6/100),F15=\"FORN\",I15*(1+$L$7/100)),2)","v":0.56999999999999995},10120,12540]
["B",2,null,null,"TERRAPLANAGEM E PAVIMENTAÇÃO",{"$nulls":5},{"$f":"SUM(K17:K19)","v":1542615.5},{"$f":"SUM(L17:L19)","v":1914569.5}]
[7,"2.1",5502114,"SICRO","ESCAVAÇÃO, CARGA E TRANSPORTE DE MATERIAL DE 1ª CATEGORIA - DMT 1.000 A 1.200M, CAMINHO DE SERVIÇO EM REVESTIMENTO PRIMÁRIO","SERV","M3",3350,{"$f":"VLOOKUP(A17,'CPU-SERV'!A:K,11,0)","v":6.73},{"$f":"TRUNC(_xlfn.IFS(F17=\"SERV\",I17*(1+$L$5/100),F17=\"SERV DIF\",I17*(1+$L$6/100),F17=\"FORN\",I17*(1+$L$7/100)),2)","v":8.35},{"$f":"TRUNC(H17*I17,2)","v":22545.5},{"$f":"TRUNC(H17*J17,2)","v":27972.5}]
[8,"2.2","4011300a","SICRO","REGULARIZAÇÃO, COMPACTAÇÃO E REFORÇO DE SUBLEITO DE SOLO MELHORADO COM 3% DE CIMENTO, MISTURA NA PISTA","SERV","M3",3350,{"$f":"VLOOKUP(A18,'CPU-SERV'!A:K,11,0)","v":48.2},{"$f":"TRUNC(_xlfn.IFS(F18=\"SERV\",I18*(1+$L$5/100),F18=\"SERV DIF\",I18*(1+$L$6/100),F18=\"FORN\",I18*(1+$L$7/100)),2)","v":59.82},161470,200397]
[9,"2.3",92394,"SINAPI","EXECUÇÃO DE PAVIMENTO EM PISO INTERTRAVADO, COM BLOCO SEXTAVADO DE CONCRETO DE 25 X 25 CM, ESPESSURA 8 CM","SERV","M2",20000,{"$f":"VLOOKUP(A19,'CPU-SERV'!A:K,11,0)","v":67.930000000000007},{"$f":"TRUNC(_xlfn.IFS(F19=\"SERV\",I19*(1+$L$5/100),F19=\"SERV DIF\",I19*(1+$L$6/100),F19=\"FORN\",I19*(1+$L$7/100)),2)","v":84.31},1358600,1686200]
["C",3,null,null,"TRANSPORTE DE MATERIAIS",{"$nulls":5},{"$f":"SUM(K21:K24)","v":182760},{"$f":"SUM(L21:L24)","v":225710}]
[15,"3.1",5915321,"SICRO","TRANSPORTE COM CAMINHÃO BASCULANTE, EM VIA URBANA PAVIMENTADA","SERV","TXKM",150000,{"$f":"VLOOKUP(A21,'CPU-SERV'!A:K,11,0)","v":0.54},{"$f":"TRUNC(_xlfn.IFS(F21=\"SERV\",I21*(1+$L$5/100),F21=\"SERV DIF\",I21*(1+$L$6/100),F21=\"FORN\",I21*(1+$L$7/100)),2)","v":0.67},{"$f":"TRUNC(H21*I21,2)","v":81000},{"$f":"TRUNC(H21*J21,2)","v":100500}]
[16,"3.2",5915320,"SICRO","TRANSPORTE COM CAMINHÃO BASCULANTE, EM VIA COM REVESTIMENTO PRIMÁRIO","SERV","TXKM",13000,{"$f":"VLOOKUP(A22,'CPU-SERV'!A:K,11,0)","v":0.72},{"$f":"TRUNC(_xlfn.IFS(F22=\"SERV\",I22*(1+$L$5/100),F22=\"SERV DIF\",I22*(1+$L$6/100),F22=\"FORN\",I22*(1+$L$7/100)),2)","v":0.89},9360,11570]
[17,"3.3",5914434,"SICRO","TRANSPORTE COM CAMINHÃO CARROCERIA, EM VIA URBANA PAVIMENTADA","SERV","TXKM",120000,{"$f":"VLOOKUP(A23,'CPU-SERV'!A:K,11,0)","v":0.74},{"$f":"TRUNC(_xlfn.IFS(F23=\"SERV\",I23*(1+$L$5/100),F23=\"SERV DIF\",I23*(1+$L$6/100),F23=\"FORN\",I23*(1+$L$7/100)),2)","v":0.91},88800,109200]
[18,"3.4",5914419,"SICRO","TRANSPORTE COM CAMINHÃO CARROCERIA, EM VIA COM REVESTIMENTO PRIMÁRIO","SERV","TXKM",4000,{"$f":"VLOOKUP(A24,'CPU-SERV'!A:K,11,0)","v":0.9},{"$f":"TRUNC(_xlfn.IFS(F24=\"SERV\",I24*(1+$L$5/100),F24=\"SERV DIF\",I24*(1+$L$6/100),F24=\"FORN\",I24*(1+$L$7/100)),2)","v":1.1100000000000001},3600,4440]
["D",4,null,null,"DRENAGEM E OBRAS COMPLEMENTARES",{"$nulls":5},{"$f":"SUM(K26:K29)","v":447317.8},{"$f":"SUM(L26:L29)","v":555196.4}]
[20,"4.1","94267a","SINAPI","GUIA (MEIO-FIO) E SARJETA CONJUGADOS DE CONCRETO, MOLDADA  IN LOCO COM EXTRUSORA, 45 CM BASE (15 CM BASE DA GUIA + 30 CM SARJETA) X 22 CM ALTURA","SERV","M",6600,{"$f":"VLOOKUP(A26,'CPU-SERV'!A:K,11,0)","v":57.51},{"$f":"TRUNC(_xlfn.IFS(F26=\"SERV\",I26*(1+$L$5/100),F26=\"SERV DIF\",I26*(1+$L$6/100),F26=\"FORN\",I26*(1+$L$7/100)),2)","v":71.38},{"$f":"TRUNC(H26*I26,2)","v":379566},{"$f":"TRUNC(H26*J26,2)","v":471108}]
[22,"4.2",94263,"SINAPI","GUIA (MEIO-FIO) CONCRETO, MOLDADA IN LOCO EM TRECHO RETO (PARA TRAVAMENTO), 13 CM BASE X 22 CM ALTURA","SERV","M",500,{"$f":"VLOOKUP(A27,'CPU-SERV'!A:K,11,0)","v":35.81},{"$f":"TRUNC(_xlfn.IFS(F27=\"SERV\",I27*(1+$L$5/100),F27=\"SERV DIF\",I27*(1+$L$6/100),F27=\"FORN\",I27*(1+$L$7/100)),2)","v":44.44},17905,22220]
[46,"4.2","5213440+\n5213863a","SICRO","FORNECIMENTO E INSTALAÇÃO DE PLACA DE SINALIZAÇÃO VIÁRIA - REGULAMENTAÇÃO 0,60MX0,60M, SUPORTE INCLUSO","SERV","UNID.",60,{"$f":"VLOOKUP(A28,'CPU-SERV'!A:K,11,0)","v":486.02},{"$f":"TRUNC(_xlfn.IFS(F28=\"SERV\",I28*(1+$L$5/100),F28=\"SERV DIF\",I28*(1+$L$6/100),F28=\"FORN\",I28*(1+$L$7/100)),2)","v":603.24},29161.200000000001,36194.400000000001]
[47,"4.3","CPU.5","CODEVASF","FORNECIMENTO E INSTALAÇÃO DE PLACA DE IDENTIFICAÇÃO DE LOGRADOURO, SUPORTE EXISTENTE - CONFORME PROJETO","SERV","UNID.",120,{"$f":"VLOOKUP(A29,'CPU-SERV'!A:K,11,0)","v":172.38},{"$f":"TRUNC(_xlfn.IFS(F29=\"SERV\",I29*(1+$L$5/100),F29=\"SERV DIF\",I29*(1+$L$6/100),F29=\"FORN\",I29*(1+$L$7/100)),2)","v":213.95},20685.599999999999,25674]
[null,"TOTAL GERAL DA OBRA COM BDI ",{"$nulls":8},{"$f":"SUM(K10,K16,K20,K25)","v":2417917.9299999997},{"$f":"SUM(L10,L16,L20,L25)","v":2999827.73}]

{"sheet":"CPU-SERV","index":1,"n_rows":640,"n_cols":14,"rows_kept":640,"cut":false,"hidden":false,"merged":[[0,11,0,12],[1,2,1,9],[1,11,1,12],[2,1,3,3],[2,4,2,5],[2,10,2,11],[3,4,3,5],[4,2,4,7],[4,8,4,9],[13,3,13,7],[14,3,14,7],[15,3,15,7],[15,11,15,13],[18,7,18,9],[21,3,21,7],[5,1,6,2],[5,3,6,3],[5,4,5,5],[5,6,5,7],[7,13,7,15],[10,7,10,9],[22,7,22,9],[25,3,25,7],[27,8,27,9],[30,3,30,7],[31,1,32,2],[31,3,32,3],[31,4,32,4],[31,5,31,7],[31,9,32,9],[44,3,45,3],[44,4,44,5],[44,6,44,7],[49,7,49,9],[55,3,55,7],[56,3,56,7],[35,3,35,7],[36,5,36,7],[39,0,81,0],[40,2,40,9],[41,1,42,3],[41,4,41,5],[42,4,42,5],[43,2,43,7],[43,8,43,9],[44,1,45,2],[0,0,37,0],[74,3,74,7],[75,1,76,2],[75,3,76,3],[75,4,76,4],[75,5,75,7],[75,9,76,9],[57,3,57,7],[60,7,60,9],[63,3,63,7],[64,7,64,9],[69,3,69,7],[71,8,71,9],[88,3,89,3],[88,4,88,5],[88,6,88,7],[93,7,93,9],[96,3,96,7],[97,3,97,7],[79,3,79,7],[80,5,80,7],[83,0,120,0],[84,2,84,9],[85,1,86,3],[85,4,85,5],[86,4,86,5],[87,2,87,7],[87,8,87,9],[88,1,89,2],[113,3,113,7],[114,1,115,2],[114,3,115,3],[114,4,115,4],[114,5,114,7],[114,9,115,9],[98,3,98,7],[101,7,101,9],[104,3,104,7],[105,7,105,9],[108,3,108,7],[110,8,110,9],[127,3,128,3],[127,4,127,5],[127,6,127,7],[132,7,132,9],[135,3,135,7],[136,3,136,7],[118,3,118,7],[119,5,119,7],[122,0,161,0],[123,2,123,9],[124,1,125,3],[124,4,124,5],[125,4,125,5],[126,2,126,7],[126,8,126,9],[127,1,128,2],[154,3,154,7],[155,1,156,2],[155,3,156,3],[155,4,156,4],[155,5,155,7],[155,9,156,9],[137,3,137,7],[140,7,140,9],[145,3,145,7],[146,7,146,9],[149,3,149,7],[151,8,151,9],[168,3,169,3],[168,4,168,5],[168,6,168,7],[173,7,173,9],[178,3,178,7],[179,3,179,7],[159,3,159,7],[160,5,160,7],[163,0,202,0],[164,2,164,9],[165,1,166,3],[165,4,165,5],[166,4,166,5],[167,2,167,7],[167,8,167,9],[168,1,169,2],[200,3,200,7],[201,5,201,7],[195,3,195,7],[196,1,197,2],[196,3,197,3],[196,4,197,4],[196,5,196,7],[196,9,197,9],[180,3,180,7],[183,7,183,9],[186,3,186,7],[187,7,187,9],[190,3,190,7],[192,8,192,9],[209,3,210,3],[209,4,209,5],[209,6,209,7],[214,7,214,9],[217,3,217,7],[218,3,218,7],[204,0,241,0],[205,2,205,9],[206,1,207,3],[206,4,206,5],[207,4,207,5],[208,2,208,7],[208,8,208,9],[209,1,210,2],[234,3,234,7],[235,1,236,2],[235,3,236,3],[235,4,236,4],[235,5,235,7],[235,9,236,9],[219,3,219,7],[222,7,222,9],[225,3,225,7],[226,7,226,9],[229,3,229,7],[231,8,231,9],[248,3,249,3],[248,4,248,5],[248,6,248,7],[257,7,257,9],[260,3,260,7],[261,3,261,7],[239,3,239,7],[240,5,240,7],[243,0,284,0],[244,2,244,9],[245,1,246,3],[245,4,245,5],[246,4,246,5],[247,2,247,7],[247,8,247,9],[248,1,249,2],[277,3,277,7],[278,1,279,2],[278,3,279,3],[278,4,279,4],[278,5,278,7],[278,9,279,9],[262,3,262,7],[265,7,265,9],[268,3,268,7],[269,7,269,9],[272,3,272,7],[274,8,274,9],[291,3,292,3],[291,4,291,5],[291,6,291,7],[296,7,296,9],[299,3,299,7],[300,3,300,7],[282,3,282,7],[283,5,283,7],[286,0,324,0],[287,2,287,9],[288,1,289,3],[288,4,288,5],[289,4,289,5],[290,2,290,7],[290,8,290,9],[291,1,292,2],[322,3,322,7],[323,5,323,7],[317,3,317,7],[318,1,319,2],[318,3,319,3],[318,4,319,4],[318,5,318,7],[318,9,319,9],[301,3,301,7],[304,7,304,9],[308,3,308,7],[309,7,309,9],[312,3,312,7],[314,8,314,9],[331,3,332,3],[331,4,331,5],[331,6,331,7],[336,7,336,9],[339,3,339,7],[340,3,340,7],[326,0,363,0],[327,2,327,9],[328,1,329,3],[328,4,328,5],[329,4,329,5],[330,2,330,7],[330,8,330,9],[331,1,332,2],[356,3,356,7],[357,1,358,2],[357,3,358,3],[357,4,358,4],[357,5,357,7],[357,9,358,9],[341,3,341,7],[344,7,344,9],[347,3,347,7],[348,7,348,9],[351,3,351,7],[353,8,353,9],[370,3,371,3],[370,4,370,5],[370,6,370,7],[375,7,375,9],[378,3,378,7],[379,3,379,7],[361,3,361,7],[362,5,362,7],[365,0,402,0],[366,2,366,9],[367,1,368,3],[367,4,367,5],[368,4,368,5],[369,2,369,7],[369,8,369,9],[370,1,371,2],[395,3,395,7],[396,1,397,2],[396,3,397,3],[396,4,397,4],[396,5,396,7],[396,9,397,9],[380,3,380,7],[383,7,383,9],[386,3,386,7],[387,7,387,9],[390,3,390,7],[392,8,392,9],[409,3,410,3],[409,4,409,5],[409,6,409,7],[414,7,414,9],[417,3,417,7],[418,3,418,7],[400,3,400,7],[401,5,401,7],[404,0,441,0],[405,2,405,9],[406,1,407,3],[406,4,406,5],[407,4,407,5],[408,2,408,7],[408,8,408,9],[409,1,410,2],[434,3,434,7],[435,1,436,2],[435,3,436,3],[435,4,436,4],[435,5,435,7],[435,9,436,9],[419,3,419,7],[422,7,422,9],[425,3,425,7],[426,7,426,9],[429,3,429,7],[431,8,431,9],[448,3,449,3],[448,4,448,5],[448,6,448,7],[453,7,453,9],[456,3,456,7],[457,3,457,7],[439,3,439,7],[440,5,440,7],[443,0,480,0],[444,2,444,9],[445,1,446,3],[445,4,445,5],[446,4,446,5],[447,2,447,7],[447,8,447,9],[448,1,449,2],[478,3,478,7],[479,5,479,7],[473,3,473,7],[474,1,475,2],[474,3,475,3],[474,4,475,4],[474,5,474,7],[474,9,475,9],[458,3,458,7],[461,7,461,9],[464,3,464,7],[465,7,465,9],[468,3,468,7],[470,8,470,9],[487,3,488,3],[487,4,487,5],[487,6,487,7],[492,7,492,9],[496,3,496,7],[497,3,497,7],[482,0,520,0],[483,2,483,9],[484,1,485,3],[484,4,484,5],[485,4,485,5],[486,2,486,7],[486,8,486,9],[487,1,488,2],[513,3,513,7],[514,1,515,2],[514,3,515,3],[514,4,515,4],[514,5,514,7],[514,9,515,9],[498,3,498,7],[501,7,501,9],[504,3,504,7],[505,7,505,9],[508,3,508,7],[510,8,510,9],[527,3,528,3],[527,4,527,5],[527,6,527,7],[532,7,532,9],[536,3,536,7],[537,3,537,7],[518,3,518,7],[519,5,519,7],[522,0,560,0],[523,2,523,9],[524,1,525,3],[524,4,524,5],[525,4,525,5],[526,2,526,7],[526,8,526,9],[527,1,528,2],[558,3,558,7],[559,5,559,7],[553,3,553,7],[554,1,555,2],[554,3,555,3],[554,4,555,4],[554,5,554,7],[554,9,555,9],[538,3,538,7],[541,7,541,9],[544,3,544,7],[545,7,545,9],[548,3,548,7],[550,8,550,9],[567,3,568,3],[567,4,567,5],[567,6,567,7],[572,7,572,9],[575,3,575,7],[576,3,576,7],[562,0,600,0],[563,2,563,9],[564,1,565,3],[564,4,564,5],[565,4,565,5],[566,2,566,7],[566,8,566,9],[567,1,568,2],[602,0,639,0],[603,2,603,9],[604,1,605,3],[604,4,604,5],[605,4,605,5],[606,2,606,7],[606,8,606,9],[607,1,608,2],[593,3,593,7],[594,1,595,2],[594,3,595,3],[594,4,595,4],[594,5,594,7],[594,9,595,9],[633,1,634,2],[633,3,634,3],[633,4,634,4],[633,5,633,7],[633,9,634,9],[617,3,617,7],[620,7,620,9],[623,3,623,7],[624,7,624,9],[627,3,627,7],[629,8,629,9],[41,10,41,11],[84,11,84,12],[85,10,85,11],[123,11,123,12],[124,10,124,11],[164,11,164,12],[40,11,40,12],[637,3,637,7],[638,5,638,7],[632,3,632,7],[607,3,608,3],[607,4,607,5],[607,6,607,7],[612,7,612,9],[615,3,615,7],[616,3,616,7],[598,3,598,7],[599,5,599,7],[577,3,577,7],[580,7,580,9],[583,3,583,7],[584,7,584,9],[588,3,588,7],[590,8,590,9],[245,10,245,11],[287,11,287,12],[288,10,288,11],[327,11,327,12],[328,10,328,11],[366,11,366,12],[165,10,165,11],[205,11,205,12],[206,10,206,11],[244,11,244,12],[604,10,604,11],[484,10,484,11],[523,11,523,12],[524,10,524,11],[563,11,563,12],[564,10,564,11],[603,11,603,12],[367,10,367,11],[405,11,405,12],[406,10,406,11],[444,11,444,12],[445,10,445,11],[483,11,483,12]]}
[1,"1ª/GRD",{"$nulls":8},{"$f":"J37","v":13688.04}]
[null,"OBRA:"," PAVIMENTAÇÃO EM BLOQUETE SEXTAVADOS - RUAS DIVERSAS - NOVORIZONTE / MG"]
[null,"Custo Unitário de Referência",null,null,"Minas Gerais",{"$nulls":8},{"$f":"M3/(ORÇAMENTO!L30)","v":0}]
[{"$nulls":4}," Janeiro/2025 ",null,null,"Produção da equipe ",0.5,{"$f":"VLOOKUP(A1,ORÇAMENTO!$A$10:$L$57,7,1)","v":"GL"}]
[null,"CPU.1","MOBILIZAÇÃO E DESMOBILIZAÇÃO",{"$nulls":5},"Valores em reais (R$)"]
[null,"A - EQUIPAMENTOS",null,"Quantidade","Utilização",null,"Custo Horário",null,null,"Custo"]
[{"$nulls":4},"Operativa","Improdutiva","Produtivo","Improdutivo",null,"Horário Total"]
[null,"E9687","Caminhão carroceria com capacidade de 5 t - 115 kW",8,0.6,0.4,146.88079999999999,57.423099999999998,null,{"$f":"D8*(E8*G8+F8*H8)","v":888.78175999999996}]
[null,"E9575","Caminhão basculante com caçamba estanque com capacidade de 14 m³ - 210 kW",16,1,0,309.83940000000001,90.412199999999999,null,{"$f":"D9*(E9*G9+F9*H9)","v":4957.4304000000002}]
[{"$nulls":7},"Custo horário total de equipamentos",null,{"$f":"SUM(J8:J9)","v":5846.21216}]
[null,"B - MÃO DE OBRA",null,"Quantidade","Unidade",null,"Custo Horário","Custo Horário Total"]
[null,"P9824","Servente",8,"h",null,21.3355,null,null,{"$f":"D12*G12","v":170.684}]
[null,"-",0,null,0,null,0,null,null,{"$f":"D13*G13","v":0}]
[null,null,null,"Custo horário total de mão de obra",{"$nulls":5},{"$f":"SUM(J12:J13)","v":170.684}]
[null,null,null,"Custo horário total de execução",{"$nulls":5},{"$f":"J10+J14","v":6016.8961600000002}]
[null,null,null,"Custo unitário de execução",{"$nulls":5},{"$f":"J15/I4","v":12033.79232}]
[{"$nulls":7},"Custo do FIC",null,0]
[{"$nulls":7},"Custo do FIT",null,0]
[null,"C - MATERIAL",null,"Quantidade","Unidade",null,"Preço Unitário","Custo Unitário"]
[null,"-",0,null,0,null,0,null,null,{"$f":"D20*G20","v":0}]
[null,"-",0,null,0,null,0,null,null,{"$f":"D21*G21","v":0}]
[null,null,null,"Custo unitário total de material",{"$nulls":5},{"$f":"SUM(J20:J21)","v":0}]
[null,"D - ATIVIDADES AUXILIARES",null,"Quantidade","Unidade",null,"Custo Unitário","Custo Unitário"]
[null,5914640,"Transporte com cavalo mecânico com semirreboque com capacidade de 30 t - rodovia pavimentada",2902.2000000000003,"tkm",null,0.56999999999999995,null,null,{"$f":"D24*G24","v":1654.2539999999999}]
[null,"-",0,0,0,null,0,null,null,{"$f":"D25*G25","v":0}]
[null,null,null,"Custo total de atividades auxiliares",{"$nulls":5},{"$f":"SUM(J24:J25)","v":1654.2539999999999}]
[{"$nulls":7},"Subtotal",null,{"$f":"J16+J22+J26+J17+J18","v":13688.046320000001}]
[null,"E - TEMPO FIXO",null,"Código","Quantidade","Unidade",null,"Custo Unitário","Custo Unitário"]
[null,"-",0,"-",null,0,null,0,null,{"$f":"ROUNDDOWN(E29*H29,4)","v":0}]
[null,"-",0,"-",null,0,null,0,null,{"$f":"ROUNDDOWN(E30*H30,4)","v":0}]
[null,null,null,"Custo unitário total de tempo fixo",{"$nulls":5},{"$f":"SUM(J29:J30)","v":0}]
[null,"F - MOMENTO DE TRANSPORTE",null,"Quantidade","Unidade","DMT",null,null,null,"Custo Unitário"]
[{"$nulls":5},"LN","RP","P"]
[null,"-",0,null,"tkm"]
[null,"-",0,null,"tkm"]
[null,null,null,"Custo unitário total de transporte"]
[{"$nulls":5},"Custo unitário direto total",null,null,null,{"$f":"TRUNC(J27+J31,2)","v":13688.04}]
[null,"Obs."]
[]
[{"$f":"A1+1","v":2},"1ª/GRD",{"$nulls":8},{"$f":"J81","v":200315.43}]
{"$rows_left_out":601}
{"sheet":"BDI SERV","index":2,"n_rows":60,"n_cols":5,"rows_kept":60,"cut":false,"hidden":false,"merged":[[36,0,36,5],[38,1,38,4],[39,2,39,3],[35,0,35,5],[0,1,2,4],[25,1,25,3],[26,1,26,2],[26,3,26,4],[27,3,27,4]]}
[null,"DETALHAMENTO DO BDI - SERVIÇOS"]
[]
[]
[null,"Item","Descrição dos Serviços","% - PV","% - CD"]
[]
[null,1,"ADMINISTRAÇÃO CENTRAL"," ",{"$f":"SUM(E7:E9)","v":4.01}]
[null,"1.1","ESCRITÓRIO CENTRAL",null,4.01]
[null,"1.2","VIAGENS"]
[null,"1.3","OUTROS"]
[null," "," "," "," "]
[null,2,"IMPOSTOS E TAXAS",{"$f":"SUM(D12:D15)","v":7.65},{"$f":"SUM(E12:E15)","v":0}]
[null,"2.1","ISS - Proposta",{"$f":"D34*100","v":4}]
[null,"2.2","PIS",0.65]
[null,"2.3","Cofins",3]
[null,"2.4","Contribuição Previdenciaria (CPRB)"]
[]
[null,3,"TAXA DE RISCO",null,{"$f":"SUM(E18:E20)","v":0.96}]
[null,"3.1","SEGURO",null,0.2]
[null,"3.2","RISCO",null,0.56000000000000005]
[null,"3.3","GARANTIA",null,0.2]
[]
[null,4,"DESPESAS FINANCEIRAS",null,1.1100000000000001]
[]
[null,5,"LUCRO",null,8]
[]
[null,"BDI APRESENTADO:",null,null,{"$f":"IF($D$41=$C$43,$D$43,IF($D$41=$C$44,$D$44,IF($D$41=$C$44,$D$44,IF($D$41=$C$45,$D$45,0))))","v":24.12}]
[]
[null,null,"Legislação Municipal:","Declaração da Prefeitura"]
[null,null,"Município:","Novorizonte"]
[null,null,"Alíquota ISSQN:",0.04,"Município"]
[null,null,"Base de Cálculo:",1]
[null,null,"Valor Serviço:",2417917.9300000002]
[null,null,"Dedução - Material (estimado):",0,{"$f":"D33/D32","v":0}]
[null,null,"ISSQN BDI:",{"$f":"IF(D32=\"\",0,ROUND(IF(D31=D49,((1-(D33/D32))*D30),D30*D31),4))","v":0.04},"(*)"]
[]
["Acórdão nº 2.622/2013 - TCU Plenário"]
["BDI = ARRED((((((1+(AC+TR)/100)*(1+DF/100)*(1+L/100))/(1-IMP/100))-1)*100);2)"]
[]
[null,"(*) É obrigação da licitante a verificação da Legislação Tributária vigente no município, bem como o cálculo dos valores totais de serviços e materiais estimados, para apresentação de sua proposta."]
[]
{"$rows_left_out":21}
{"sheet":"CRONOGRAMA","index":3,"n_rows":17,"n_cols":14,"rows_kept":17,"cut":false,"hidden":false,"merged":[[13,1,14,2],[16,1,20,13],[7,2,8,2],[9,2,10,2],[11,2,12,2],[7,1,8,1],[9,1,10,1],[11,1,12,1],[7,0,8,0],[9,0,10,0],[11,0,12,0],[0,1,0,13],[1,6,1,13],[2,6,2,13],[3,1,3,6],[5,0,6,0],[5,2,6,2],[1,1,2,1],[5,1,6,1],[1,2,2,4]]}
[null,"CRONOGRAMA FÍSICO-FINANCEIRO"]
[null,"OBRA: ",{"$f":"ORÇAMENTO!C5","v":" PAVIMENTAÇÃO EM BLOQUETE SEXTAVADOS - RUAS DIVERSAS - NOVORIZONTE / MG"},null,null,"VALOR:",{"$f":"ORÇAMENTO!L30","v":2999827.73}]
[{"$nulls":5},"PRAZO: ","240 DIAS "]
[]
[null,"ITEM","ETAPAS/DESCRIÇAO","FISICO/  FINANCEIRO","TOTAL    ETAPAS","MÊS 1","MÊS 2","MÊS 3","MÊS 4","MÊS 5","MÊS 6","MÊS 7","MÊS 8","TOTAL"]
["A",{"$f":"VLOOKUP(A6,ORÇAMENTO!$A$10:$L$30,2)","v":1},{"$f":"VLOOKUP(A6,ORÇAMENTO!$A$10:$L$30,5)","v":"SERVIÇOS PRELIMINARES "},"FISICO ",{"$f":"ROUND(E7/$G$2,4)","v":0.10150000000000001},0.25,0.1,0.1,0.1,0.1,0.1,0.1,0.15,{"$f":"SUM(F6:M6)","v":0.99999999999999989}]
[null,null,null,"FINANCEIRO",{"$f":"ORÇAMENTO!L10","v":304351.83},{"$f":"ROUND($E$7*F6,2)","v":76087.960000000006},{"$f":"ROUND($E$7*G6,2)","v":30435.18},{"$f":"ROUND($E$7*H6,2)","v":30435.18},{"$f":"ROUND($E$7*I6,2)","v":30435.18},{"$f":"ROUND($E$7*J6,2)","v":30435.18},30435.18,30435.18,45652.77,304351.81]
["B",{"$f":"VLOOKUP(A8,ORÇAMENTO!$A$10:$L$30,2)","v":2},{"$f":"VLOOKUP(A8,ORÇAMENTO!$A$10:$L$30,5)","v":"TERRAPLANAGEM E PAVIMENTAÇÃO"},"FISICO ",{"$f":"ROUND(E9/$G$2,4)","v":0.63819999999999999},0.1,0.15,0.15,0.15,0.15,0.15,0.15,0,1]
[null,null,null,"FINANCEIRO",{"$f":"ORÇAMENTO!L16","v":1914569.5},{"$f":"ROUND($E$9*F8,2)","v":191456.95},{"$f":"ROUND($E$9*G8,2)","v":287185.43},{"$f":"ROUND($E$9*H8,2)","v":287185.43},{"$f":"ROUND($E$9*I8,2)","v":287185.43},{"$f":"ROUND($E$9*J8,2)","v":287185.43},287185.43,287185.43,0,1914569.5299999998]
["C",{"$f":"VLOOKUP(A10,ORÇAMENTO!$A$10:$L$30,2)","v":3},{"$f":"VLOOKUP(A10,ORÇAMENTO!$A$10:$L$30,5)","v":"TRANSPORTE DE MATERIAIS"},"FISICO ",{"$f":"ROUND(E11/$G$2,4)","v":7.5200000000000003E-2},0.1,0.15,0.15,0.15,0.15,0.15,0.15,0,1]
[null,null,null,"FINANCEIRO",{"$f":"ORÇAMENTO!L20","v":225710},{"$f":"ROUND($E$11*F10,2)","v":22571},{"$f":"ROUND($E$11*G10,2)","v":33856.5},{"$f":"ROUND($E$11*H10,2)","v":33856.5},{"$f":"ROUND($E$11*I10,2)","v":33856.5},{"$f":"ROUND($E$11*J10,2)","v":33856.5},33856.5,33856.5,0,225710]
["D",{"$f":"VLOOKUP(A12,ORÇAMENTO!$A$10:$L$30,2)","v":4},{"$f":"VLOOKUP(A12,ORÇAMENTO!$A$10:$L$30,5)","v":"DRENAGEM E OBRAS COMPLEMENTARES"},"FISICO ",{"$f":"ROUND(E13/$G$2,4)","v":0.18509999999999999},0.1,0.15,0.15,0.15,0.15,0.15,0.1,0.05,1]
[null,null,null,"FINANCEIRO",{"$f":"ORÇAMENTO!L25","v":555196.4},{"$f":"ROUND($E$13*F12,2)","v":55519.64},{"$f":"ROUND($E$13*G12,2)","v":83279.460000000006},{"$f":"ROUND($E$13*H12,2)","v":83279.460000000006},{"$f":"ROUND($E$13*I12,2)","v":83279.460000000006},{"$f":"ROUND($E$13*J12,2)","v":83279.460000000006},83279.460000000006,55519.64,27759.82,555196.4]
[null,"TOTAL",null,"FISICO ",{"$f":"SUM(F14:H14)","v":0.40507282396512823},{"$f":"F15/E15","v":0.11521846622839241},{"$f":"G15/$E$15","v":0.1449271788683679},{"$f":"H15/$E$15","v":0.1449271788683679},{"$f":"I15/$E$15","v":0.1449271788683679},0.1449271788683679,0.1449271788683679,0.13567337415072164,2.4472268612571294E-2,1.000000003333525]
[null,null,null,"FINANCEIRO",{"$f":"E11+E9+E7+E13","v":2999827.73},{"$f":"F11+F9+F7+F13","v":345635.55000000005},{"$f":"G11+G9+G7+G13","v":434756.57},{"$f":"H11+H9+H7+H13","v":434756.57},{"$f":"I11+I9+I7+I13","v":434756.57},{"$f":"J11+J9+J7+J13","v":434756.57},434756.57,406996.75,73412.59,{"$f":"ROUNDUP(SUM(F15:M15),2)-0.01","v":2999827.7300000004}]
[]
[null,"OBSERVAÇÕES:"]