{"text_format":"2","workbook":"xlsx","n_sheets":4,"sheets":["ORÇAMENTO","CPU-SERV","BDI SERV","CRONOGRAMA"],"not_rendered":{"charts":0,"images":2,"macros":0,"external_links":0,"defined_names":4,"comments":2,"pivot_tables":0},"unopened":[],"bounds":{"document_bytes":16777216,"sheet_cells":100000,"run_cost":"one","rows_first":2000,"rows_last":500,"rows_between":2000,"halvings":0,"cell_chars":16384,"cell_head_chars":4096},"cells_cut":0,"cells_raw":0,"read":"whole","date_system":"1900"}

{"sheet":"ORÇAMENTO","index":0,"n_rows":30,"n_cols":12,"rows_kept":30,"cut":false,"hidden":false,"merged":[[8,13,9,13],[29,1,29,4],[0,0,8,0],[0,4,0,11],[1,4,1,11],[2,4,2,11],[7,1,7,11],[4,2,4,7],[5,2,5,7],[4,8,4,10],[5,8,5,10],[6,8,6,10]]}
["<---- NUMERAR SERVIÇOS PARA CPU",null,null,null,"Ministério do Desenvolvimento Regional"]
[{"$nulls":4},"Companhia de Desenvolvimento dos Vales do São Francisco e do Parnaíba"]
[{"$nulls":4},"1ª Superintendência Regional"]
[]
[null,"OBRA: "," PAVIMENTAÇÃO EM BLOQUETE SEXTAVADOS - RUAS DIVERSAS - NOVORIZONTE / MG",{"$nulls":5},"BDI Serviços (%):",null,null,{"$f":"'BDI SERV'!E26","v":24.12}]
[null,"DATA:"," ABRIL/2025",{"$nulls":5},"BDI Diferenciado Serviços (%):",null,null,15]
[null,"PRAZO DE EXECUÇÃO:    240 DIAS",{"$nulls":6},"BDI Fornecimentos (%):",null,null,15]
[null,"PLANILHA DE ORÇAMENTAÇÃO"]
[null,"ITEM","CÓDIGO","FONTE","DISCRIMINAÇÃO","TIPO","UNID.","QUANT.","VR.UNIT.S/BDI","PR. UNIT.C/BDI","C. TOT.S/BDI","P. TOT.C/BDI"]
["A",1,null,null,"SERVIÇOS PRELIMINARES ",{"$nulls":5},{"$f":"SUM(K11:K15)","v":245224.62999999998},{"$f":"SUM(L11:L15)","v":304351.83}]
[1,"1.1","CPU.1","CODEVASF","MOBILIZAÇÃO E DESMOBILIZAÇÃO","SERV","GL",1,{"$f":"VLOOKUP(A11,'CPU-SERV'!A:K,11,0)","v":13688.04},{"$f":"TRUNC(_xlfn.IFS(F11=\"SERV\",I11*(1+$L$5/100),F11=\"SERV DIF\",I11*(1+$L$6/100),F11=\"FORN\",I11*(1+$L$7/100)),2)","v":16989.59},{"$f":"TRUNC(H11*I11,2)","v":13688.04},{"$f":"TRUNC(H11*J11,2)","v":16989.59}]
[2,"1.2","CPU.2","CODEVASF","ADMINISTRAÇÃO LOCAL","SERV","GL",1,{"$f":"VLOOKUP(A12,'CPU-SERV'!A:K,11,0)","v":200315.43},{"$f":"TRUNC(_xlfn.IFS(F12=\"SERV\",I12*(1+$L$5/100),F12=\"SERV DIF\",I12*(1+$L$6/100),F12=\"FORN\",I12*(1+$L$7/100)),2)","v":248631.51},{"$f":"TRUNC(H12*I12,2)","v":200315.43},{"$f":"TRUNC(H12*J12,2)","v":248631.51}]
[3,"1.3","CPU.3","CODEVASF","CANTEIRO DE OBRAS","SERV","GL",1,{"$f":"VLOOKUP(A13,'CPU-SERV'!A:K,11,0)","v":18289.8},{"$f":"TRUNC(_xlfn.IFS(F13=\"SERV\",I13*(1+$L$5/100),F13=\"SERV DIF\",I13*(1+$L$6/100),F13=\"FORN\",I13*(1+$L$7/100)),2)","v":22701.29},18289.8,22701.29]
[4,"1.4",103689,"SINAPI","PLACA DE OBRA EM CHAPA DE AÇO GALVANIZADO","SERV","M2",8,{"$f":"VLOOKUP(A14,'CPU-SERV'!A:K,11,0)","v":351.42},{"$f":"TRUNC(_xlfn.IFS(F14=\"SERV\",I14*(1+$L$5/100),F14=\"SERV DIF\",I14*(1+$L$6/100),F14=\"FORN\",I14*(1+$L$7/100)),2)","v":436.18},2811.36,3489.44]
[6,"1.5",78472,"SINAPI","SERVIÇOS TOPOGRÁFICOS PARA PAVIMENTAÇÃO, INCLUSIVE LEVANTAMENTO PLANIALTIMÉTRICO CADASTRAL, GERAÇÃO DE NOTAS DE SERVIÇO, SEÇÕES TRANSVERSAIS E GREIDE, ESTAQUEAMENTO E ACOMPANHAMENTO EXECUTIVO","SERV","M2",22000,{"$f":"VLOOKUP(A15,'CPU-SERV'!A:K,11,0)","v":0.46},{"$f":"TRUNC(_xlfn.IFS(F15=\"SERV\",I15*(1+$L$5/100),F15=\"SERV DIF\",I15*(1+$L$6/100),F15=\"FORN\",I15*(1+$L$7/100)),2)","v":0.56999999999999995},10120,12540]
["B",2,null,null,"TERRAPLANAGEM E PAVIMENTAÇÃO",{"$nulls":5},{"$f":"SUM(K17:K19)","v":1542615.5},{"$f":"SUM(L17:L19)","v":1914569.5}]
[7,"2.1",5502114,"SICRO","ESCAVAÇÃO, CARGA E TRANSPORTE DE MATERIAL DE 1ª CATEGORIA - DMT 1.000 A 1.200M, CAMINHO DE SERVIÇO EM REVESTIMENTO PRIMÁRIO","SERV","M3",3350,{"$f":"VLOOKUP(A17,'CPU-SERV'!A:K,11,0)","v":6.73},{"$f":"TRUNC(_xlfn.IFS(F17=\"SERV\",I17*(1+$L$5/100),F17=\"SERV DIF\",I17*(1+$L$6/100),F17=\"FORN\",I17*(1+$L$7/100)),2)","v":8.35},{"$f":"TRUNC(H17*I17,2)","v":22545.5},{"$f":"TRUNC(H17*J17,2)","v":27972.5}]
[8,"2.2","4011300a","SICRO","REGULARIZAÇÃO, COMPACTAÇÃO E REFORÇO DE SUBLEITO DE SOLO MELHORADO COM 3% DE CIMENTO, MISTURA NA PISTA","SERV","M3",3350,{"$f":"VLOOKUP(A18,'CPU-SERV'!A:K,11,0)","v":48.2},{"$f":"TRUNC(_xlfn.IFS(F18=\"SERV\",I18*(1+$L$5/100),F18=\"SERV DIF\",I18*(1+$L$6/100),F18=\"FORN\",I18*(1+$L$7/100)),2)","v":59.82},161470,200397]
[9,"2.3",92394,"SINAPI","EXECUÇÃO DE PAVIMENTO EM PISO INTERTRAVADO, COM BLOCO SEXTAVADO DE CONCRETO DE 25 X 25 CM, ESPESSURA 8 CM","SERV","M2",20000,{"$f":"VLOOKUP(A19,'CPU-SERV'!A:K,11,0)","v":67.930000000000007},{"$f":"TRUNC(_xlfn.IFS(F19=\"SERV\",I19*(1+$L$5/100),F19=\"SERV DIF\",I19*(1+$L$6/100),F19=\"FORN\",I19*(1+$L$7/100)),2)","v":84.31},1358600,1686200]
["C",3,null,null,"TRANSPORTE DE MATERIAIS",{"$nulls":5},{"$f":"SUM(K21:K24)","v":182760},{"$f":"SUM(L21:L24)","v":225710}]
[15,"3.1",5915321,"SICRO","TRANSPORTE COM CAMINHÃO BASCULANTE, EM VIA URBANA PAVIMENTADA","SERV","TXKM",150000,{"$f":"VLOOKUP(A21,'CPU-SERV'!A:K,11,0)","v":0.54},{"$f":"TRUNC(_xlfn.IFS(F21=\"SERV\",I21*(1+$L$5/100),F21=\"SERV DIF\",I21*(1+$L$6/100),F21=\"FORN\",I21*(1+$L$7/100)),2)","v":0.67},{"$f":"TRUNC(H21*I21,2)","v":81000},{"$f":"TRUNC(H21*J21,2)","v":100500}]
[16,"3.2",5915320,"SICRO","TRANSPORTE COM CAMINHÃO BASCULANTE, EM VIA COM REVESTIMENTO PRIMÁRIO","SERV","TXKM",13000,{"$f":"VLOOKUP(A22,'CPU-SERV'!A:K,11,0)","v":0.72},{"$f":"TRUNC(_xlfn.IFS(F22=\"SERV\",I22*(1+$L$5/100),F22=\"SERV DIF\",I22*(1+$L$6/100),F22=\"FORN\",I22*(1+$L$7/100)),2)","v":0.89},9360,11570]
[17,"3.3",5914434,"SICRO","TRANSPORTE COM CAMINHÃO CARROCERIA, EM VIA URBANA PAVIMENTADA","SERV","TXKM",120000,{"$f":"VLOOKUP(A23,'CPU-SERV'!A:K,11,0)","v":0.74},{"$f":"TRUNC(_xlfn.IFS(F23=\"SERV\",I23*(1+$L$5/100),F23=\"SERV DIF\",I23*(1+$L$6/100),F23=\"FORN\",I23*(1+$L$7/100)),2)","v":0.91},88800,109200]
[18,"3.4",5914419,"SICRO","TRANSPORTE COM CAMINHÃO CARROCERIA, EM VIA COM REVESTIMENTO PRIMÁRIO","SERV","TXKM",4000,{"$f":"VLOOKUP(A24,'CPU-SERV'!A:K,11,0)","v":0.9},{"$f":"TRUNC(_xlfn.IFS(F24=\"SERV\",I24*(1+$L$5/100),F24=\"SERV DIF\",I24*(1+$L$6/100),F24=\"FORN\",I24*(1+$L$7/100)),2)","v":1.1100000000000001},3600,4440]
["D",4,null,null,"DRENAGEM E OBRAS COMPLEMENTARES",{"$nulls":5},{"$f":"SUM(K26:K29)","v":447317.8},{"$f":"SUM(L26:L29)","v":555196.4}]
[20,"4.1","94267a","SINAPI","GUIA (MEIO-FIO) E SARJETA CONJUGADOS DE CONCRETO, MOLDADA  IN LOCO COM EXTRUSORA, 45 CM BASE (15 CM BASE DA GUIA + 30 CM SARJETA) X 22 CM ALTURA","SERV","M",6600,{"$f":"VLOOKUP(A26,'CPU-SERV'!A:K,11,0)","v":57.51},{"$f":"TRUNC(_xlfn.IFS(F26=\"SERV\",I26*(1+$L$5/100),F26=\"SERV DIF\",I26*(1+$L$6/100),F26=\"FORN\",I26*(1+$L$7/100)),2)","v":71.38},{"$f":"TRUNC(H26*I26,2)","v":379566},{"$f":"TRUNC(H26*J26,2)","v":471108}]
[22,"4.2",94263,"SINAPI","GUIA (MEIO-FIO) CONCRETO, MOLDADA IN LOCO EM TRECHO RETO (PARA TRAVAMENTO), 13 CM BASE X 22 CM ALTURA","SERV","M",500,{"$f":"VLOOKUP(A27,'CPU-SERV'!A:K,11,0)","v":35.81},{"$f":"TRUNC(_xlfn.IFS(F27=\"SERV\",I27*(1+$L$5/100),F27=\"SERV DIF\",I27*(1+$L$6/100),F27=\"FORN\",I27*(1+$L$7/100)),2)","v":44.44},17905,22220]
[46,"4.2","5213440+\n5213863a","SICRO","FORNECIMENTO E INSTALAÇÃO DE PLACA DE SINALIZAÇÃO VIÁRIA - REGULAMENTAÇÃO 0,60MX0,60M, SUPORTE INCLUSO","SERV","UNID.",60,{"$f":"VLOOKUP(A28,'CPU-SERV'!A:K,11,0)","v":486.02},{"$f":"TRUNC(_xlfn.IFS(F28=\"SERV\",I28*(1+$L$5/100),F28=\"SERV DIF\",I28*(1+$L$6/100),F28=\"FORN\",I28*(1+$L$7/100)),2)","v":603.24},29161.200000000001,36194.400000000001]
[47,"4.3","CPU.5","CODEVASF","FORNECIMENTO E INSTALAÇÃO DE PLACA DE IDENTIFICAÇÃO DE LOGRADOURO, SUPORTE EXISTENTE - CONFORME PROJETO","SERV","UNID.",120,{"$f":"VLOOKUP(A29,'CPU-SERV'!A:K,11,0)","v":172.38},{"$f":"TRUNC(_xlfn.IFS(F29=\"SERV\",I29*(1+$L$5/100),F29=\"SERV DIF\",I29*(1+$L$6/100),F29=\"FORN\",I29*(1+$L$7/100)),2)","v":213.95},20685.599999999999,25674]
[null,"TOTAL GERAL DA OBRA COM BDI ",{"$nulls":8},{"$f":"SUM(K10,K16,K20,K25)","v":2417917.9299999997},{"$f":"SUM(L10,L16,L20,L25)","v":2999827.73}]

{"sheet":"CPU-SERV","index":1,"n_rows":640,"n_cols":14,"rows_kept":640,"cut":false,"hidden":false,"merged":[[0,11,0,12],[1,2,1,9],[1,11,1,12],[2,1,3,3],[2,4,2,5],[2,10,2,11],[3,4,3,5],[4,2,4,7],[4,8,4,9],[13,3,13,7],[14,3,14,7],[15,3,15,7],[15,11,15,13],[18,7,18,9],[21,3,21,7],[5,1,6,2],[5,3,6,3],[5,4,5,5],[5,6,5,7],[7,13,7,15],[10,7,10,9],[22,7,22,9],[25,3,25,7],[27,8,27,9],[30,3,30,7],[31,1,32,2],[31,3,32,3],[31,4,32,4],[31,5,31,7],[31,9,32,9],[44,3,45,3],[44,4,44,5],[44,6,44,7],[49,7,49,9],[55,3,55,7],[56,3,56,7],[35,3,35,7],[36,5,36,7],[39,0,81,0],[40,2,40,9],[41,1,42,3],[41,4,41,5],[42,4,42,5],[43,2,43,7],[43,8,43,9],[44,1,45,2],[0,0,37,0],[74,3,74,7],[75,1,76,2],[75,3,76,3],[75,4,76,4],[75,5,75,7],[75,9,76,9],[57,3,57,7],[60,7,60,9],[63,3,63,7],[64,7,64,9],[69,3,69,7],[71,8,71,9],[88,3,89,3],[88,4,88,5],[88,6,88,7],[93,7,93,9],[96,3,96,7],[97,3,97,7],[79,3,79,7],[80,5,80,7],[83,0,120,0],[84,2,84,9],[85,1,86,3],[85,4,85,5],[86,4,86,5],[87,2,87,7],[87,8,87,9],[88,1,89,2],[113,3,113,7],[114,1,115,2],[114,3,115,3],[114,4,115,4],[114,5,114,7],[114,9,115,9],[98,3,98,7],[101,7,101,9],[104,3,104,7],[105,7,105,9],[108,3,108,7],[110,8,110,9],[127,3,128,3],[127,4,127,5],[127,6,127,7],[132,7,132,9],[135,3,135,7],[136,3,136,7],[118,3,118,7],[119,5,119,7],[122,0,161,0],[123,2,123,9],[124,1,125,3],[124,4,124,5],[125,4,125,5],[126,2,126,7],[126,8,126,9],[127,1,128,2],[154,3,154,7],[155,1,156,2],[155,3,156,3],[155,4,156,4],[155,5,155,7],[155,9,156,9],[137,3,137,7],[140,7,140,9],[145,3,145,7],[146,7,146,9],[149,3,149,7],[151,8,151,9],[168,3,169,3],[168,4,168,5],[168,6,168,7],[173,7,173,9],[178,3,178,7],[179,3,179,7],[159,3,159,7],[160,5,160,7],[163,0,202,0],[164,2,164,9],[165,1,166,3],[165,4,165,5],[166,4,166,5],[167,2,167,7],[167,8,167,9],[168,1,169,2],[200,3,200,7],[201,5,201,7],[195,3,195,7],[196,1,197,2],[196,3,197,3],[196,4,197,4],[196,5,196,7],[196,9,197,9],[180,3,180,7],[183,7,183,9],[186,3,186,7],[187,7,187,9],[190,3,190,7],[192,8,192,9],[209,3,210,3],[209,4,209,5],[209,6,209,7],[214,7,214,9],[217,3,217,7],[218,3,218,7],[204,0,241,0],[205,2,205,9],[206,1,207,3],[206,4,206,5],[207,4,207,5],[208,2,208,7],[208,8,208,9],[209,1,210,2],[234,3,234,7],[235,1,236,2],[235,3,236,3],[235,4,236,4],[235,5,235,7],[235,9,236,9],[219,3,219,7],[222,7,222,9],[225,3,225,7],[226,7,226,9],[229,3,229,7],[231,8,231,9],[248,3,249,3],[248,4,248,5],[248,6,248,7],[257,7,257,9],[260,3,260,7],[261,3,261,7],[239,3,239,7],[240,5,240,7],[243,0,284,0],[244,2,244,9],[245,1,246,3],[245,4,245,5],[246,4,246,5],[247,2,247,7],[247,8,247,9],[248,1,249,2],[277,3,277,7],[278,1,279,2],[278,3,279,3],[278,4,279,4],[278,5,278,7],[278,9,279,9],[262,3,262,7],[265,7,265,9],[268,3,268,7],[269,7,269,9],[272,3,272,7],[274,8,274,9],[291,3,292,3],[291,4,291,5],[291,6,291,7],[296,7,296,9],[299,3,299,7],[300,3,300,7],[282,3,282,7],[283,5,283,7],[286,0,324,0],[287,2,287,9],[288,1,289,3],[288,4,288,5],[289,4,289,5],[290,2,290,7],[290,8,290,9],[291,1,292,2],[322,3,322,7],[323,5,323,7],[317,3,317,7],[318,1,319,2],[318,3,319,3],[318,4,319,4],[318,5,318,7],[318,9,319,9],[301,3,301,7],[304,7,304,9],[308,3,308,7],[309,7,309,9],[312,3,312,7],[314,8,314,9],[331,3,332,3],[331,4,331,5],[331,6,331,7],[336,7,336,9],[339,3,339,7],[340,3,340,7],[326,0,363,0],[327,2,327,9],[328,1,329,3],[328,4,328,5],[329,4,329,5],[330,2,330,7],[330,8,330,9],[331,1,332,2],[356,3,356,7],[357,1,358,2],[357,3,358,3],[357,4,358,4],[357,5,357,7],[357,9,358,9],[341,3,341,7],[344,7,344,9],[347,3,347,7],[348,7,348,9],[351,3,351,7],[353,8,353,9],[370,3,371,3],[370,4,370,5],[370,6,370,7],[375,7,375,9],[378,3,378,7],[379,3,379,7],[361,3,361,7],[362,5,362,7],[365,0,402,0],[366,2,366,9],[367,1,368,3],[367,4,367,5],[368,4,368,5],[369,2,369,7],[369,8,369,9],[370,1,371,2],[395,3,395,7],[396,1,397,2],[396,3,397,3],[396,4,397,4],[396,5,396,7],[396,9,397,9],[380,3,380,7],[383,7,383,9],[386,3,386,7],[387,7,387,9],[390,3,390,7],[392,8,392,9],[409,3,410,3],[409,4,409,5],[409,6,409,7],[414,7,414,9],[417,3,417,7],[418,3,418,7],[400,3,400,7],[401,5,401,7],[404,0,441,0],[405,2,405,9],[406,1,407,3],[406,4,406,5],[407,4,407,5],[408,2,408,7],[408,8,408,9],[409,1,410,2],[434,3,434,7],[435,1,436,2],[435,3,436,3],[435,4,436,4],[435,5,435,7],[435,9,436,9],[419,3,419,7],[422,7,422,9],[425,3,425,7],[426,7,426,9],[429,3,429,7],[431,8,431,9],[448,3,449,3],[448,4,448,5],[448,6,448,7],[453,7,453,9],[456,3,456,7],[457,3,457,7],[439,3,439,7],[440,5,440,7],[443,0,480,0],[444,2,444,9],[445,1,446,3],[445,4,445,5],[446,4,446,5],[447,2,447,7],[447,8,447,9],[448,1,449,2],[478,3,478,7],[479,5,479,7],[473,3,473,7],[474,1,475,2],[474,3,475,3],[474,4,475,4],[474,5,474,7],[474,9,475,9],[458,3,458,7],[461,7,461,9],[464,3,464,7],[465,7,465,9],[468,3,468,7],[470,8,470,9],[487,3,488,3],[487,4,487,5],[487,6,487,7],[492,7,492,9],[496,3,496,7],[497,3,497,7],[482,0,520,0],[483,2,483,9],[484,1,485,3],[484,4,484,5],[485,4,485,5],[486,2,486,7],[486,8,486,9],[487,1,488,2],[513,3,513,7],[514,1,515,2],[514,3,515,3],[514,4,515,4],[514,5,514,7],[514,9,515,9],[498,3,498,7],[501,7,501,9],[504,3,504,7],[505,7,505,9],[508,3,508,7],[510,8,510,9],[527,3,528,3],[527,4,527,5],[527,6,527,7],[532,7,532,9],[536,3,536,7],[537,3,537,7],[518,3,518,7],[519,5,519,7],[522,0,560,0],[523,2,523,9],[524,1,525,3],[524,4,524,5],[525,4,525,5],[526,2,526,7],[526,8,526,9],[527,1,528,2],[558,3,558,7],[559,5,559,7],[553,3,553,7],[554,1,555,2],[554,3,555,3],[554,4,555,4],[554,5,554,7],[554,9,555,9],[538,3,538,7],[541,7,541,9],[544,3,544,7],[545,7,545,9],[548,3,548,7],[550,8,550,9],[567,3,568,3],[567,4,567,5],[567,6,567,7],[572,7,572,9],[575,3,575,7],[576,3,576,7],[562,0,600,0],[563,2,563,9],[564,1,565,3],[564,4,564,5],[565,4,565,5],[566,2,566,7],[566,8,566,9],[567,1,568,2],[602,0,639,0],[603,2,603,9],[604,1,605,3],[604,4,604,5],[605,4,605,5],[606,2,606,7],[606,8,606,9],[607,1,608,2],[593,3,593,7],[594,1,595,2],[594,3,595,3],[594,4,595,4],[594,5,594,7],[594,9,595,9],[633,1,634,2],[633,3,634,3],[633,4,634,4],[633,5,633,7],[633,9,634,9],[617,3,617,7],[620,7,620,9],[623,3,623,7],[624,7,624,9],[627,3,627,7],[629,8,629,9],[41,10,41,11],[84,11,84,12],[85,10,85,11],[123,11,123,12],[124,10,124,11],[164,11,164,12],[40,11,40,12],[637,3,637,7],[638,5,638,7],[632,3,632,7],[607,3,608,3],[607,4,607,5],[607,6,607,7],[612,7,612,9],[615,3,615,7],[616,3,616,7],[598,3,598,7],[599,5,599,7],[577,3,577,7],[580,7,580,9],[583,3,583,7],[584,7,584,9],[588,3,588,7],[590,8,590,9],[245,10,245,11],[287,11,287,12],[288,10,288,11],[327,11,327,12],[328,10,328,11],[366,11,366,12],[165,10,165,11],[205,11,205,12],[206,10,206,11],[244,11,244,12],[604,10,604,11],[484,10,484,11],[523,11,523,12],[524,10,524,11],[563,11,563,12],[564,10,564,11],[603,11,603,12],[367,10,367,11],[405,11,405,12],[406,10,406,11],[444,11,444,12],[445,10,445,11],[483,11,483,12]]}
[1,"1ª/GRD",{"$nulls":8},{"$f":"J37","v":13688.04}]
[null,"OBRA:"," PAVIMENTAÇÃO EM BLOQUETE SEXTAVADOS - RUAS DIVERSAS - NOVORIZONTE / MG"]
[null,"Custo Unitário de Referência",null,null,"Minas Gerais",{"$nulls":8},{"$f":"M3/(ORÇAMENTO!L30)","v":0}]
[{"$nulls":4}," Janeiro/2025 ",null,null,"Produção da equipe ",0.5,{"$f":"VLOOKUP(A1,ORÇAMENTO!$A$10:$L$57,7,1)","v":"GL"}]
[null,"CPU.1","MOBILIZAÇÃO E DESMOBILIZAÇÃO",{"$nulls":5},"Valores em reais (R$)"]
[null,"A - EQUIPAMENTOS",null,"Quantidade","Utilização",null,"Custo Horário",null,null,"Custo"]
[{"$nulls":4},"Operativa","Improdutiva","Produtivo","Improdutivo",null,"Horário Total"]
[null,"E9687","Caminhão carroceria com capacidade de 5 t - 115 kW",8,0.6,0.4,146.88079999999999,57.423099999999998,null,{"$f":"D8*(E8*G8+F8*H8)","v":888.78175999999996}]
[null,"E9575","Caminhão basculante com caçamba estanque com capacidade de 14 m³ - 210 kW",16,1,0,309.83940000000001,90.412199999999999,null,{"$f":"D9*(E9*G9+F9*H9)","v":4957.4304000000002}]
[{"$nulls":7},"Custo horário total de equipamentos",null,{"$f":"SUM(J8:J9)","v":5846.21216}]
[null,"B - MÃO DE OBRA",null,"Quantidade","Unidade",null,"Custo Horário","Custo Horário Total"]
[null,"P9824","Servente",8,"h",null,21.3355,null,null,{"$f":"D12*G12","v":170.684}]
[null,"-",0,null,0,null,0,null,null,{"$f":"D13*G13","v":0}]
[null,null,null,"Custo horário total de mão de obra",{"$nulls":5},{"$f":"SUM(J12:J13)","v":170.684}]
[null,null,null,"Custo horário total de execução",{"$nulls":5},{"$f":"J10+J14","v":6016.8961600000002}]
[null,null,null,"Custo unitário de execução",{"$nulls":5},{"$f":"J15/I4","v":12033.79232}]
[{"$nulls":7},"Custo do FIC",null,0]
[{"$nulls":7},"Custo do FIT",null,0]
[null,"C - MATERIAL",null,"Quantidade","Unidade",null,"Preço Unitário","Custo Unitário"]
[null,"-",0,null,0,null,0,null,null,{"$f":"D20*G20","v":0}]
[null,"-",0,null,0,null,0,null,null,{"$f":"D21*G21","v":0}]
[null,null,null,"Custo unitário total de material",{"$nulls":5},{"$f":"SUM(J20:J21)","v":0}]
[null,"D - ATIVIDADES AUXILIARES",null,"Quantidade","Unidade",null,"Custo Unitário","Custo Unitário"]
[null,5914640,"Transporte com cavalo mecânico com semirreboque com capacidade de 30 t - rodovia pavimentada",2902.2000000000003,"tkm",null,0.56999999999999995,null,null,{"$f":"D24*G24","v":1654.2539999999999}]
[null,"-",0,0,0,null,0,null,null,{"$f":"D25*G25","v":0}]
[null,null,null,"Custo total de atividades auxiliares",{"$nulls":5},{"$f":"SUM(J24:J25)","v":1654.2539999999999}]
[{"$nulls":7},"Subtotal",null,{"$f":"J16+J22+J26+J17+J18","v":13688.046320000001}]
[null,"E - TEMPO FIXO",null,"Código","Quantidade","Unidade",null,"Custo Unitário","Custo Unitário"]
[null,"-",0,"-",null,0,null,0,null,{"$f":"ROUNDDOWN(E29*H29,4)","v":0}]
[null,"-",0,"-",null,0,null,0,null,{"$f":"ROUNDDOWN(E30*H30,4)","v":0}]
[null,null,null,"Custo unitário total de tempo fixo",{"$nulls":5},{"$f":"SUM(J29:J30)","v":0}]
[null,"F - MOMENTO DE TRANSPORTE",null,"Quantidade","Unidade","DMT",null,null,null,"Custo Unitário"]
[{"$nulls":5},"LN","RP","P"]
[null,"-",0,null,"tkm"]
[null,"-",0,null,"tkm"]
[null,null,null,"Custo unitário total de transporte"]
[{"$nulls":5},"Custo unitário direto total",null,null,null,{"$f":"TRUNC(J27+J31,2)","v":13688.04}]
[null,"Obs."]
[]
[{"$f":"A1+1","v":2},"1ª/GRD",{"$nulls":8},{"$f":"J81","v":200315.43}]
[null,"OBRA:"," PAVIMENTAÇÃO EM BLOQUETE SEXTAVADOS - RUAS DIVERSAS - NOVORIZONTE / MG"]
[null,"Custo Unitário de Referência",null,null,"Minas Gerais"]
[{"$nulls":4}," Janeiro/2025 ",null,null,"Produção da equipe ",0.125,{"$f":"VLOOKUP(A40,ORÇAMENTO!$A$10:$L$57,7,1)","v":"GL"}]
[null,"CPU.2","ADMINISTRAÇÃO LOCAL",{"$nulls":5},"Valores em reais (R$)"]
[null,"A - EQUIPAMENTOS",null,"Quantidade","Utilização",null,"Custo Horário",null,null,"Custo"]
[{"$nulls":4},"Operativa","Improdutiva","Produtivo","Improdutivo",null,"Horário Total"]
[null,"-",0,null,null,null,0,0,null,{"$f":"D47*(E47*G47+F47*H47)","v":0}]
[null,"-",0,null,null,null,0,0,null,{"$f":"D48*(E48*G48+F48*H48)","v":0}]
[{"$nulls":7},"Custo horário total de equipamentos",null,{"$f":"SUM(J47:J48)","v":0}]
[null,"B - MÃO DE OBRA",null,"Quantidade","Unidade",null,"Custo Horário","Custo Horário Total"]
[null,"P9812","Engenheiro",0.19632537105662243,"mês",null,26055.551500000001,null,null,{"$f":"D51*G51","v":5115.3658163224354}]
[null,"P9840","Encarregado geral",1,"mês",null,11986.486649999999,null,null,11986.486649999999]
[null,"P9876","Técnico de segurança do trabalho",0.5,"mês",null,7060.9856399999999,null,null,3530.4928199999999]
[null,"P9858","Laboratorista",0.5,"mês",null,5739.5436300000001,null,null,2869.7718150000001]
[null,"P9806","Auxiliar administrativo",0.25,"mês",null,4024.8477900000003,null,null,1006.2119475000001]
[null,null,null,"Custo horário total de mão de obra",{"$nulls":5},{"$f":"SUM(J51:J55)","v":24508.329048822434}]
[null,null,null,"Custo horário total de execução",{"$nulls":5},{"$f":"J49+J56","v":24508.329048822434}]
[null,null,null,"Custo unitário de execução",{"$nulls":5},{"$f":"J57/I43","v":196066.63239057947}]
[{"$nulls":7},"Custo do FIC",null,"-"]
[{"$nulls":7},"Custo do FIT",null,"-"]
[null,"C - MATERIAL",null,"Quantidade","Unidade",null,"Preço Unitário","Custo Unitário"]
[null,"-",0,null,0,null,0,null,null,{"$f":"D62*G62","v":0}]
[null,"-",0,null,0,null,0,null,null,0]
[null,null,null,"Custo unitário total de material",{"$nulls":5},{"$f":"SUM(J62:J63)","v":0}]
[null,"D - ATIVIDADES AUXILIARES",null,"Quantidade","Unidade",null,"Custo Unitário","Custo Unitário"]
[null,14250,"Energia Elétrica",480,"kwh",null,0.95,null,null,{"$f":"D66*G66","v":456}]
[null,44480,"Tarifa A - Água e Esgoto",32,"m³",null,17.97,null,null,{"$f":"D67*G67","v":575.04}]
[null,5212560,"Placa de advertência para sinalização de obras montada em suporte metálico móvel, lado 1,00 m - utilização de 600 ciclos - fornecimento, 01 implantação e 01 retirada diária",704,"un.dia",null,3.89,null,null,{"$f":"D68*G68","v":2738.56}]
[null,"Cotação","Telefone",8,"mês",null,59.9,null,null,{"$f":"D69*G69","v":479.2}]
[null,null,null,"Custo total de atividades auxiliares",{"$nulls":5},{"$f":"SUM(J66:J69)","v":4248.8}]
[{"$nulls":7},"Subtotal",null,{"$f":"J58+J64+J70","v":200315.43239057946}]
[null,"E - TEMPO FIXO",null,"Código","Quantidade","Unidade",null,"Custo Unitário","Custo Unitário"]
[null,"-",0,"-",null,0,null,0,null,{"$f":"ROUNDDOWN(E73*H73,4)","v":0}]
[null,"-",0,"-",null,0,null,0,null,{"$f":"ROUNDDOWN(E74*H74,4)","v":0}]
[null,null,null,"Custo unitário total de tempo fixo",{"$nulls":5},{"$f":"SUM(J73:J74)","v":0}]
[null,"F - MOMENTO DE TRANSPORTE",null,"Quantidade","Unidade","DMT",null,null,null,"Custo Unitário"]
[{"$nulls":5},"LN","RP","P"]
[null,"-",0,null,"tkm"]
[null,"-",0,null,"tkm"]
[null,null,null,"Custo unitário total de transporte"]
[{"$nulls":5},"Custo unitário direto total",null,null,null,{"$f":"TRUNC(J71+J75,2)","v":200315.43}]
[null,"Obs."]
[]
[{"$f":"A40+1","v":3},"1ª/GRD",{"$nulls":8},{"$f":"J120","v":18289.8}]
[null,"OBRA:"," PAVIMENTAÇÃO EM BLOQUETE SEXTAVADOS - RUAS DIVERSAS - NOVORIZONTE / MG"]
[null,"Custo Unitário de Referência",null,null,"Minas Gerais"]
[{"$nulls":4}," Janeiro/2025 ",null,null,"Produção da equipe ",1,{"$f":"VLOOKUP(A84,ORÇAMENTO!$A$10:$L$57,7,1)","v":"GL"}]
[null,"CPU.3","CANTEIRO DE OBRAS",{"$nulls":5},"Valores em reais (R$)"]
[null,"A - EQUIPAMENTOS",null,"Quantidade","Utilização",null,"Custo Horário",null,null,"Custo"]
[{"$nulls":4},"Operativa","Improdutiva","Produtivo","Improdutivo",null,"Horário Total"]
[null,"-",0,null,null,null,0,0,null,{"$f":"D91*(E91*G91+F91*H91)","v":0}]
[null,"-",0,null,null,null,0,0,null,{"$f":"D92*(E92*G92+F92*H92)","v":0}]
[{"$nulls":7},"Custo horário total de equipamentos",null,{"$f":"SUM(J91:J92)","v":0}]
[null,"B - MÃO DE OBRA",null,"Quantidade","Unidade",null,"Custo Horário","Custo Horário Total"]
[null,"P9824","Servente",8,"h",null,21.3355,null,null,{"$f":"D95*G95","v":170.684}]
[null,"P9808","Carpinteiro",8,"h",null,26.4529,null,null,211.6232]
[null,null,null,"Custo horário total de mão de obra",{"$nulls":5},{"$f":"SUM(J95:J96)","v":382.30719999999997}]
[null,null,null,"Custo horário total de execução",{"$nulls":5},{"$f":"J93+J97","v":382.30719999999997}]
[null,null,null,"Custo unitário de execução",{"$nulls":5},{"$f":"J98/I87","v":382.30719999999997}]
[{"$nulls":7},"Custo do FIC",null,"-"]
[{"$nulls":7},"Custo do FIT",null,"-"]
[null,"C - MATERIAL",null,"Quantidade","Unidade",null,"Preço Unitário","Custo Unitário"]
[null,"M0053","Tela plástica em polipropileno na cor laranja para tapume - L = 1,2 m",100,"m",null,1.7749999999999999,null,null,{"$f":"D103*G103","v":177.5}]
[null,"-",0,0,0,null,0,null,null,0]
[null,null,null,"Custo unitário total de material",{"$nulls":5},{"$f":"SUM(J103:J104)","v":177.5}]
[null,"D - ATIVIDADES AUXILIARES",null,"Quantidade","Unidade",null,"Custo Unitário","Custo Unitário"]
[null,10775,"Locação de container 2,30 X 6,00 m, alt. 2,50 m, com 1 sanitário, para escritório, completo, sem divisórias internas",8,"mês",null,985,null,null,{"$f":"D107*G107","v":7880}]
[null,10779,"Locação de container 2,30 X 4,30 m, alt. 2,50 M, p/ sanitário, c/ 5 bacias, 1 lavatório e 4 mictórios",8,"mês",null,1231.25,null,null,{"$f":"D108*G108","v":9850}]
[null,null,null,"Custo total de atividades auxiliares",{"$nulls":5},{"$f":"SUM(J107:J108)","v":17730}]
[{"$nulls":7},"Subtotal",null,{"$f":"J99+J105+J109","v":18289.807199999999}]
[null,"E - TEMPO FIXO",null,"Código","Quantidade","Unidade",null,"Custo Unitário","Custo Unitário"]
[null,"-",0,"-",null,0,null,0,null,{"$f":"ROUNDDOWN(E112*H112,4)","v":0}]
[null,"-",0,"-",null,0,null,0,null,{"$f":"ROUNDDOWN(E113*H113,4)","v":0}]
[null,null,null,"Custo unitário total de tempo fixo",{"$nulls":5},{"$f":"SUM(J112:J113)","v":0}]
[null,"F - MOMENTO DE TRANSPORTE",null,"Quantidade","Unidade","DMT",null,null,null,"Custo Unitário"]
[{"$nulls":5},"LN","RP","P"]
[null,"-",0,null,"tkm"]
[null,"-",0,null,"tkm"]
[null,null,null,"Custo unitário total de transporte"]
[{"$nulls":5},"Custo unitário direto total",null,null,null,{"$f":"TRUNC(J110+J114,2)","v":18289.8}]
[null,"Obs."]
[]
[{"$f":"A84+1","v":4},"1ª/GRD",{"$nulls":8},{"$f":"J161","v":351.42}]
[null,"OBRA:"," PAVIMENTAÇÃO EM BLOQUETE SEXTAVADOS - RUAS DIVERSAS - NOVORIZONTE / MG"]
[null,"Custo Unitário de Referência",null,null,"Minas Gerais"]
[{"$nulls":4}," Janeiro/2025 ",null,null,"Produção da equipe ",1,{"$f":"VLOOKUP(A123,ORÇAMENTO!$A$10:$L$57,7,1)","v":"M2"}]
[null,103689,"PLACA DE OBRA EM CHAPA DE AÇO GALVANIZADO",{"$nulls":5},"Valores em reais (R$)"]
[null,"A - EQUIPAMENTOS",null,"Quantidade","Utilização",null,"Custo Horário",null,null,"Custo"]
[{"$nulls":4},"Operativa","Improdutiva","Produtivo","Improdutivo",null,"Horário Total"]
[null,"-",0,null,null,null,0,0,null,{"$f":"D130*(E130*G130+F130*H130)","v":0}]
[null,"-",0,null,null,null,0,0,null,{"$f":"D131*(E131*G131+F131*H131)","v":0}]
[{"$nulls":7},"Custo horário total de equipamentos",null,{"$f":"SUM(J130:J131)","v":0}]
[null,"B - MÃO DE OBRA",null,"Quantidade","Unidade",null,"Custo Horário","Custo Horário Total"]
[null,"P9824","Servente",1.1186,"h",null,21.3355,null,null,{"$f":"D134*G134","v":23.8658903}]
[null,"P9808","Carpinteiro",0.37290000000000001,"h",null,26.4529,null,null,9.8642864100000001]
[null,null,null,"Custo horário total de mão de obra",{"$nulls":5},{"$f":"SUM(J134:J135)","v":33.730176710000002}]
[null,null,null,"Custo horário total de execução",{"$nulls":5},{"$f":"J132+J136","v":33.730176710000002}]
[null,null,null,"Custo unitário de execução",{"$nulls":5},{"$f":"J137/I126","v":33.730176710000002}]
[{"$nulls":7},"Custo do FIC",null,"-"]
[{"$nulls":7},"Custo do FIT",null,"-"]
[null,"C - MATERIAL",null,"Quantidade","Unidade",null,"Preço Unitário","Custo Unitário"]
[null,"M1358","Sarrafo em madeira de terceira - E = 2,5 cm e L = 5 cm",6.4165999999999999,"m",null,1.9665999999999999,null,null,{"$f":"D142*G142","v":12.618885559999999}]
[null,"M1205","Prego de ferro",2.4500000000000001E-2,"kg",null,16.544499999999999,null,null,0.40534025000000001]
[null,"M0998","Madeira estrutural de eucalipto",2.2608E-2,"m³",null,2418.0391,null,null,54.6670279728]
[null,4813,"Placa de obra (para construção civil) em chapa galvanizada *N. 22*, adesivada, de *2,4 X 1,2* m (sem postes para fixação)",1,"m²",null,250,null,null,{"$f":"D145*G145","v":250}]
[null,null,null,"Custo unitário total de material",{"$nulls":5},{"$f":"SUM(J142:J145)","v":317.6912537828}]
[null,"D - ATIVIDADES AUXILIARES",null,"Quantidade","Unidade",null,"Custo Unitário","Custo Unitário"]
[null,"-",0,0,0,null,0,null,null,{"$f":"D148*G148","v":0}]
[null,"-",0,0,0,null,0,null,null,0]
[null,null,null,"Custo total de atividades auxiliares",{"$nulls":5},{"$f":"SUM(J148:J149)","v":0}]
[{"$nulls":7},"Subtotal",null,{"$f":"J138+J146+J150","v":351.42143049280003}]
[null,"E - TEMPO FIXO",null,"Código","Quantidade","Unidade",null,"Custo Unitário","Custo Unitário"]
[null,"-",0,"-",null,0,null,0,null,{"$f":"ROUNDDOWN(E153*H153,4)","v":0}]
[null,"-",0,"-",null,0,null,0,null,{"$f":"ROUNDDOWN(E154*H154,4)","v":0}]
[null,null,null,"Custo unitário total de tempo fixo",{"$nulls":5},{"$f":"SUM(J153:J154)","v":0}]
[null,"F - MOMENTO DE TRANSPORTE",null,"Quantidade","Unidade","DMT",null,null,null,"Custo Unitário"]
[{"$nulls":5},"LN","RP","P"]
[null,"-",0,null,"tkm"]
[null,"-",0,null,"tkm"]
[null,null,null,"Custo unitário total de transporte"]
[{"$nulls":5},"Custo unitário direto total",null,null,null,{"$f":"TRUNC(J151+J155,2)","v":351.42}]
[null,"Obs."]
[]
[6,"1ª/GRD",{"$nulls":8},{"$f":"J202","v":0.46}]
[null,"OBRA:"," PAVIMENTAÇÃO EM BLOQUETE SEXTAVADOS - RUAS DIVERSAS - NOVORIZONTE / MG"]
[null,"Custo Unitário de Referência",null,null,"Minas Gerais"]
[{"$nulls":4}," Janeiro/2025 ",null,null,"Produção da equipe ",1,{"$f":"VLOOKUP(A164,ORÇAMENTO!$A$10:$L$57,7,1)","v":"M2"}]
[null,78472,"SERVIÇOS TOPOGRÁFICOS PARA PAVIMENTAÇÃO, INCLUSIVE LEVANTAMENTO PLANIALTIMÉTRICO CADASTRAL, GERAÇÃO DE NOTAS DE SERVIÇO, SEÇÕES TRANSVERSAIS E GREIDE, ESTAQUEAMENTO E ACOMPANHAMENTO EXECUTIVO",{"$nulls":5},"Valores em reais (R$)"]
[null,"A - EQUIPAMENTOS",null,"Quantidade","Utilização",null,"Custo Horário",null,null,"Custo"]
[{"$nulls":4},"Operativa","Improdutiva","Produtivo","Improdutivo",null,"Horário Total"]
[null,92145,"Caminhonete cabine simples com motor 1.6 flex, câmbio manual, potência 101/104 cv, 2 portas",5.0000000000000001E-4,1,0,76.5,0,null,{"$f":"D171*(E171*G171+F171*H171)","v":3.8249999999999999E-2}]
[null,"-",0,0,1,0,0,0,null,{"$f":"D172*(E172*G172+F172*H172)","v":0}]
[{"$nulls":7},"Custo horário total de equipamentos",null,{"$f":"SUM(J171:J172)","v":3.8249999999999999E-2}]
[null,"B - MÃO DE OBRA",null,"Quantidade","Unidade",null,"Custo Horário","Custo Horário Total"]
[null,"P9949","Topógrafo",1.2500000000000001E-5,"mês",null,6816.9715999999999,null,null,{"$f":"D175*G175","v":8.5212145000000003E-2}]
[null,"P9950","Auxiliar de topografia",1.2500000000000001E-5,"mês",null,6157.8463000000002,null,null,7.6973078750000007E-2]
[null,"P9824","Servente",7.4999999999999997E-3,"h",null,21.3355,null,null,0.16001625]
[null,"P9848","Desenhista",1.0000000000000001E-5,"mês",null,10307.748600000001,null,null,0.10307748600000001]
[null,null,null,"Custo horário total de mão de obra",{"$nulls":5},{"$f":"SUM(J175:J178)","v":0.42527895974999996}]
[null,null,null,"Custo horário total de execução",{"$nulls":5},{"$f":"J173+J179","v":0.46352895974999997}]
[null,null,null,"Custo unitário de execução",{"$nulls":5},{"$f":"J180/I167","v":0.46352895974999997}]
[{"$nulls":7},"Custo do FIC",null,"-"]
[{"$nulls":7},"Custo do FIT",null,"-"]
[null,"C - MATERIAL",null,"Quantidade","Unidade",null,"Preço Unitário","Custo Unitário"]
[null,"-",0,0,0,null,0,null,null,{"$f":"D185*G185","v":0}]
[null,"-",0,0,0,null,0,null,null,0]
[null,null,null,"Custo unitário total de material",{"$nulls":5},{"$f":"SUM(J185:J186)","v":0}]
[null,"D - ATIVIDADES AUXILIARES",null,"Quantidade","Unidade",null,"Custo Unitário","Custo Unitário"]
[null,"-",0,0,0,null,0,null,null,{"$f":"D189*G189","v":0}]
[null,"-",0,0,0,null,0,null,null,0]
[null,null,null,"Custo total de atividades auxiliares",{"$nulls":5},{"$f":"SUM(J189:J190)","v":0}]
[{"$nulls":7},"Subtotal",null,{"$f":"J181+J187+J191","v":0.46352895974999997}]
[null,"E - TEMPO FIXO",null,"Código","Quantidade","Unidade",null,"Custo Unitário","Custo Unitário"]
[null,"-",0,"-",null,0,null,0,null,{"$f":"ROUNDDOWN(E194*H194,4)","v":0}]
[null,"-",0,"-",null,0,null,0,null,{"$f":"ROUNDDOWN(E195*H195,4)","v":0}]
[null,null,null,"Custo unitário total de tempo fixo",{"$nulls":5},{"$f":"SUM(J194:J195)","v":0}]
[null,"F - MOMENTO DE TRANSPORTE",null,"Quantidade","Unidade","DMT",null,null,null,"Custo Unitário"]
[{"$nulls":5},"LN","RP","P"]
[null,"-",0,null,"tkm"]
[null,"-",0,null,"tkm"]
[null,null,null,"Custo unitário total de transporte"]
[{"$nulls":5},"Custo unitário direto total",null,null,null,{"$f":"TRUNC(J192+J196,2)","v":0.46}]
[null,"Obs."]
[]
[{"$f":"A164+1","v":7},"1ª/GRD",{"$nulls":8},{"$f":"J241","v":6.73}]
[null,"OBRA:"," PAVIMENTAÇÃO EM BLOQUETE SEXTAVADOS - RUAS DIVERSAS - NOVORIZONTE / MG"]
[null,"Custo Unitário de Referência",null,null,"Minas Gerais"]
[{"$nulls":4}," Janeiro/2025 ",null,null,"Produção da equipe ",230.19,{"$f":"VLOOKUP(A205,ORÇAMENTO!$A$10:$L$57,7,1)","v":"M3"}]
[null,5502114,"ESCAVAÇÃO, CARGA E TRANSPORTE DE MATERIAL DE 1ª CATEGORIA - DMT 1.000 A 1.200M, CAMINHO DE SERVIÇO EM REVESTIMENTO PRIMÁRIO",{"$nulls":5},"Valores em reais (R$)"]
[null,"A - EQUIPAMENTOS",null,"Quantidade","Utilização",null,"Custo Horário",null,null,"Custo"]
[{"$nulls":4},"Operativa","Improdutiva","Produtivo","Improdutivo",null,"Horário Total"]
[null,"E9667","Caminhão basculante com capacidade de 14 m³ - 210 kW",4,0.96,0.04,309.83940000000001,90.412199999999999,null,{"$f":"D212*(E212*G212+F212*H212)","v":1204.2492480000001}]
[null,"E9515","Escavadeira hidráulica sobre esteiras com caçamba com capacidade de 1,56 m³ - 118 kW",1,1,0,287.62189999999998,129.0472,null,287.62189999999998]
[{"$nulls":7},"Custo horário total de equipamentos",null,{"$f":"SUM(J212:J213)","v":1491.8711480000002}]
[null,"B - MÃO DE OBRA",null,"Quantidade","Unidade",null,"Custo Horário","Custo Horário Total"]
[null,"P9824","Servente",1,"h",null,21.3355,null,null,{"$f":"D216*G216","v":21.3355}]
[null,"-",0,null,0,null,0,null,null,0]
[null,null,null,"Custo horário total de mão de obra",{"$nulls":5},{"$f":"SUM(J216:J217)","v":21.3355}]
[null,null,null,"Custo horário total de execução",{"$nulls":5},{"$f":"J214+J218","v":1513.2066480000001}]
[null,null,null,"Custo unitário de execução",{"$nulls":5},{"$f":"J219/I208","v":6.5737288674573184}]
[{"$nulls":7},"Custo do FIC",null,0.15820000000000001]
[{"$nulls":7},"Custo do FIT",null,0]
[null,"C - MATERIAL",null,"Quantidade","Unidade",null,"Preço Unitário","Custo Unitário"]
[null,"-",0,null,0,null,0,null,null,{"$f":"D224*G224","v":0}]
[null,"-",0,null,0,null,0,null,null,0]
[null,null,null,"Custo unitário total de material",{"$nulls":5},{"$f":"SUM(J224:J225)","v":0}]
[null,"D - ATIVIDADES AUXILIARES",null,"Quantidade","Unidade",null,"Custo Unitário","Custo Unitário"]
[null,"-",0,0,0,null,0,null,null,{"$f":"D228*G228","v":0}]
[null,"-",0,0,0,null,0,null,null,0]
[null,null,null,"Custo total de atividades auxiliares",{"$nulls":5},{"$f":"SUM(J228:J229)","v":0}]
[{"$nulls":7},"Subtotal",null,{"$f":"J220+J226+J230+J221+J222","v":6.7319288674573183}]
[null,"E - TEMPO FIXO",null,"Código","Quantidade","Unidade",null,"Custo Unitário","Custo Unitário"]
[null,"-",0,"-",null,0,null,0,null,{"$f":"ROUNDDOWN(E233*H233,4)","v":0}]
[null,"-",0,"-",null,0,null,0,null,{"$f":"ROUNDDOWN(E234*H234,4)","v":0}]
[null,null,null,"Custo unitário total de tempo fixo",{"$nulls":5},{"$f":"SUM(J233:J234)","v":0}]
[null,"F - MOMENTO DE TRANSPORTE",null,"Quantidade","Unidade","DMT",null,null,null,"Custo Unitário"]
[{"$nulls":5},"LN","RP","P"]
[null,"-",0,null,"tkm"]
[null,"-",0,null,"tkm"]
[null,null,null,"Custo unitário total de transporte"]
[{"$nulls":5},"Custo unitário direto total",null,null,null,{"$f":"TRUNC(J231+J235,2)","v":6.73}]
[null,"Obs."]
[]
[{"$f":"A205+1","v":8},"1ª/GRD",{"$nulls":8},{"$f":"J284","v":48.2}]
[null,"OBRA:"," PAVIMENTAÇÃO EM BLOQUETE SEXTAVADOS - RUAS DIVERSAS - NOVORIZONTE / MG"]
[null,"Custo Unitário de Referência",null,null,"Minas Gerais"]
[{"$nulls":4}," Janeiro/2025 ",null,null,"Produção da equipe ",150.88,{"$f":"VLOOKUP(A244,ORÇAMENTO!$A$10:$L$57,7,1)","v":"M3"}]
[null,"4011300a","REGULARIZAÇÃO, COMPACTAÇÃO E REFORÇO DE SUBLEITO DE SOLO MELHORADO COM 3% DE CIMENTO, MISTURA NA PISTA",{"$nulls":5},"Valores em reais (R$)"]
[null,"A - EQUIPAMENTOS",null,"Quantidade","Utilização",null,"Custo Horário",null,null,"Custo"]
[{"$nulls":4},"Operativa","Improdutiva","Produtivo","Improdutivo",null,"Horário Total"]
[null,"E9571","Caminhão tanque com capacidade de 10.000 l - 188 kW",1,0.83,0.17,323.59019999999998,80.173299999999998,null,{"$f":"D251*(E251*G251+F251*H251)","v":282.20932699999997}]
[null,"E9518","Grade de 24 discos rebocável de D = 60 cm (24\")",1,0.62,0.38,4.9436,3.4426000000000001,null,4.3732199999999999]
[null,"E9524","Motoniveladora - 93 kW",1,1,0,288.51479999999998,125.7629,null,288.51479999999998]
[null,"E9685","Rolo compactador pé de carneiro vibratório autopropelido por pneus de 11,6 t - 82 kW",2,0.56000000000000005,0.44,225.9264,101.55289999999999,null,342.40412000000003]
[null,"E9762","Rolo compactador de pneus autopropelido de 27 t - 85 kW",2,0.54,0.46,255.65049999999999,124.5621,null,{"$f":"D255*(E255*G255+F255*H255)","v":390.69967200000002}]
[null,"E9577","Trator agrícola sobre pneus - 77 kW",1,0.62,0.38,152.69229999999999,55.394399999999997,null,115.719098]
[{"$nulls":7},"Custo horário total de equipamentos",null,{"$f":"SUM(J251:J256)","v":1423.920237}]
[null,"B - MÃO DE OBRA",null,"Quantidade","Unidade",null,"Custo Horário","Custo Horário Total"]
[null,"P9824","Servente",6,"h",null,21.3355,null,null,{"$f":"D259*G259","v":128.01300000000001}]
[null,"-",0,0,0,null,0,null,null,0]
[null,null,null,"Custo horário total de mão de obra",{"$nulls":5},{"$f":"SUM(J259:J260)","v":128.01300000000001}]
[null,null,null,"Custo horário total de execução",{"$nulls":5},{"$f":"J257+J261","v":1551.933237}]
[null,null,null,"Custo unitário de execução",{"$nulls":5},{"$f":"J262/I247","v":10.285877763785789}]
[{"$nulls":7},"Custo do FIC",null,9.7900000000000001E-2]
[{"$nulls":7},"Custo do FIT",null,0]
[null,"C - MATERIAL",null,"Quantidade","Unidade",null,"Preço Unitário","Custo Unitário"]
[null,"M0424","Cimento Portland CP II - 32 - saco",61.89,"kg",null,0.5786,null,null,{"$f":"D267*G267","v":35.809553999999999}]
[null,"-",0,0,0,null,0,null,null,0]
[null,null,null,"Custo unitário total de material",{"$nulls":5},{"$f":"SUM(J267:J268)","v":35.809553999999999}]
[null,"D - ATIVIDADES AUXILIARES",null,"Quantidade","Unidade",null,"Custo Unitário","Custo Unitário"]
[null,"-",0,0,0,null,0,null,null,{"$f":"D271*G271","v":0}]
[null,"-",0,0,0,null,0,null,null,0]
[null,null,null,"Custo total de atividades auxiliares",{"$nulls":5},{"$f":"SUM(J271:J272)","v":0}]
[{"$nulls":7},"Subtotal",null,{"$f":"J263+J269+J273+J264+J265","v":46.193331763785793}]
[null,"E - TEMPO FIXO",null,"Código","Quantidade","Unidade",null,"Custo Unitário","Custo Unitário"]
[null,"M0424","Cimento Portland CP II - 32 - saco",5914655,6.1890000000000001E-2,"kg",null,32.520000000000003,null,{"$f":"ROUNDDOWN(E276*H276,4)","v":2.0125999999999999}]
[null,"-",0,"-",null,0,null,0,null,{"$f":"ROUNDDOWN(E277*H277,4)","v":0}]
[null,null,null,"Custo unitário total de tempo fixo",{"$nulls":5},{"$f":"SUM(J276:J277)","v":2.0125999999999999}]
[null,"F - MOMENTO DE TRANSPORTE",null,"Quantidade","Unidade","DMT",null,null,null,"Custo Unitário"]
[{"$nulls":5},"LN","RP","P"]
[null,"M0424","Cimento Portland CP II - 32 - saco",6.1890000000000001E-2,"tkm"]
[null,"-",0,null,"tkm"]
[null,null,null,"Custo unitário total de transporte"]
[{"$nulls":5},"Custo unitário direto total",null,null,null,{"$f":"TRUNC(J274+J278,2)","v":48.2}]
[null,"Obs."]
[]
[{"$f":"A244+1","v":9},"1ª/GRD",{"$nulls":8},{"$f":"J324","v":67.930000000000007}]
[null,"OBRA:"," PAVIMENTAÇÃO EM BLOQUETE SEXTAVADOS - RUAS DIVERSAS - NOVORIZONTE / MG"]
[null,"Custo Unitário de Referência",null,null,"Minas Gerais"]
[{"$nulls":4}," Janeiro/2025 ",null,null,"Produção da equipe ",11.876484560570072,{"$f":"VLOOKUP(A287,ORÇAMENTO!$A$10:$L$57,7,1)","v":"M2"}]
[null,92394,"EXECUÇÃO DE PAVIMENTO EM PISO INTERTRAVADO, COM BLOCO SEXTAVADO DE CONCRETO DE 25 X 25 CM, ESPESSURA 8 CM",{"$nulls":5},"Valores em reais (R$)"]
[null,"A - EQUIPAMENTOS",null,"Quantidade","Utilização",null,"Custo Horário",null,null,"Custo"]
[{"$nulls":4},"Operativa","Improdutiva","Produtivo","Improdutivo",null,"Horário Total"]
[null,"E9587","Serra para corte de concreto - 4 kW",1,0.05,0.95,9.5352999999999994,1.3258000000000001,null,{"$f":"D294*(E294*G294+F294*H294)","v":1.736275}]
[null,"E9556","Compactador manual de placa vibratória - 3,00 kW",1,7.0000000000000007E-2,0.93,7.0788000000000002,0.91090000000000004,null,1.3426530000000003]
[{"$nulls":7},"Custo horário total de equipamentos",null,{"$f":"SUM(J294:J295)","v":3.0789280000000003}]
[null,"B - MÃO DE OBRA",null,"Quantidade","Unidade",null,"Custo Horário","Custo Horário Total"]
[null,"P9824","Servente",1,"h",null,21.3355,null,null,{"$f":"D298*G298","v":21.3355}]
[null,"P9802a","Calceteiro",1,"h",null,27.0715,null,null,27.0715]
[null,null,null,"Custo horário total de mão de obra",{"$nulls":5},{"$f":"SUM(J298:J299)","v":48.406999999999996}]
[null,null,null,"Custo horário total de execução",{"$nulls":5},{"$f":"J296+J300","v":51.485927999999994}]
[null,null,null,"Custo unitário de execução",{"$nulls":5},{"$f":"J301/I290","v":4.335115137599999}]
[{"$nulls":7},"Custo do FIC",null,2.2700000000000001E-2]
[{"$nulls":7},"Custo do FIT",null,0]
[null,"C - MATERIAL",null,"Quantidade","Unidade",null,"Preço Unitário","Custo Unitário"]
[null,"M0028","Areia média",5.6800000000000003E-2,"m³",null,70,null,null,{"$f":"D306*G306","v":3.9760000000000004}]
[null,"M1135","Pó de pedra",6.6E-3,"m³",null,132.80000000000001,null,null,{"$f":"D307*G307","v":0.87648000000000004}]
[null,712,"BLOQUETE/PISO INTERTRAVADO DE CONCRETO - MODELO SEXTAVADO / HEXAGONAL, *25 X 25* CM, E = 8 CM, RESISTENCIA DE 35 MPA",1.0038,"m²",null,58.5,"COTAÇÃO",null,58.722300000000004]
[null,null,null,"Custo unitário total de material",{"$nulls":5},{"$f":"SUM(J306:J308)","v":63.574780000000004}]
[null,"D - ATIVIDADES AUXILIARES",null,"Quantidade","Unidade",null,"Custo Unitário","Custo Unitário"]
[null,"-",0,0,0,null,0,null,null,{"$f":"D311*G311","v":0}]
[null,"-",0,0,0,null,0,null,null,0]
[null,null,null,"Custo total de atividades auxiliares",{"$nulls":5},{"$f":"SUM(J311:J312)","v":0}]
[{"$nulls":7},"Subtotal",null,{"$f":"J302+J309+J313+J303+J304","v":67.932595137600003}]
[null,"E - TEMPO FIXO",null,"Código","Quantidade","Unidade",null,"Custo Unitário","Custo Unitário"]
[null,"-",0,"-",null,0,null,0,null,{"$f":"ROUNDDOWN(E316*H316,4)","v":0}]
[null,"-",0,"-",null,0,null,0,null,{"$f":"ROUNDDOWN(E317*H317,4)","v":0}]
[null,null,null,"Custo unitário total de tempo fixo",{"$nulls":5},{"$f":"SUM(J316:J317)","v":0}]
[null,"F - MOMENTO DE TRANSPORTE",null,"Quantidade","Unidade","DMT",null,null,null,"Custo Unitário"]
[{"$nulls":5},"LN","RP","P"]
[null,"-",0,null,"tkm"]
[null,"-",0,null,"tkm"]
[null,null,null,"Custo unitário total de transporte"]
[{"$nulls":5},"Custo unitário direto total",null,null,null,{"$f":"TRUNC(J314+J318,2)","v":67.930000000000007}]
[null,"Obs."]
[]
[15,"1ª/GRD",{"$nulls":8},{"$f":"J363","v":0.54}]
[null,"OBRA:"," PAVIMENTAÇÃO EM BLOQUETE SEXTAVADOS - RUAS DIVERSAS - NOVORIZONTE / MG"]
[null,"Custo Unitário de Referência",null,null,"Minas Gerais"]
[{"$nulls":4}," Janeiro/2025 ",null,null,"Produção da equipe ",570.61,{"$f":"VLOOKUP(A327,ORÇAMENTO!$A$10:$L$57,7,1)","v":"TXKM"}]
[null,5915321,"TRANSPORTE COM CAMINHÃO BASCULANTE, EM VIA URBANA PAVIMENTADA",{"$nulls":5},"Valores em reais (R$)"]
[null,"A - EQUIPAMENTOS",null,"Quantidade","Utilização",null,"Custo Horário",null,null,"Custo"]
[{"$nulls":4},"Operativa","Improdutiva","Produtivo","Improdutivo",null,"Horário Total"]
[null,"E9667","Caminhão basculante com capacidade de 14 m³ - 210 kW",1,1,0,309.83940000000001,90.412199999999999,null,{"$f":"D334*(E334*G334+F334*H334)","v":309.83940000000001}]
[null,"-",0,null,null,null,0,0,null,0]
[{"$nulls":7},"Custo horário total de equipamentos",null,{"$f":"SUM(J334:J335)","v":309.83940000000001}]
[null,"B - MÃO DE OBRA",null,"Quantidade","Unidade",null,"Custo Horário","Custo Horário Total"]
[null,"-",0,null,0,null,0,null,null,{"$f":"D338*G338","v":0}]
[null,"-",0,null,0,null,0,null,null,0]
[null,null,null,"Custo horário total de mão de obra",{"$nulls":5},{"$f":"SUM(J338:J339)","v":0}]
[null,null,null,"Custo horário total de execução",{"$nulls":5},{"$f":"J336+J340","v":309.83940000000001}]
[null,null,null,"Custo unitário de execução",{"$nulls":5},{"$f":"J341/I330","v":0.54299679290583758}]
[{"$nulls":7},"Custo do FIC",null,0]
[{"$nulls":7},"Custo do FIT",null,0]
[null,"C - MATERIAL",null,"Quantidade","Unidade",null,"Preço Unitário","Custo Unitário"]
[null,"-",0,0,0,null,0,null,null,{"$f":"D346*G346","v":0}]
[null,"-",0,0,0,null,0,null,null,0]
[null,null,null,"Custo unitário total de material",{"$nulls":5},{"$f":"SUM(J346:J347)","v":0}]
[null,"D - ATIVIDADES AUXILIARES",null,"Quantidade","Unidade",null,"Custo Unitário","Custo Unitário"]
[null,"-",0,0,0,null,0,null,null,{"$f":"D350*G350","v":0}]
[null,"-",0,0,0,null,0,null,null,0]
[null,null,null,"Custo total de atividades auxiliares",{"$nulls":5},{"$f":"SUM(J350:J351)","v":0}]
[{"$nulls":7},"Subtotal",null,{"$f":"J342+J348+J352+J343+J344","v":0.54299679290583758}]
[null,"E - TEMPO FIXO",null,"Código","Quantidade","Unidade",null,"Custo Unitário","Custo Unitário"]
[null,"-",0,"-",null,0,null,0,null,{"$f":"ROUNDDOWN(E355*H355,4)","v":0}]
[null,"-",0,"-",null,0,null,0,null,{"$f":"ROUNDDOWN(E356*H356,4)","v":0}]
[null,null,null,"Custo unitário total de tempo fixo",{"$nulls":5},{"$f":"SUM(J355:J356)","v":0}]
[null,"F - MOMENTO DE TRANSPORTE",null,"Quantidade","Unidade","DMT",null,null,null,"Custo Unitário"]
[{"$nulls":5},"LN","RP","P"]
[null,"-",0,null,"tkm"]
[null,"-",0,null,"tkm"]
[null,null,null,"Custo unitário total de transporte"]
[{"$nulls":5},"Custo unitário direto total",null,null,null,{"$f":"TRUNC(J353+J357,2)","v":0.54}]
[null,"Obs."]
[]
[16,"1ª/GRD",{"$nulls":8},{"$f":"J402","v":0.72}]
[null,"OBRA:"," PAVIMENTAÇÃO EM BLOQUETE SEXTAVADOS - RUAS DIVERSAS - NOVORIZONTE / MG"]
[null,"Custo Unitário de Referência",null,null,"Minas Gerais"]
[{"$nulls":4}," Janeiro/2025 ",null,null,"Produção da equipe ",435.75,{"$f":"VLOOKUP(A366,ORÇAMENTO!$A$10:$L$57,7,1)","v":"TXKM"}]
[null,5915320,"TRANSPORTE COM CAMINHÃO BASCULANTE, EM VIA COM REVESTIMENTO PRIMÁRIO",{"$nulls":5},"Valores em reais (R$)"]
[null,"A - EQUIPAMENTOS",null,"Quantidade","Utilização",null,"Custo Horário",null,null,"Custo"]
[{"$nulls":4},"Operativa","Improdutiva","Produtivo","Improdutivo",null,"Horário Total"]
[null,"E9667","Caminhão basculante com capacidade de 14 m³ - 210 kW",1,1,0,309.83940000000001,90.412199999999999,null,{"$f":"D373*(E373*G373+F373*H373)","v":309.83940000000001}]
[null,"-",0,null,null,null,0,0,null,0]
[{"$nulls":7},"Custo horário total de equipamentos",null,{"$f":"SUM(J373:J374)","v":309.83940000000001}]
[null,"B - MÃO DE OBRA",null,"Quantidade","Unidade",null,"Custo Horário","Custo Horário Total"]
[null,"-",0,null,0,null,0,null,null,{"$f":"D377*G377","v":0}]
[null,"-",0,null,0,null,0,null,null,0]
[null,null,null,"Custo horário total de mão de obra",{"$nulls":5},{"$f":"SUM(J377:J378)","v":0}]
[null,null,null,"Custo horário total de execução",{"$nulls":5},{"$f":"J375+J379","v":309.83940000000001}]
[null,null,null,"Custo unitário de execução",{"$nulls":5},{"$f":"J380/I369","v":0.71104853700516357}]
[{"$nulls":7},"Custo do FIC",null,1.4E-2]
[{"$nulls":7},"Custo do FIT",null,0]
[null,"C - MATERIAL",null,"Quantidade","Unidade",null,"Preço Unitário","Custo Unitário"]
[null,"-",0,0,0,null,0,null,null,{"$f":"D385*G385","v":0}]
[null,"-",0,0,0,null,0,null,null,0]
[null,null,null,"Custo unitário total de material",{"$nulls":5},{"$f":"SUM(J385:J386)","v":0}]
[null,"D - ATIVIDADES AUXILIARES",null,"Quantidade","Unidade",null,"Custo Unitário","Custo Unitário"]
[null,"-",0,0,0,null,0,null,null,{"$f":"D389*G389","v":0}]
[null,"-",0,0,0,null,0,null,null,0]
[null,null,null,"Custo total de atividades auxiliares",{"$nulls":5},{"$f":"SUM(J389:J390)","v":0}]
[{"$nulls":7},"Subtotal",null,{"$f":"J381+J387+J391+J382+J383","v":0.72504853700516358}]
[null,"E - TEMPO FIXO",null,"Código","Quantidade","Unidade",null,"Custo Unitário","Custo Unitário"]
[null,"-",0,"-",null,0,null,0,null,{"$f":"ROUNDDOWN(E394*H394,4)","v":0}]
[null,"-",0,"-",null,0,null,0,null,{"$f":"ROUNDDOWN(E395*H395,4)","v":0}]
[null,null,null,"Custo unitário total de tempo fixo",{"$nulls":5},{"$f":"SUM(J394:J395)","v":0}]
[null,"F - MOMENTO DE TRANSPORTE",null,"Quantidade","Unidade","DMT",null,null,null,"Custo Unitário"]
[{"$nulls":5},"LN","RP","P"]
[null,"-",0,null,"tkm"]
[null,"-",0,null,"tkm"]
[null,null,null,"Custo unitário total de transporte"]
[{"$nulls":5},"Custo unitário direto total",null,null,null,{"$f":"TRUNC(J392+J396,2)","v":0.72}]
[null,"Obs."]
[]
[{"$f":"A366+1","v":17},"1ª/GRD",{"$nulls":8},{"$f":"J441","v":0.74}]
[null,"OBRA:"," PAVIMENTAÇÃO EM BLOQUETE SEXTAVADOS - RUAS DIVERSAS - NOVORIZONTE / MG"]
[null,"Custo Unitário de Referência",null,null,"Minas Gerais"]
[{"$nulls":4}," Janeiro/2025 ",null,null,"Produção da equipe ",241.03,{"$f":"VLOOKUP(A405,ORÇAMENTO!$A$10:$L$57,7,1)","v":"TXKM"}]
[null,5914434,"TRANSPORTE COM CAMINHÃO CARROCERIA, EM VIA URBANA PAVIMENTADA",{"$nulls":5},"Valores em reais (R$)"]
[null,"A - EQUIPAMENTOS",null,"Quantidade","Utilização",null,"Custo Horário",null,null,"Custo"]
[{"$nulls":4},"Operativa","Improdutiva","Produtivo","Improdutivo",null,"Horário Total"]
[null,"E9508","Caminhão carroceria com capacidade de 9 t - 136 kW",1,1,0,178.82759999999999,67.927099999999996,null,{"$f":"D412*(E412*G412+F412*H412)","v":178.82759999999999}]
[null,"-",0,null,null,null,0,0,null,0]
[{"$nulls":7},"Custo horário total de equipamentos",null,{"$f":"SUM(J412:J413)","v":178.82759999999999}]
[null,"B - MÃO DE OBRA",null,"Quantidade","Unidade",null,"Custo Horário","Custo Horário Total"]
[null,"-",0,0,0,null,0,null,null,{"$f":"D416*G416","v":0}]
[null,"-",0,0,0,null,0,null,null,0]
[null,null,null,"Custo horário total de mão de obra",{"$nulls":5},{"$f":"SUM(J416:J417)","v":0}]
[null,null,null,"Custo horário total de execução",{"$nulls":5},{"$f":"J414+J418","v":178.82759999999999}]
[null,null,null,"Custo unitário de execução",{"$nulls":5},{"$f":"J419/I408","v":0.7419308799734472}]
[{"$nulls":7},"Custo do FIC",null,0]
[{"$nulls":7},"Custo do FIT",null,0]
[null,"C - MATERIAL",null,"Quantidade","Unidade",null,"Preço Unitário","Custo Unitário"]
[null,"-",0,0,0,null,0,null,null,{"$f":"D424*G424","v":0}]
[null,"-",0,0,0,null,0,null,null,0]
[null,null,null,"Custo unitário total de material",{"$nulls":5},{"$f":"SUM(J424:J425)","v":0}]
[null,"D - ATIVIDADES AUXILIARES",null,"Quantidade","Unidade",null,"Custo Unitário","Custo Unitário"]
[null,"-",0,0,0,null,0,null,null,{"$f":"D428*G428","v":0}]
[null,"-",0,0,0,null,0,null,null,0]
[null,null,null,"Custo total de atividades auxiliares",{"$nulls":5},{"$f":"SUM(J428:J429)","v":0}]
[{"$nulls":7},"Subtotal",null,{"$f":"J420+J426+J430+J421+J422","v":0.7419308799734472}]
[null,"E - TEMPO FIXO",null,"Código","Quantidade","Unidade",null,"Custo Unitário","Custo Unitário"]
[null,"-",0,"-",null,0,null,0,null,{"$f":"ROUNDDOWN(E433*H433,4)","v":0}]
[null,"-",0,"-",null,0,null,0,null,{"$f":"ROUNDDOWN(E434*H434,4)","v":0}]
[null,null,null,"Custo unitário total de tempo fixo",{"$nulls":5},{"$f":"SUM(J433:J434)","v":0}]
[null,"F - MOMENTO DE TRANSPORTE",null,"Quantidade","Unidade","DMT",null,null,null,"Custo Unitário"]
[{"$nulls":5},"LN","RP","P"]
[null,"-",0,null,"tkm"]
[null,"-",0,null,"tkm"]
[null,null,null,"Custo unitário total de transporte"]
[{"$nulls":5},"Custo unitário direto total",null,null,null,{"$f":"TRUNC(J431+J435,2)","v":0.74}]
[null,"Obs."]
[]
[{"$f":"A405+1","v":18},"1ª/GRD",{"$nulls":8},{"$f":"J480","v":0.9}]
[null,"OBRA:"," PAVIMENTAÇÃO EM BLOQUETE SEXTAVADOS - RUAS DIVERSAS - NOVORIZONTE / MG"]
[null,"Custo Unitário de Referência",null,null,"Minas Gerais"]
[{"$nulls":4}," Janeiro/2025 ",null,null,"Produção da equipe ",200.86,{"$f":"VLOOKUP(A444,ORÇAMENTO!$A$10:$L$57,7,1)","v":"TXKM"}]
[null,5914419,"TRANSPORTE COM CAMINHÃO CARROCERIA, EM VIA COM REVESTIMENTO PRIMÁRIO",{"$nulls":5},"Valores em reais (R$)"]
[null,"A - EQUIPAMENTOS",null,"Quantidade","Utilização",null,"Custo Horário",null,null,"Custo"]
[{"$nulls":4},"Operativa","Improdutiva","Produtivo","Improdutivo",null,"Horário Total"]
[null,"E9508","Caminhão carroceria com capacidade de 9 t - 136 kW",1,1,0,178.82759999999999,67.927099999999996,null,{"$f":"D451*(E451*G451+F451*H451)","v":178.82759999999999}]
[null,"-",0,null,null,null,0,0,null,0]
[{"$nulls":7},"Custo horário total de equipamentos",null,{"$f":"SUM(J451:J452)","v":178.82759999999999}]
[null,"B - MÃO DE OBRA",null,"Quantidade","Unidade",null,"Custo Horário","Custo Horário Total"]
[null,"-",0,0,0,null,0,null,null,{"$f":"D455*G455","v":0}]
[null,"-",0,0,0,null,0,null,null,0]
[null,null,null,"Custo horário total de mão de obra",{"$nulls":5},{"$f":"SUM(J455:J456)","v":0}]
[null,null,null,"Custo horário total de execução",{"$nulls":5},{"$f":"J453+J457","v":178.82759999999999}]
[null,null,null,"Custo unitário de execução",{"$nulls":5},{"$f":"J458/I447","v":0.89030966842576909}]
[{"$nulls":7},"Custo do FIC",null,1.8200000000000001E-2]
[{"$nulls":7},"Custo do FIT",null,0]
[null,"C - MATERIAL",null,"Quantidade","Unidade",null,"Preço Unitário","Custo Unitário"]
[null,"-",0,0,0,null,0,null,null,{"$f":"D463*G463","v":0}]
[null,"-",0,0,0,null,0,null,null,0]
[null,null,null,"Custo unitário total de material",{"$nulls":5},{"$f":"SUM(J463:J464)","v":0}]
[null,"D - ATIVIDADES AUXILIARES",null,"Quantidade","Unidade",null,"Custo Unitário","Custo Unitário"]
[null,"-",0,0,0,null,0,null,null,{"$f":"D467*G467","v":0}]
[null,"-",0,0,0,null,0,null,null,0]
[null,null,null,"Custo total de atividades auxiliares",{"$nulls":5},{"$f":"SUM(J467:J468)","v":0}]
[{"$nulls":7},"Subtotal",null,{"$f":"J459+J465+J469+J460+J461","v":0.90850966842576908}]
[null,"E - TEMPO FIXO",null,"Código","Quantidade","Unidade",null,"Custo Unitário","Custo Unitário"]
[null,"-",0,"-",null,0,null,0,null,{"$f":"ROUNDDOWN(E472*H472,4)","v":0}]
[null,"-",0,"-",null,0,null,0,null,{"$f":"ROUNDDOWN(E473*H473,4)","v":0}]
[null,null,null,"Custo unitário total de tempo fixo",{"$nulls":5},{"$f":"SUM(J472:J473)","v":0}]
[null,"F - MOMENTO DE TRANSPORTE",null,"Quantidade","Unidade","DMT",null,null,null,"Custo Unitário"]
[{"$nulls":5},"LN","RP","P"]
[null,"-",0,null,"tkm"]
[null,"-",0,null,"tkm"]
[null,null,null,"Custo unitário total de transporte"]
[{"$nulls":5},"Custo unitário direto total",null,null,null,{"$f":"TRUNC(J470+J474,2)","v":0.9}]
[null,"Obs."]
[]
[20,"1ª/GRD",{"$nulls":8},{"$f":"J520","v":57.51}]
[null,"OBRA:"," PAVIMENTAÇÃO EM BLOQUETE SEXTAVADOS - RUAS DIVERSAS - NOVORIZONTE / MG"]
[null,"Custo Unitário de Referência",null,null,"Minas Gerais"]
[{"$nulls":4}," Janeiro/2025 ",null,null,"Produção da equipe ",1,{"$f":"VLOOKUP(A483,ORÇAMENTO!$A$10:$L$57,7,1)","v":"M"}]
[null,"94267a","GUIA (MEIO-FIO) E SARJETA CONJUGADOS DE CONCRETO, MOLDADA  IN LOCO COM EXTRUSORA, 45 CM BASE (15 CM BASE DA GUIA + 30 CM SARJETA) X 22 CM ALTURA",{"$nulls":5},"Valores em reais (R$)"]
[null,"A - EQUIPAMENTOS",null,"Quantidade","Utilização",null,"Custo Horário",null,null,"Custo"]
[{"$nulls":4},"Operativa","Improdutiva","Produtivo","Improdutivo",null,"Horário Total"]
[null,"E9103","Extrusora para meio-fio de concreto - 10,44 kW",1,1.8200000000000001E-2,9.11E-2,44.7117,31.4786,null,{"$f":"D490*(E490*G490+F490*H490)","v":3.6814534000000001}]
[null,"-",0,null,null,null,0,0,null,0]
[{"$nulls":7},"Custo horário total de equipamentos",null,{"$f":"SUM(J490:J491)","v":3.6814534000000001}]
[null,"B - MÃO DE OBRA",null,"Quantidade","Unidade",null,"Custo Horário","Custo Horário Total"]
[null,"P9821","Pedreiro",0.22650000000000001,"h",null,26.6785,null,null,{"$f":"D494*G494","v":6.0426802500000001}]
[null,"P9802","Ajudante especializado",0.10929999999999999,"h",null,27.0715,null,null,2.95891495]
[null,"P9824","Servente",0.45300000000000001,"h",null,21.3355,null,null,9.6649814999999997]
[null,null,null,"Custo horário total de mão de obra",{"$nulls":5},{"$f":"SUM(J494:J496)","v":18.6665767}]
[null,null,null,"Custo horário total de execução",{"$nulls":5},{"$f":"J492+J497","v":22.348030099999999}]
[null,null,null,"Custo unitário de execução",{"$nulls":5},{"$f":"J498/I486","v":22.348030099999999}]
[{"$nulls":7},"Custo do FIC",null,0]
[{"$nulls":7},"Custo do FIT",null,0]
[null,"C - MATERIAL",null,"Quantidade","Unidade",null,"Preço Unitário","Custo Unitário"]
[null,"M0028","Areia média",1.49E-2,"m³",null,70,null,null,{"$f":"D503*G503","v":1.0429999999999999}]
[null,"-",0,null,0,null,0,null,null,0]
[null,null,null,"Custo unitário total de material",{"$nulls":5},{"$f":"SUM(J503:J504)","v":1.0429999999999999}]
[null,"D - ATIVIDADES AUXILIARES",null,"Quantidade","Unidade",null,"Custo Unitário","Custo Unitário"]
[null,1107892,"Concreto fck = 20 MPa - confecção em betoneira e lançamento manual - areia e brita comerciais",6.7299999999999999E-2,"m³",null,483.94,null,null,{"$f":"D507*G507","v":32.569161999999999}]
[null,1109671,"Argamassa de cimento e areia 1:4 - confecção em betoneira e lançamento manual - areia comercial",3.3E-3,"m³",null,470.75,null,null,1.5534749999999999]
[null,null,null,"Custo total de atividades auxiliares",{"$nulls":5},{"$f":"SUM(J507:J508)","v":34.122636999999997}]
[{"$nulls":7},"Subtotal",null,{"$f":"J499+J505+J509+J500+J501","v":57.513667099999992}]
[null,"E - TEMPO FIXO",null,"Código","Quantidade","Unidade",null,"Custo Unitário","Custo Unitário"]
[null,"-",0,"-",null,0,null,0,null,{"$f":"ROUNDDOWN(E512*H512,4)","v":0}]
[null,"-",0,"-",null,0,null,0,null,{"$f":"ROUNDDOWN(E513*H513,4)","v":0}]
[null,null,null,"Custo unitário total de tempo fixo",{"$nulls":5},{"$f":"SUM(J512:J513)","v":0}]
[null,"F - MOMENTO DE TRANSPORTE",null,"Quantidade","Unidade","DMT",null,null,null,"Custo Unitário"]
[{"$nulls":5},"LN","RP","P"]
[null,"-",0,null,"tkm"]
[null,"-",0,null,"tkm"]
[null,null,null,"Custo unitário total de transporte"]
[{"$nulls":5},"Custo unitário direto total",null,null,null,{"$f":"TRUNC(J510+J514,2)","v":57.51}]
[null,"Obs."]
[]
[22,"1ª/GRD",{"$nulls":8},{"$f":"J560","v":35.81}]
[null,"OBRA:"," PAVIMENTAÇÃO EM BLOQUETE SEXTAVADOS - RUAS DIVERSAS - NOVORIZONTE / MG"]
[null,"Custo Unitário de Referência",null,null,"Minas Gerais"]
[{"$nulls":4}," Janeiro/2025 ",null,null,"Produção da equipe ",1,{"$f":"VLOOKUP(A523,ORÇAMENTO!$A$10:$L$57,7,1)","v":"M"}]
[null,94263,"GUIA (MEIO-FIO) CONCRETO, MOLDADA IN LOCO EM TRECHO RETO (PARA TRAVAMENTO), 13 CM BASE X 22 CM ALTURA",{"$nulls":5},"Valores em reais (R$)"]
[null,"A - EQUIPAMENTOS",null,"Quantidade","Utilização",null,"Custo Horário",null,null,"Custo"]
[{"$nulls":4},"Operativa","Improdutiva","Produtivo","Improdutivo",null,"Horário Total"]
[null,"E9103","Extrusora para meio-fio de concreto - 10,44 kW",1,1.44E-2,7.22E-2,44.7117,31.4786,null,{"$f":"D530*(E530*G530+F530*H530)","v":2.9166034000000001}]
[null,"-",0,null,null,null,0,0,null,0]
[{"$nulls":7},"Custo horário total de equipamentos",null,{"$f":"SUM(J530:J531)","v":2.9166034000000001}]
[null,"B - MÃO DE OBRA",null,"Quantidade","Unidade",null,"Custo Horário","Custo Horário Total"]
[null,"P9821","Pedreiro",0.2039,"h",null,26.6785,null,null,{"$f":"D534*G534","v":5.4397461499999995}]
[null,"P9802","Ajudante especializado",8.6699999999999999E-2,"h",null,27.0715,null,null,2.3470990500000002]
[null,"P9824","Servente",0.4078,"h",null,21.3355,null,null,8.7006169]
[null,null,null,"Custo horário total de mão de obra",{"$nulls":5},{"$f":"SUM(J534:J536)","v":16.487462100000002}]
[null,null,null,"Custo horário total de execução",{"$nulls":5},{"$f":"J532+J537","v":19.404065500000002}]
[null,null,null,"Custo unitário de execução",{"$nulls":5},{"$f":"J538/I526","v":19.404065500000002}]
[{"$nulls":7},"Custo do FIC",null,"-"]
[{"$nulls":7},"Custo do FIT",null,"-"]
[null,"C - MATERIAL",null,"Quantidade","Unidade",null,"Preço Unitário","Custo Unitário"]
[null,"M0028","Areia média",6.6E-3,"m³",null,70,null,null,{"$f":"D543*G543","v":0.46200000000000002}]
[null,"-",0,null,0,null,0,null,null,0]
[null,null,null,"Custo unitário total de material",{"$nulls":5},{"$f":"SUM(J543:J544)","v":0.46200000000000002}]
[null,"D - ATIVIDADES AUXILIARES",null,"Quantidade","Unidade",null,"Custo Unitário","Custo Unitário"]
[null,1107892,"Concreto fck = 20 MPa - confecção em betoneira e lançamento manual - areia e brita comerciais",3.1399999999999997E-2,"m³",null,483.94,null,null,{"$f":"D547*G547","v":15.195715999999999}]
[null,1109671,"Argamassa de cimento e areia 1:4 - confecção em betoneira e lançamento manual - areia comercial",1.6000000000000001E-3,"m³",null,470.75,null,null,0.75319999999999998]
[null,null,null,"Custo total de atividades auxiliares",{"$nulls":5},{"$f":"SUM(J547:J548)","v":15.948915999999999}]
[{"$nulls":7},"Subtotal",null,{"$f":"J539+J545+J549","v":35.814981500000002}]
[null,"E - TEMPO FIXO",null,"Código","Quantidade","Unidade",null,"Custo Unitário","Custo Unitário"]
[null,"-",0,"-",null,0,null,0,null,{"$f":"ROUNDDOWN(E552*H552,4)","v":0}]
[null,"-",0,"-",null,0,null,0,null,{"$f":"ROUNDDOWN(E553*H553,4)","v":0}]
[null,null,null,"Custo unitário total de tempo fixo",{"$nulls":5},{"$f":"SUM(J552:J553)","v":0}]
[null,"F - MOMENTO DE TRANSPORTE",null,"Quantidade","Unidade","DMT",null,null,null,"Custo Unitário"]
[{"$nulls":5},"LN","RP","P"]
[null,"-",0,null,"tkm"]
[null,"-",0,null,"tkm"]
[null,null,null,"Custo unitário total de transporte"]
[{"$nulls":5},"Custo unitário direto total",null,null,null,{"$f":"TRUNC(J550+J554,2)","v":35.81}]
[null,"Obs."]
[]
[46,"1ª/GRD",{"$nulls":8},{"$f":"J600","v":486.02}]
[null,"OBRA:"," PAVIMENTAÇÃO EM BLOQUETE SEXTAVADOS - RUAS DIVERSAS - NOVORIZONTE / MG"]
[null,"Custo Unitário de Referência",null,null,"Minas Gerais"]
[{"$nulls":4}," Janeiro/2025 ",null,null,"Produção da equipe ",3,{"$f":"VLOOKUP(A563,ORÇAMENTO!$A$10:$L$57,7,1)","v":"UNID."}]
[null,"5213440+\n5213863a","FORNECIMENTO E INSTALAÇÃO DE PLACA DE SINALIZAÇÃO VIÁRIA - REGULAMENTAÇÃO 0,60MX0,60M, SUPORTE INCLUSO",{"$nulls":5},"Valores em reais (R$)"]
[null,"A - EQUIPAMENTOS",null,"Quantidade","Utilização",null,"Custo Horário",null,null,"Custo"]
[{"$nulls":4},"Operativa","Improdutiva","Produtivo","Improdutivo",null,"Horário Total"]
[null,"E9687","Caminhão carroceria com capacidade de 5 t - 115 kW",1,0.3,0.7,146.88079999999999,57.423099999999998,null,{"$f":"D570*(E570*G570+F570*H570)","v":84.260409999999993}]
[null,"-",0,null,null,null,0,0,null,0]
[{"$nulls":7},"Custo horário total de equipamentos",null,{"$f":"SUM(J570:J571)","v":84.260409999999993}]
[null,"B - MÃO DE OBRA",null,"Quantidade","Unidade",null,"Custo Horário","Custo Horário Total"]
[null,"P9830","Montador",1,"h",null,36.409500000000001,null,null,{"$f":"D574*G574","v":36.409500000000001}]
[null,"P9824","Servente",2,"h",null,21.3355,null,null,42.670999999999999]
[null,null,null,"Custo horário total de mão de obra",{"$nulls":5},{"$f":"SUM(J574:J575)","v":79.080500000000001}]
[null,null,null,"Custo horário total de execução",{"$nulls":5},{"$f":"J572+J576","v":163.34091000000001}]
[null,null,null,"Custo unitário de execução",{"$nulls":5},{"$f":"J577/I566","v":54.44697}]
[{"$nulls":7},"Custo do FIC",null,0]
[{"$nulls":7},"Custo do FIT",null,0]
[null,"C - MATERIAL",null,"Quantidade","Unidade",null,"Preço Unitário","Custo Unitário"]
[null,"M1614","Tubo em aço galvanizado com rosca BSP classe leve - D = 50 mm (2\")",3,"m",null,59.914000000000001,null,null,{"$f":"D582*G582","v":179.74200000000002}]
[null,"M0789","Conjunto para fixação de placas em aço galvanizado composto por barra chata, abraçadeira, parafusos, porcas e arruelas",0.69699999999999995,"kg",null,29.133400000000002,null,null,20.305979799999999]
[null,null,null,"Custo unitário total de material",{"$nulls":5},{"$f":"SUM(J582:J583)","v":200.04797980000001}]
[null,"D - ATIVIDADES AUXILIARES",null,"Quantidade","Unidade",null,"Custo Unitário","Custo Unitário"]
[null,5213414,"Placa em aço nº 16 galvanizado com película retrorrefletiva tipo I + SI - confecção",0.35993999999999998,"m²",null,569.58000000000004,null,null,{"$f":"D586*G586","v":205.01462520000001}]
[null,1107892,"Concreto fck = 20 MPa - confecção em betoneira e lançamento manual - areia e brita comerciais",5.0270000000000002E-2,"m³",null,483.94,null,null,24.3276638]
[null,4805750,"Escavação manual em material de 1ª categoria na profundidade de até 1 m",5.0270000000000002E-2,"m³",null,43.54,null,null,2.1887558]
[null,null,null,"Custo total de atividades auxiliares",{"$nulls":5},{"$f":"SUM(J586:J588)","v":231.53104480000002}]
[{"$nulls":7},"Subtotal",null,{"$f":"J578+J584+J589+J579+J580","v":486.02599459999999}]
[null,"E - TEMPO FIXO",null,"Código","Quantidade","Unidade",null,"Custo Unitário","Custo Unitário"]
[null,"-",0,"-",null,0,null,0,null,{"$f":"ROUNDDOWN(E592*H592,4)","v":0}]
[null,"-",0,"-",null,0,null,0,null,{"$f":"ROUNDDOWN(E593*H593,4)","v":0}]
[null,null,null,"Custo unitário total de tempo fixo",{"$nulls":5},{"$f":"SUM(J592:J593)","v":0}]
[null,"F - MOMENTO DE TRANSPORTE",null,"Quantidade","Unidade","DMT",null,null,null,"Custo Unitário"]
[{"$nulls":5},"LN","RP","P"]
[null,"-",0,null,"tkm"]
[null,"-",0,null,"tkm"]
[null,null,null,"Custo unitário total de transporte"]
[{"$nulls":5},"Custo unitário direto total",null,null,null,{"$f":"TRUNC(J590+J594,2)","v":486.02}]
[null,"Obs."]
[]
[47,"1ª/GRD",{"$nulls":8},{"$f":"J639","v":172.38}]
[null,"OBRA:"," PAVIMENTAÇÃO EM BLOQUETE SEXTAVADOS - RUAS DIVERSAS - NOVORIZONTE / MG"]
[null,"Custo Unitário de Referência",null,null,"Minas Gerais"]
[{"$nulls":4}," Janeiro/2025 ",null,null,"Produção da equipe ",3,{"$f":"VLOOKUP(A603,ORÇAMENTO!$A$10:$L$57,7,1)","v":"UNID."}]
[null,"CPU.5","FORNECIMENTO E INSTALAÇÃO DE PLACA DE IDENTIFICAÇÃO DE LOGRADOURO, SUPORTE EXISTENTE - CONFORME PROJETO",{"$nulls":5},"Valores em reais (R$)"]
[null,"A - EQUIPAMENTOS",null,"Quantidade","Utilização",null,"Custo Horário",null,null,"Custo"]
[{"$nulls":4},"Operativa","Improdutiva","Produtivo","Improdutivo",null,"Horário Total"]
[null,"-",0,null,null,null,0,0,null,{"$f":"D610*(E610*G610+F610*H610)","v":0}]
[null,"-",0,null,null,null,0,0,null,0]
[{"$nulls":7},"Custo horário total de equipamentos",null,{"$f":"SUM(J610:J611)","v":0}]
[null,"B - MÃO DE OBRA",null,"Quantidade","Unidade",null,"Custo Horário","Custo Horário Total"]
[null,"P9830","Montador",1,"h",null,36.409500000000001,null,null,{"$f":"D614*G614","v":36.409500000000001}]
[null,"P9824","Servente",2,"h",null,21.3355,null,null,42.670999999999999]
[null,null,null,"Custo horário total de mão de obra",{"$nulls":5},{"$f":"SUM(J614:J615)","v":79.080500000000001}]
[null,null,null,"Custo horário total de execução",{"$nulls":5},{"$f":"J612+J616","v":79.080500000000001}]
[null,null,null,"Custo unitário de execução",{"$nulls":5},{"$f":"J617/I606","v":26.360166666666668}]
[{"$nulls":7},"Custo do FIC",null,0]
[{"$nulls":7},"Custo do FIT",null,0]
[null,"C - MATERIAL",null,"Quantidade","Unidade",null,"Preço Unitário","Custo Unitário"]
[null,13521,"PLACA DE ACO ESMALTADA PARA IDENTIFICACAO DE RUA, *45 CM X 20* CM, INCLUSIVE SUPORTE DE FIXAÇÃO ",1,"UNID.",null,146.02000000000001,null,null,{"$f":"D622*G622","v":146.02000000000001}]
[null,"-",0,2.5,0,null,0,null,null,0]
[null,null,null,"Custo unitário total de material",{"$nulls":5},{"$f":"SUM(J622:J623)","v":146.02000000000001}]
[null,"D - ATIVIDADES AUXILIARES",null,"Quantidade","Unidade",null,"Custo Unitário","Custo Unitário"]
[null,"-",0,5.0270000000000002E-2,0,null,0,null,null,{"$f":"D626*G626","v":0}]
[null,"-",0,5.0270000000000002E-2,0,null,0,null,null,{"$f":"D627*G627","v":0}]
[null,null,null,"Custo total de atividades auxiliares",{"$nulls":5},{"$f":"SUM(J626:J627)","v":0}]
[{"$nulls":7},"Subtotal",null,{"$f":"J618+J624+J628+J619+J620","v":172.38016666666667}]
[null,"E - TEMPO FIXO",null,"Código","Quantidade","Unidade",null,"Custo Unitário","Custo Unitário"]
[null,"-",0,"-",null,0,null,0,null,{"$f":"ROUNDDOWN(E631*H631,4)","v":0}]
[null,"-",0,"-",null,0,null,0,null,{"$f":"ROUNDDOWN(E632*H632,4)","v":0}]
[null,null,null,"Custo unitário total de tempo fixo",{"$nulls":5},{"$f":"SUM(J631:J632)","v":0}]
[null,"F - MOMENTO DE TRANSPORTE",null,"Quantidade","Unidade","DMT",null,null,null,"Custo Unitário"]
[{"$nulls":5},"LN","RP","P"]
[null,"-",0,null,"tkm"]
[null,"-",0,null,"tkm"]
[null,null,null,"Custo unitário total de transporte"]
[{"$nulls":5},"Custo unitário direto total",null,null,null,{"$f":"TRUNC(J629+J633,2)","v":172.38}]
[null,"Obs."]

{"sheet":"BDI SERV","index":2,"n_rows":60,"n_cols":5,"rows_kept":60,"cut":false,"hidden":false,"merged":[[36,0,36,5],[38,1,38,4],[39,2,39,3],[35,0,35,5],[0,1,2,4],[25,1,25,3],[26,1,26,2],[26,3,26,4],[27,3,27,4]]}
[null,"DETALHAMENTO DO BDI - SERVIÇOS"]
[]
[]
[null,"Item","Descrição dos Serviços","% - PV","% - CD"]
[]
[null,1,"ADMINISTRAÇÃO CENTRAL"," ",{"$f":"SUM(E7:E9)","v":4.01}]
[null,"1.1","ESCRITÓRIO CENTRAL",null,4.01]
[null,"1.2","VIAGENS"]
[null,"1.3","OUTROS"]
[null," "," "," "," "]
[null,2,"IMPOSTOS E TAXAS",{"$f":"SUM(D12:D15)","v":7.65},{"$f":"SUM(E12:E15)","v":0}]
[null,"2.1","ISS - Proposta",{"$f":"D34*100","v":4}]
[null,"2.2","PIS",0.65]
[null,"2.3","Cofins",3]
[null,"2.4","Contribuição Previdenciaria (CPRB)"]
[]
[null,3,"TAXA DE RISCO",null,{"$f":"SUM(E18:E20)","v":0.96}]
[null,"3.1","SEGURO",null,0.2]
[null,"3.2","RISCO",null,0.56000000000000005]
[null,"3.3","GARANTIA",null,0.2]
[]
[null,4,"DESPESAS FINANCEIRAS",null,1.1100000000000001]
[]
[null,5,"LUCRO",null,8]
[]
[null,"BDI APRESENTADO:",null,null,{"$f":"IF($D$41=$C$43,$D$43,IF($D$41=$C$44,$D$44,IF($D$41=$C$44,$D$44,IF($D$41=$C$45,$D$45,0))))","v":24.12}]
[]
[null,null,"Legislação Municipal:","Declaração da Prefeitura"]
[null,null,"Município:","Novorizonte"]
[null,null,"Alíquota ISSQN:",0.04,"Município"]
[null,null,"Base de Cálculo:",1]
[null,null,"Valor Serviço:",2417917.9300000002]
[null,null,"Dedução - Material (estimado):",0,{"$f":"D33/D32","v":0}]
[null,null,"ISSQN BDI:",{"$f":"IF(D32=\"\",0,ROUND(IF(D31=D49,((1-(D33/D32))*D30),D30*D31),4))","v":0.04},"(*)"]
[]
["Acórdão nº 2.622/2013 - TCU Plenário"]
["BDI = ARRED((((((1+(AC+TR)/100)*(1+DF/100)*(1+L/100))/(1-IMP/100))-1)*100);2)"]
[]
[null,"(*) É obrigação da licitante a verificação da Legislação Tributária vigente no município, bem como o cálculo dos valores totais de serviços e materiais estimados, para apresentação de sua proposta."]
[]
[null,null,"Forma de Cálculo do BDI:","BDI - Acórdão nº 2.622/2013 - TCU"]
[]
[null,null,"BDI - Digitado",{"$f":"ROUND(E6+E11+E17+E22+E24,2)","v":14.08}]
[null,null,"BDI - Calculado",{"$f":"ROUND((((1+(E6/100+E22/100+E17/100))/(1-(D11/100+E24/100)))-1)*100,2)","v":25.76}]
[null,null,"BDI - Acórdão nº 2.622/2013 - TCU",{"$f":"ROUND((((((1+(E6+E17)/100)*(1+E22/100)*(1+E24/100))/(1-D11/100))-1)*100),2)","v":24.12}]
[]
[]
[]
[null,null,null,"Dedução - Material","Município"]
[null,null,null,0.1,"Simples Nacional"]
[null,null,null,0.2,"Municípios Indefinidos"]
[null,null,null,0.3]
[null,null,null,0.4]
[null,null,null,0.5]
[null,null,null,0.6]
[null,null,null,0.7]
[null,null,null,0.8]
[null,null,null,0.9]
[null,null,null,1]
[null,null,null,{"$f":"E31","v":0}]

{"sheet":"CRONOGRAMA","index":3,"n_rows":17,"n_cols":14,"rows_kept":17,"cut":false,"hidden":false,"merged":[[13,1,14,2],[16,1,20,13],[7,2,8,2],[9,2,10,2],[11,2,12,2],[7,1,8,1],[9,1,10,1],[11,1,12,1],[7,0,8,0],[9,0,10,0],[11,0,12,0],[0,1,0,13],[1,6,1,13],[2,6,2,13],[3,1,3,6],[5,0,6,0],[5,2,6,2],[1,1,2,1],[5,1,6,1],[1,2,2,4]]}
[null,"CRONOGRAMA FÍSICO-FINANCEIRO"]
[null,"OBRA: ",{"$f":"ORÇAMENTO!C5","v":" PAVIMENTAÇÃO EM BLOQUETE SEXTAVADOS - RUAS DIVERSAS - NOVORIZONTE / MG"},null,null,"VALOR:",{"$f":"ORÇAMENTO!L30","v":2999827.73}]
[{"$nulls":5},"PRAZO: ","240 DIAS "]
[]
[null,"ITEM","ETAPAS/DESCRIÇAO","FISICO/  FINANCEIRO","TOTAL    ETAPAS","MÊS 1","MÊS 2","MÊS 3","MÊS 4","MÊS 5","MÊS 6","MÊS 7","MÊS 8","TOTAL"]
["A",{"$f":"VLOOKUP(A6,ORÇAMENTO!$A$10:$L$30,2)","v":1},{"$f":"VLOOKUP(A6,ORÇAMENTO!$A$10:$L$30,5)","v":"SERVIÇOS PRELIMINARES "},"FISICO ",{"$f":"ROUND(E7/$G$2,4)","v":0.10150000000000001},0.25,0.1,0.1,0.1,0.1,0.1,0.1,0.15,{"$f":"SUM(F6:M6)","v":0.99999999999999989}]
[null,null,null,"FINANCEIRO",{"$f":"ORÇAMENTO!L10","v":304351.83},{"$f":"ROUND($E$7*F6,2)","v":76087.960000000006},{"$f":"ROUND($E$7*G6,2)","v":30435.18},{"$f":"ROUND($E$7*H6,2)","v":30435.18},{"$f":"ROUND($E$7*I6,2)","v":30435.18},{"$f":"ROUND($E$7*J6,2)","v":30435.18},30435.18,30435.18,45652.77,304351.81]
["B",{"$f":"VLOOKUP(A8,ORÇAMENTO!$A$10:$L$30,2)","v":2},{"$f":"VLOOKUP(A8,ORÇAMENTO!$A$10:$L$30,5)","v":"TERRAPLANAGEM E PAVIMENTAÇÃO"},"FISICO ",{"$f":"ROUND(E9/$G$2,4)","v":0.63819999999999999},0.1,0.15,0.15,0.15,0.15,0.15,0.15,0,1]
[null,null,null,"FINANCEIRO",{"$f":"ORÇAMENTO!L16","v":1914569.5},{"$f":"ROUND($E$9*F8,2)","v":191456.95},{"$f":"ROUND($E$9*G8,2)","v":287185.43},{"$f":"ROUND($E$9*H8,2)","v":287185.43},{"$f":"ROUND($E$9*I8,2)","v":287185.43},{"$f":"ROUND($E$9*J8,2)","v":287185.43},287185.43,287185.43,0,1914569.5299999998]
["C",{"$f":"VLOOKUP(A10,ORÇAMENTO!$A$10:$L$30,2)","v":3},{"$f":"VLOOKUP(A10,ORÇAMENTO!$A$10:$L$30,5)","v":"TRANSPORTE DE MATERIAIS"},"FISICO ",{"$f":"ROUND(E11/$G$2,4)","v":7.5200000000000003E-2},0.1,0.15,0.15,0.15,0.15,0.15,0.15,0,1]
[null,null,null,"FINANCEIRO",{"$f":"ORÇAMENTO!L20","v":225710},{"$f":"ROUND($E$11*F10,2)","v":22571},{"$f":"ROUND($E$11*G10,2)","v":33856.5},{"$f":"ROUND($E$11*H10,2)","v":33856.5},{"$f":"ROUND($E$11*I10,2)","v":33856.5},{"$f":"ROUND($E$11*J10,2)","v":33856.5},33856.5,33856.5,0,225710]
["D",{"$f":"VLOOKUP(A12,ORÇAMENTO!$A$10:$L$30,2)","v":4},{"$f":"VLOOKUP(A12,ORÇAMENTO!$A$10:$L$30,5)","v":"DRENAGEM E OBRAS COMPLEMENTARES"},"FISICO ",{"$f":"ROUND(E13/$G$2,4)","v":0.18509999999999999},0.1,0.15,0.15,0.15,0.15,0.15,0.1,0.05,1]
[null,null,null,"FINANCEIRO",{"$f":"ORÇAMENTO!L25","v":555196.4},{"$f":"ROUND($E$13*F12,2)","v":55519.64},{"$f":"ROUND($E$13*G12,2)","v":83279.460000000006},{"$f":"ROUND($E$13*H12,2)","v":83279.460000000006},{"$f":"ROUND($E$13*I12,2)","v":83279.460000000006},{"$f":"ROUND($E$13*J12,2)","v":83279.460000000006},83279.460000000006,55519.64,27759.82,555196.4]
[null,"TOTAL",null,"FISICO ",{"$f":"SUM(F14:H14)","v":0.40507282396512823},{"$f":"F15/E15","v":0.11521846622839241},{"$f":"G15/$E$15","v":0.1449271788683679},{"$f":"H15/$E$15","v":0.1449271788683679},{"$f":"I15/$E$15","v":0.1449271788683679},0.1449271788683679,0.1449271788683679,0.13567337415072164,2.4472268612571294E-2,1.000000003333525]
[null,null,null,"FINANCEIRO",{"$f":"E11+E9+E7+E13","v":2999827.73},{"$f":"F11+F9+F7+F13","v":345635.55000000005},{"$f":"G11+G9+G7+G13","v":434756.57},{"$f":"H11+H9+H7+H13","v":434756.57},{"$f":"I11+I9+I7+I13","v":434756.57},{"$f":"J11+J9+J7+J13","v":434756.57},434756.57,406996.75,73412.59,{"$f":"ROUNDUP(SUM(F15:M15),2)-0.01","v":2999827.7300000004}]
[]
[null,"OBSERVAÇÕES:"]