{"text_format":"2","workbook":"xlsx","n_sheets":10,"sheets":["ORÇAMENTO","CPU-SERV","CPU-FORNEC","BDI SERV","BDI FORN","CRONOGRAMA","EAI","RR-1C","CAP","MAT.ASF"],"not_rendered":{"charts":0,"images":1,"macros":0,"external_links":1,"defined_names":11,"comments":5,"pivot_tables":0},"unopened":[],"bounds":{"document_bytes":16777216,"sheet_cells":100000,"run_cost":"one","rows_first":2000,"rows_last":500,"rows_between":2000,"halvings":0,"cell_chars":16384,"cell_head_chars":4096},"cells_cut":0,"cells_raw":0,"read":"whole","date_system":"1900"}

{"sheet":"ORÇAMENTO","index":0,"n_rows":59,"n_cols":12,"rows_kept":59,"cut":false,"hidden":false,"merged":[[9,16,9,17],[9,18,9,20],[6,8,6,10],[58,1,58,4],[0,0,8,0],[0,4,0,11],[1,4,1,11],[2,4,2,11],[6,1,6,4],[7,1,7,11],[4,2,4,8],[5,2,5,7],[4,9,4,10],[5,8,5,10]]}
["<---- NUMERAR SERVIÇOS PARA CPU",null,null,null,"Ministério do Desenvolvimento Regional"]
[{"$nulls":4},"Companhia de Desenvolvimento dos Vales do São Francisco e do Parnaíba"]
[{"$nulls":4},"1ª Superintendência Regional"]
[]
[null,"OBRA: "," PAVIMENTAÇÃO ASFÁLTICA EM CBUQ - ESTRADA PARA SANTANA DO MUNDO NOVO (JURAMENTO / MG)",{"$nulls":6},"BDI Serviços (%):",null,{"$f":"'BDI SERV'!E26","v":22.26}]
[null,"DATA:"," ABRIL / 2025 ",{"$nulls":5},"BDI Diferenciado Serviços (%):",null,null,{"$f":"'BDI FORN'!D31","v":15}]
[null,"PRAZO DE EXECUÇÃO:     150 DIAS",{"$nulls":6},"BDI Fornecimentos (%):",null,null,{"$f":"'BDI FORN'!D31","v":15}]
[null,"PLANILHA DE ORÇAMENTAÇÃO"]
[null,"ITEM","CÓDIGO","FONTE","DISCRIMINAÇÃO","TIPO","UNID.","QUANT.","VR.UNIT.S/BDI","PR. UNIT.C/BDI","C. TOT.S/BDI","P. TOT.C/BDI"]
["A",1,null,null,"SERVIÇOS PRELIMINARES ",{"$nulls":5},{"$f":"SUM(K11:K16)","v":132314.07999999999},{"$f":"SUM(L11:L16)","v":161676.57999999999}]
[1,"1.1","CPU.1","CODEVASF","MOBILIZAÇÃO E DESMOBILIZAÇÃO","SERV","GL",1,{"$f":"VLOOKUP(A11,'CPU-SERV'!A:K,11,0)","v":6943.14},{"$f":"TRUNC(_xlfn.IFS(F11=\"SERV\",I11*(1+$L$5/100),F11=\"SERV DIF\",I11*(1+$L$6/100),F11=\"FORN\",I11*(1+$L$7/100)),2)","v":8488.68},{"$f":"TRUNC(H11*I11,2)","v":6943.14},{"$f":"TRUNC(H11*J11,2)","v":8488.68}]
[2,"1.2","CPU.2","CODEVASF","ADMINISTRAÇÃO LOCAL ","SERV","GL",1,{"$f":"VLOOKUP(A12,'CPU-SERV'!A:K,11,0)","v":106670.22},{"$f":"TRUNC(_xlfn.IFS(F12=\"SERV\",I12*(1+$L$5/100),F12=\"SERV DIF\",I12*(1+$L$6/100),F12=\"FORN\",I12*(1+$L$7/100)),2)","v":130415.01},{"$f":"TRUNC(H12*I12,2)","v":106670.22},{"$f":"TRUNC(H12*J12,2)","v":130415.01}]
[3,"1.3","CPU.3","CODEVASF","CANTEIRO DE OBRAS ","SERV","GL",1,{"$f":"VLOOKUP(A13,'CPU-SERV'!A:K,11,0)","v":11641.05},{"$f":"TRUNC(_xlfn.IFS(F13=\"SERV\",I13*(1+$L$5/100),F13=\"SERV DIF\",I13*(1+$L$6/100),F13=\"FORN\",I13*(1+$L$7/100)),2)","v":14232.34},11641.05,14232.34]
[4,"1.4",103689,"SINAPI","PLACA DE OBRA EM CHAPA DE AÇO GALVANIZADO","SERV","M2",4,{"$f":"VLOOKUP(A14,'CPU-SERV'!A:K,11,0)","v":351.42},{"$f":"TRUNC(_xlfn.IFS(F14=\"SERV\",I14*(1+$L$5/100),F14=\"SERV DIF\",I14*(1+$L$6/100),F14=\"FORN\",I14*(1+$L$7/100)),2)","v":429.64},1405.68,1718.56]
[5,"1.5",5502985,"SICRO","LIMPEZA MECANIZADA DE CAMADA VEGETAL","SERV","M2",1600,{"$f":"VLOOKUP(A15,'CPU-SERV'!A:K,11,0)","v":0.56000000000000005},{"$f":"TRUNC(_xlfn.IFS(F15=\"SERV\",I15*(1+$L$5/100),F15=\"SERV DIF\",I15*(1+$L$6/100),F15=\"FORN\",I15*(1+$L$7/100)),2)","v":0.68},896,1088]
[6,"1.6",78472,"SINAPI","SERVIÇOS TOPOGRÁFICOS PARA PAVIMENTAÇÃO, INCLUSIVE LEVANTAMENTO PLANIALTIMÉTRICO CADASTRAL, GERAÇÃO DE NOTAS DE SERVIÇO, SEÇÕES TRANSVERSAIS E GREIDE, ESTAQUEAMENTO E ACOMPANHAMENTO EXECUTIVO","SERV","M2",12199.996000000003,{"$f":"VLOOKUP(A16,'CPU-SERV'!A:K,11,0)","v":0.39},{"$f":"TRUNC(_xlfn.IFS(F16=\"SERV\",I16*(1+$L$5/100),F16=\"SERV DIF\",I16*(1+$L$6/100),F16=\"FORN\",I16*(1+$L$7/100)),2)","v":0.47},4757.99,5733.99]
["B",2,null,null,"TERRAPLANAGEM E PAVIMENTAÇÃO",{"$nulls":5},{"$f":"SUM(K18:K23)","v":564399.19999999995},{"$f":"SUM(L18:L23)","v":689846.4}]
[7,"2.1",5502114,"SICRO","ESCAVAÇÃO, CARGA E TRANSPORTE DE MATERIAL DE 1ª CATEGORIA - DMT 1.000 A 1.200M, CAMINHO DE SERVIÇO EM REVESTIMENTO PRIMÁRIO","SERV","M3",1900,{"$f":"VLOOKUP(A18,'CPU-SERV'!A:K,11,0)","v":6.73},{"$f":"TRUNC(_xlfn.IFS(F18=\"SERV\",I18*(1+$L$5/100),F18=\"SERV DIF\",I18*(1+$L$6/100),F18=\"FORN\",I18*(1+$L$7/100)),2)","v":8.2200000000000006},{"$f":"TRUNC(H18*I18,2)","v":12787},{"$f":"TRUNC(H18*J18,2)","v":15618}]
[10,"2.3",4011209,"SICRO","REGULARIZAÇÃO E COMPACTAÇÃO DO SUBLEITO ","SERV","M2",12200,{"$f":"VLOOKUP(A19,'CPU-SERV'!A:K,11,0)","v":1.54},{"$f":"TRUNC(_xlfn.IFS(F19=\"SERV\",I19*(1+$L$5/100),F19=\"SERV DIF\",I19*(1+$L$6/100),F19=\"FORN\",I19*(1+$L$7/100)),2)","v":1.88},18788,22936]
[11,"2.4",4011276,"SICRO","EXECUÇÃO E COMPACTAÇÃO DE BASE E OU SUB BASE PARA PAVIMENTAÇÃO DE BICA CORRIDA - EXCLUSIVE TRANSPORTE","SERV","M3",1840,{"$f":"VLOOKUP(A20,'CPU-SERV'!A:K,11,0)","v":149.72999999999999},{"$f":"TRUNC(_xlfn.IFS(F20=\"SERV\",I20*(1+$L$5/100),F20=\"SERV DIF\",I20*(1+$L$6/100),F20=\"FORN\",I20*(1+$L$7/100)),2)","v":183.05},275503.2,336812]
[12,"2.5",4011352,"SICRO","IMPRIMAÇÃO COM EMULSÃO ASFÁLTICA (EAI)","SERV","M2",12200,{"$f":"VLOOKUP(A21,'CPU-SERV'!A:K,11,0)","v":0.4},{"$f":"TRUNC(_xlfn.IFS(F21=\"SERV\",I21*(1+$L$5/100),F21=\"SERV DIF\",I21*(1+$L$6/100),F21=\"FORN\",I21*(1+$L$7/100)),2)","v":0.48},4880,5856]
[13,"2.6",4011353,"SICRO","PINTURA DE LIGAÇÃO COM EMULSÃO ASFÁLTICA RR-1C","SERV","M2",10500,{"$f":"VLOOKUP(A22,'CPU-SERV'!A:K,11,0)","v":0.27},{"$f":"TRUNC(_xlfn.IFS(F22=\"SERV\",I22*(1+$L$5/100),F22=\"SERV DIF\",I22*(1+$L$6/100),F22=\"FORN\",I22*(1+$L$7/100)),2)","v":0.33},2835,3465]
[14,"2.7",4011463,"SICRO","EXECUÇÃO DE PAVIMENTO COM APLICAÇÃO DE CONCRETO ASFÁLTICO USINADO A QUENTE (CBUQ), CAMADA DE ROLAMENTO - EXCLUSIVE TRANSPORTE","SERV","T",1259.9999999999998,{"$f":"VLOOKUP(A23,'CPU-SERV'!A:K,11,0)","v":198.1},{"$f":"TRUNC(_xlfn.IFS(F23=\"SERV\",I23*(1+$L$5/100),F23=\"SERV DIF\",I23*(1+$L$6/100),F23=\"FORN\",I23*(1+$L$7/100)),2)","v":242.19},249606,305159.40000000002]
["C",3,null,null,"TRANSPORTE DE MATERIAIS",{"$nulls":5},{"$f":"SUM(K25:K28)","v":121858.8},{"$f":"SUM(L25:L28)","v":148374.39999999999}]
[15,"3.1",5915321,"SICRO","TRANSPORTE COM CAMINHÃO BASCULANTE, EM VIA URBANA PAVIMENTADA","SERV","TXKM",90000.002593750003,{"$f":"VLOOKUP(A25,'CPU-SERV'!A:K,11,0)","v":0.65},{"$f":"TRUNC(_xlfn.IFS(F25=\"SERV\",I25*(1+$L$5/100),F25=\"SERV DIF\",I25*(1+$L$6/100),F25=\"FORN\",I25*(1+$L$7/100)),2)","v":0.79},{"$f":"TRUNC(H25*I25,2)","v":58500},{"$f":"TRUNC(H25*J25,2)","v":71100}]
[16,"3.2",5914434,"SICRO","TRANSPORTE COM CAMINHÃO CARROCERIA 9T, EM VIA URBANA PAVIMENTADA","SERV","TXKM",14000.003333333336,{"$f":"VLOOKUP(A26,'CPU-SERV'!A:K,11,0)","v":0.74},{"$f":"TRUNC(_xlfn.IFS(F26=\"SERV\",I26*(1+$L$5/100),F26=\"SERV DIF\",I26*(1+$L$6/100),F26=\"FORN\",I26*(1+$L$7/100)),2)","v":0.9},10360,12600]
[17,"3.3",5914612,"SICRO","TRANSPORTE DE MASSA ASFÁLTICA COM CAMINHÃO BASCULANTE, EM VIA URBANA PAVIMENTADA ","SERV","TXKM",44000,{"$f":"VLOOKUP(A27,'CPU-SERV'!A:K,11,0)","v":1.18},{"$f":"TRUNC(_xlfn.IFS(F27=\"SERV\",I27*(1+$L$5/100),F27=\"SERV DIF\",I27*(1+$L$6/100),F27=\"FORN\",I27*(1+$L$7/100)),2)","v":1.44},51920,63360]
[18,"3.4",5914622,"SICRO","TRANSPORTE COM CAMINHÃO TANQUE DE TRANSPORTE DE MATERIAL ASFÁLTICO DE 30000 L, EM VIA URBANA PAVIMENTADA ","SERV","TXKM",620,{"$f":"VLOOKUP(A28,'CPU-SERV'!A:K,11,0)","v":1.74},{"$f":"TRUNC(_xlfn.IFS(F28=\"SERV\",I28*(1+$L$5/100),F28=\"SERV DIF\",I28*(1+$L$6/100),F28=\"FORN\",I28*(1+$L$7/100)),2)","v":2.12},1078.8,1314.4]
["E",4,null,null,"DRENAGEM E OBRAS COMPLEMENTARES",{"$nulls":5},{"$f":"SUM(K30:K51)","v":397350.09999999992},{"$f":"SUM(L30:L51)","v":485770.65}]
[19,"4.1",94273,"SINAPI","ASSENTAMENTO DE GUIA (MEIO-FIO) PRÉ-MOLDADO DE CONCRETO - 100X15X13X30 CM (COMPRIMENTO X BASE INFERIOR X BASE SUPERIOR X ALTURA) - USO VIÁRIO","SERV","M",3800,{"$f":"VLOOKUP(A30,'CPU-SERV'!A:K,11,0)","v":49.2},{"$f":"TRUNC(_xlfn.IFS(F30=\"SERV\",I30*(1+$L$5/100),F30=\"SERV DIF\",I30*(1+$L$6/100),F30=\"FORN\",I30*(1+$L$7/100)),2)","v":60.15},{"$f":"TRUNC(H30*I30,2)","v":186960},{"$f":"TRUNC(H30*J30,2)","v":228570}]
[20,"4.2",94287,"SINAPI","EXECUÇÃO DE SARJETA EM CONCRETO USINADO, MOLDADO IN LOCO - 30CM DE BASE X 5CM DE ALTURA","SERV","M",3599.9987500000002,{"$f":"VLOOKUP(A31,'CPU-SERV'!A:K,11,0)","v":22.2},{"$f":"TRUNC(_xlfn.IFS(F31=\"SERV\",I31*(1+$L$5/100),F31=\"SERV DIF\",I31*(1+$L$6/100),F31=\"FORN\",I31*(1+$L$7/100)),2)","v":27.14},79919.97,97703.96]
[21,"4.3",4915724,"SICRO","CAIAÇÃO COM FIXADOR DE CAL","SERV","M2",950,{"$f":"VLOOKUP(A32,'CPU-SERV'!A:K,11,0)","v":1.86},{"$f":"TRUNC(_xlfn.IFS(F32=\"SERV\",I32*(1+$L$5/100),F32=\"SERV DIF\",I32*(1+$L$6/100),F32=\"FORN\",I32*(1+$L$7/100)),2)","v":2.27},1767,2156.5]
[22,"4.4",2003103,"SICRO","ENTRADA PARA DESCIDA D'ÁGUA - EDA 01 - AREIA E BRITA COMERCIAIS","SERV","UNID.",3,{"$f":"VLOOKUP(A33,'CPU-SERV'!A:K,11,0)","v":192.82},{"$f":"TRUNC(_xlfn.IFS(F33=\"SERV\",I33*(1+$L$5/100),F33=\"SERV DIF\",I33*(1+$L$6/100),F33=\"FORN\",I33*(1+$L$7/100)),2)","v":235.74},578.46,707.22]
[23,"4.5",2003389,"SICRO","DESCIDA D'ÁGUA DE ATERRO TIPO RÁPIDO - DAR 01 - AREIA E BRITA COMERCIAIS","SERV","M",6,{"$f":"VLOOKUP(A34,'CPU-SERV'!A:K,11,0)","v":228.56},{"$f":"TRUNC(_xlfn.IFS(F34=\"SERV\",I34*(1+$L$5/100),F34=\"SERV DIF\",I34*(1+$L$6/100),F34=\"FORN\",I34*(1+$L$7/100)),2)","v":279.43},1371.36,1676.58]
[24,"4.6",2003453,"SICRO","DISSIPADOR DE ENERGIA - DEB 03 - AREIA, BRITA E PEDRA DE MÃO COMERCIAIS","SERV","UNID.",4,{"$f":"VLOOKUP(A35,'CPU-SERV'!A:K,11,0)","v":960.73},{"$f":"TRUNC(_xlfn.IFS(F35=\"SERV\",I35*(1+$L$5/100),F35=\"SERV DIF\",I35*(1+$L$6/100),F35=\"FORN\",I35*(1+$L$7/100)),2)","v":1174.58},3842.92,4698.32]
[25,"4.7",2003626,"SICRO","BOCA DE LOBO SIMPLES - GRELHA DE CONCRETO - AREIA E BRITA COMERCIAIS","SERV","UNID.",3,{"$f":"VLOOKUP(A36,'CPU-SERV'!A:K,11,0)","v":914.82},{"$f":"TRUNC(_xlfn.IFS(F36=\"SERV\",I36*(1+$L$5/100),F36=\"SERV DIF\",I36*(1+$L$6/100),F36=\"FORN\",I36*(1+$L$7/100)),2)","v":1118.45},2744.46,3355.35]
[26,"4.8",2003634,"SICRO","BOCA DE LOBO DUPLA - GRELHA DE CONCRETO - AREIA E BRITA COMERCIAIS","SERV","UNID.",2,{"$f":"VLOOKUP(A37,'CPU-SERV'!A:K,11,0)","v":1764.65},{"$f":"TRUNC(_xlfn.IFS(F37=\"SERV\",I37*(1+$L$5/100),F37=\"SERV DIF\",I37*(1+$L$6/100),F37=\"FORN\",I37*(1+$L$7/100)),2)","v":2157.46},3529.3,4314.92]
[29,"4.9",804013,"SICRO","CORPO DE BUEIRO SIMPLES TUBULAR DE CONCRETO (BSTC), D=0,40M - PA-1 - AREIA E BRITA COMERCIAIS","SERV","M",36,{"$f":"VLOOKUP(A38,'CPU-SERV'!A:K,11,0)","v":264.79000000000002},{"$f":"TRUNC(_xlfn.IFS(F38=\"SERV\",I38*(1+$L$5/100),F38=\"SERV DIF\",I38*(1+$L$6/100),F38=\"FORN\",I38*(1+$L$7/100)),2)","v":323.73},9532.44,11654.28]
[31,"4.10","804181a","SICRO","CORPO DE BUEIRO DUPLO TUBULAR DE CONCRETO (BDTC), D=0,60M - PA-1 - AREIA E BRITA COMERCIAIS","SERV","M",20,{"$f":"VLOOKUP(A39,'CPU-SERV'!A:K,11,0)","v":936.07},{"$f":"TRUNC(_xlfn.IFS(F39=\"SERV\",I39*(1+$L$5/100),F39=\"SERV DIF\",I39*(1+$L$6/100),F39=\"FORN\",I39*(1+$L$7/100)),2)","v":1144.43},18721.400000000001,22888.6]
[36,"4.11",2003365,"SICRO","TRANSPOSIÇÃO DE SEGMENTO DE SARJETA - TSS 01 - AREIA E BRITA COMERCIAIS","SERV","M",10,{"$f":"VLOOKUP(A40,'CPU-SERV'!A:K,11,0)","v":1045.3699999999999},{"$f":"TRUNC(_xlfn.IFS(F40=\"SERV\",I40*(1+$L$5/100),F40=\"SERV DIF\",I40*(1+$L$6/100),F40=\"FORN\",I40*(1+$L$7/100)),2)","v":1278.06},10453.700000000001,12780.6]
[38,"4.12",4805757,"SICRO","ESCAVAÇÃO MECÂNICA DE VALAS EM MATERIAL DE 1ª CATEGORIA","SERV","M3",170,{"$f":"VLOOKUP(A41,'CPU-SERV'!A:K,11,0)","v":6.63},{"$f":"TRUNC(_xlfn.IFS(F41=\"SERV\",I41*(1+$L$5/100),F41=\"SERV DIF\",I41*(1+$L$6/100),F41=\"FORN\",I41*(1+$L$7/100)),2)","v":8.1},1127.0999999999999,1377]
[39,"4.13",4805756,"SICRO","APILOAMENTO MANUAL DE FUNDO DE VALA","SERV","M2",89.999999999999986,{"$f":"VLOOKUP(A42,'CPU-SERV'!A:K,11,0)","v":4.8},{"$f":"TRUNC(_xlfn.IFS(F42=\"SERV\",I42*(1+$L$5/100),F42=\"SERV DIF\",I42*(1+$L$6/100),F42=\"FORN\",I42*(1+$L$7/100)),2)","v":5.86},432,527.4]
[40,"4.14",101574,"SINAPI","ESCORAMENTO DE VALA TIPO PONTALETEAMENTO - CONFECÇÃO, INSTALAÇÃO E RETIRADA","SERV","M2",200,{"$f":"VLOOKUP(A43,'CPU-SERV'!A:K,11,0)","v":15.06},{"$f":"TRUNC(_xlfn.IFS(F43=\"SERV\",I43*(1+$L$5/100),F43=\"SERV DIF\",I43*(1+$L$6/100),F43=\"FORN\",I43*(1+$L$7/100)),2)","v":18.41},3012,3682]
[41,"4.15",4815671,"SICRO","REATERRO E COMPACTAÇÃO MANUAL DE VALAS COM SOQUETE VIBRATÓRIO","SERV","M3",139.999,{"$f":"VLOOKUP(A44,'CPU-SERV'!A:K,11,0)","v":16.68},{"$f":"TRUNC(_xlfn.IFS(F44=\"SERV\",I44*(1+$L$5/100),F44=\"SERV DIF\",I44*(1+$L$6/100),F44=\"FORN\",I44*(1+$L$7/100)),2)","v":20.39},2335.1799999999998,2854.57]
[42,"4.16",94990,"SINAPI","EXECUÇÃO DE PASSEIO (CALÇADA) OU PISO DE CONCRETO MOLDADO IN LOCO, ACABAMENTO CONVENCIONAL, NÃO ARMADO","SERV","M3",2,{"$f":"VLOOKUP(A45,'CPU-SERV'!A:K,11,0)","v":696.66},{"$f":"TRUNC(_xlfn.IFS(F45=\"SERV\",I45*(1+$L$5/100),F45=\"SERV DIF\",I45*(1+$L$6/100),F45=\"FORN\",I45*(1+$L$7/100)),2)","v":851.73},1393.32,1703.46]
[43,"4.17","5213489a","SICRO","PLACA EM AÇO - 1,50X0,60M - PELÍCULA RETRORREFLETIVA - FORNECIMENTO E INSTALAÇÃO, INCLUSIVE  SUPORTE","SERV","UN.",5,{"$f":"VLOOKUP(A46,'CPU-SERV'!A:K,11,0)","v":901.16},{"$f":"TRUNC(_xlfn.IFS(F46=\"SERV\",I46*(1+$L$5/100),F46=\"SERV DIF\",I46*(1+$L$6/100),F46=\"FORN\",I46*(1+$L$7/100)),2)","v":1101.75},4505.8,5508.75]
[44,"4.18","5213464a","SICRO","PLACA DE ADVERTÊNCIA EM AÇO, LADO DE 60CM - PELÍCULA RETRORREFLETIVA - FORNECIMENTO E INSTALAÇÃO, INCLUSIVE  SUPORTE","SERV","UN.",10,{"$f":"VLOOKUP(A47,'CPU-SERV'!A:K,11,0)","v":716.58},{"$f":"TRUNC(_xlfn.IFS(F47=\"SERV\",I47*(1+$L$5/100),F47=\"SERV DIF\",I47*(1+$L$6/100),F47=\"FORN\",I47*(1+$L$7/100)),2)","v":876.09},7165.8,8760.9]
[45,"4.19","5213440a","SICRO","PLACA DE REGULAMENTAÇÃO EM AÇO, D=60CM - PELÍCULA RETRORREFLETIVA - FORNECIMENTO E INSTALAÇÃO, INCLUSIVE  SUPORTE","SERV","UN.",15,{"$f":"VLOOKUP(A48,'CPU-SERV'!A:K,11,0)","v":716.55},{"$f":"TRUNC(_xlfn.IFS(F48=\"SERV\",I48*(1+$L$5/100),F48=\"SERV DIF\",I48*(1+$L$6/100),F48=\"FORN\",I48*(1+$L$7/100)),2)","v":876.05},10748.25,13140.75]
[48,"4.20",5213401,"SICRO","PINTURA DE EIXO VIÁRIO SOBRE ASFALTO COM TINTA RETRORREFLETIVA A BASE DE RESINA ACRÍLICA COM MICROESFERAS DE VIDRO, APLICAÇÃO MECÂNICA COM DEMARCADORA AUTOPROPELIDA","SERV","M2",764.99975000000006,{"$f":"VLOOKUP(A49,'CPU-SERV'!A:K,11,0)","v":29.17},{"$f":"TRUNC(_xlfn.IFS(F49=\"SERV\",I49*(1+$L$5/100),F49=\"SERV DIF\",I49*(1+$L$6/100),F49=\"FORN\",I49*(1+$L$7/100)),2)","v":35.659999999999997},22315.040000000001,27279.89]
[49,"4.21",5213360,"SICRO","TACHA REFLETIVA EM PLÁSTICO INJETADO - BIDIRECIONAL COM UM PINO - FORNECIMENTO E COLOCAÇÃO","SERV","UNID.",720,{"$f":"VLOOKUP(A50,'CPU-SERV'!A:K,11,0)","v":31.08},{"$f":"TRUNC(_xlfn.IFS(F50=\"SERV\",I50*(1+$L$5/100),F50=\"SERV DIF\",I50*(1+$L$6/100),F50=\"FORN\",I50*(1+$L$7/100)),2)","v":37.99},22377.599999999999,27352.799999999999]
[50,"4.22",5213405,"SICRO","PINTURA DE FAIXA DE PEDESTRE OU ZEBRADA TINTA RETRORREFLETIVA A BASE DE RESINA ACRÍLICA COM MICROESFERAS DE VIDRO, APLICAÇÃO MANUAL","SERV","M2",60,{"$f":"VLOOKUP(A51,'CPU-SERV'!A:K,11,0)","v":41.95},{"$f":"TRUNC(_xlfn.IFS(F51=\"SERV\",I51*(1+$L$5/100),F51=\"SERV DIF\",I51*(1+$L$6/100),F51=\"FORN\",I51*(1+$L$7/100)),2)","v":51.28},2517,3076.8]
["F",5,null,null,"FORNECIMENTOS - MATERIAL ASFÁLTICO (BDI DIFERENCIADO)",{"$nulls":5},{"$f":"SUM(K53:K58)","v":447077.37},{"$f":"SUM(L53:L58)","v":514138.47}]
["F1","5.1","CPU.7","ANP","AQUISIÇÃO DE EMULSÃO ASFÁLTICA PARA IMPRIMAÇÃO (EAI) - EXCLUSIVE TRANSPORTE","FORN","T",16,{"$f":"VLOOKUP(A53,'CPU-FORNEC'!A:J,9,0)","v":3532.13},{"$f":"TRUNC(_xlfn.IFS(F53=\"SERV\",I53*(1+$L$5/100),F53=\"SERV DIF\",I53*(1+$L$6/100),F53=\"FORN\",I53*(1+$L$7/100)),2)","v":4061.94},{"$f":"TRUNC(H53*I53,2)","v":56514.080000000002},{"$f":"TRUNC(H53*J53,2)","v":64991.040000000001}]
["F2","5.2","CPU.8","CODEVASF","TRANSPORTE DE EMULSÃO ASFÁLTICA PARA IMPRIMAÇÃO (EAI)","SERV DIF","T",16,{"$f":"VLOOKUP(A54,'CPU-FORNEC'!A:J,9,0)","v":401.49},{"$f":"TRUNC(_xlfn.IFS(F54=\"SERV\",I54*(1+$L$5/100),F54=\"SERV DIF\",I54*(1+$L$6/100),F54=\"FORN\",I54*(1+$L$7/100)),2)","v":461.71},6423.84,7387.36]
["F3","5.3","CPU.9","ANP","AQUISIÇÃO DE EMULSAO ASFALTICA CATIONICA RR-1C - EXCLUSIVE TRANSPORTE","FORN","T",4.9949999999999992,{"$f":"VLOOKUP(A55,'CPU-FORNEC'!A:J,9,0)","v":3480.79},{"$f":"TRUNC(_xlfn.IFS(F55=\"SERV\",I55*(1+$L$5/100),F55=\"SERV DIF\",I55*(1+$L$6/100),F55=\"FORN\",I55*(1+$L$7/100)),2)","v":4002.9},17386.54,19994.48]
["F4","5.4","CPU.10","CODEVASF","TRANSPORTE DE EMULSÃO ASFÁLTICA CATIONICA RR-1C","SERV DIF","T",4.9949999999999992,{"$f":"VLOOKUP(A56,'CPU-FORNEC'!A:J,9,0)","v":496.62},{"$f":"TRUNC(_xlfn.IFS(F56=\"SERV\",I56*(1+$L$5/100),F56=\"SERV DIF\",I56*(1+$L$6/100),F56=\"FORN\",I56*(1+$L$7/100)),2)","v":571.11},2480.61,2852.69]
["F5","5.5","CPU.11","ANP","AQUISIÇÃO DE CONCRETO ASFÁLTICO DE PETRÓLEO - CAP 50/70 - EXCLUSIVE TRANSPORTE","FORN","T",69.999999999999986,{"$f":"VLOOKUP(A57,'CPU-FORNEC'!A:J,9,0)","v":4815.2},{"$f":"TRUNC(_xlfn.IFS(F57=\"SERV\",I57*(1+$L$5/100),F57=\"SERV DIF\",I57*(1+$L$6/100),F57=\"FORN\",I57*(1+$L$7/100)),2)","v":5537.48},337064,387623.6]
["F6","5.6","CPU.12","CODEVASF","TRANSPORTE DE CONCRETO ASFÁLTICO DE PETRÓLEO - CAP 50/70","SERV DIF","T",69.999999999999986,{"$f":"VLOOKUP(A58,'CPU-FORNEC'!A:J,9,0)","v":388.69},{"$f":"TRUNC(_xlfn.IFS(F58=\"SERV\",I58*(1+$L$5/100),F58=\"SERV DIF\",I58*(1+$L$6/100),F58=\"FORN\",I58*(1+$L$7/100)),2)","v":446.99},27208.3,31289.3]
[null,"TOTAL GERAL DA OBRA COM BDI ",{"$nulls":8},{"$f":"SUM(K10,K17,K24,K29,K52)","v":1662999.5499999998},{"$f":"SUM(L10,L17,L24,L29,L52)","v":1999806.5}]

{"sheet":"CPU-SERV","index":1,"n_rows":1598,"n_cols":11,"rows_kept":1598,"cut":false,"hidden":false,"merged":[[22,7,22,9],[25,3,25,7],[27,8,27,9],[21,3,21,7],[4,2,4,7],[4,8,4,9],[5,1,6,2],[5,3,6,3],[5,4,5,5],[5,6,5,7],[484,0,536,0],[485,2,485,9],[486,1,487,3],[486,4,486,5],[487,4,487,5],[488,2,488,7],[488,8,488,9],[489,1,490,2],[489,3,490,3],[489,4,489,5],[489,6,489,7],[497,7,497,9],[499,3,499,7],[500,3,500,7],[501,3,501,7],[504,7,504,9],[513,3,513,7],[39,0,81,0],[40,2,40,9],[44,3,45,3],[44,4,44,5],[44,6,44,7],[49,7,49,9],[55,3,55,7],[56,3,56,7],[41,1,42,3],[41,4,41,5],[42,4,42,5],[43,2,43,7],[43,8,43,9],[44,1,45,2],[0,0,37,0],[3,4,3,5],[2,4,2,5],[1,2,1,9],[2,1,3,3],[31,3,32,3],[31,4,32,4],[31,5,31,7],[31,9,32,9],[35,3,35,7],[36,5,36,7],[10,7,10,9],[13,3,13,7],[14,3,14,7],[15,3,15,7],[18,7,18,9],[30,3,30,7],[31,1,32,2],[97,3,97,7],[88,3,89,3],[88,4,88,5],[88,6,88,7],[79,3,79,7],[80,5,80,7],[85,4,85,5],[74,3,74,7],[75,1,76,2],[75,3,76,3],[75,4,76,4],[75,5,75,7],[75,9,76,9],[57,3,57,7],[60,7,60,9],[63,3,63,7],[64,7,64,9],[69,3,69,7],[71,8,71,9],[119,5,119,7],[122,0,161,0],[123,2,123,9],[124,1,125,3],[124,4,124,5],[125,4,125,5],[126,2,126,7],[126,8,126,9],[159,3,159,7],[160,5,160,7],[114,1,115,2],[114,3,115,3],[114,4,115,4],[114,5,114,7],[114,9,115,9],[118,3,118,7],[93,7,93,9],[98,3,98,7],[101,7,101,9],[104,3,104,7],[105,7,105,9],[108,3,108,7],[83,0,120,0],[84,2,84,9],[85,1,86,3],[86,4,86,5],[87,2,87,7],[87,8,87,9],[88,1,89,2],[110,8,110,9],[113,3,113,7],[96,3,96,7],[167,8,167,9],[168,1,169,2],[168,3,169,3],[168,4,168,5],[168,6,168,7],[136,3,136,7],[137,3,137,7],[140,7,140,9],[145,3,145,7],[146,7,146,9],[149,3,149,7],[127,1,128,2],[127,3,128,3],[127,4,127,5],[127,6,127,7],[132,7,132,9],[135,3,135,7],[202,0,241,0],[203,2,203,9],[204,1,205,3],[204,4,204,5],[205,4,205,5],[206,2,206,7],[239,3,239,7],[240,5,240,7],[163,0,200,0],[164,2,164,9],[165,1,166,3],[165,4,165,5],[166,4,166,5],[167,2,167,7],[151,8,151,9],[154,3,154,7],[155,1,156,2],[155,3,156,3],[155,4,156,4],[155,5,155,7],[155,9,156,9],[188,3,188,7],[190,8,190,9],[193,3,193,7],[194,1,195,2],[194,3,195,3],[194,4,195,4],[194,5,194,7],[194,9,195,9],[176,3,176,7],[177,3,177,7],[178,3,178,7],[247,8,247,9],[248,1,249,2],[248,3,249,3],[248,4,248,5],[173,7,173,9],[217,3,217,7],[218,3,218,7],[219,3,219,7],[222,7,222,9],[225,3,225,7],[226,7,226,9],[206,8,206,9],[207,1,208,2],[207,3,208,3],[207,4,207,5],[207,6,207,7],[212,7,212,9],[198,3,198,7],[199,5,199,7],[181,7,181,9],[184,3,184,7],[185,7,185,9],[243,0,280,0],[244,2,244,9],[245,1,246,3],[245,4,245,5],[246,4,246,5],[247,2,247,7],[229,3,229,7],[231,8,231,9],[234,3,234,7],[235,1,236,2],[235,3,236,3],[235,4,236,4],[235,5,235,7],[235,9,236,9],[268,3,268,7],[270,8,270,9],[273,3,273,7],[274,1,275,2],[274,3,275,3],[274,4,275,4],[274,5,274,7],[274,9,275,9],[256,3,256,7],[257,3,257,7],[248,6,248,7],[253,7,253,9],[278,3,278,7],[279,5,279,7],[258,3,258,7],[261,7,261,9],[264,3,264,7],[265,7,265,9],[282,0,323,0],[283,2,283,9],[284,1,285,3],[284,4,284,5],[285,4,285,5],[286,2,286,7],[321,3,321,7],[322,5,322,7],[329,8,329,9],[330,1,331,2],[330,3,331,3],[330,4,330,5],[299,3,299,7],[300,3,300,7],[301,3,301,7],[304,7,304,9],[307,3,307,7],[308,7,308,9],[286,8,286,9],[287,1,288,2],[287,3,288,3],[287,4,287,5],[287,6,287,7],[296,7,296,9],[366,0,403,0],[367,2,367,9],[368,1,369,3],[368,4,368,5],[369,4,369,5],[370,2,370,7],[401,3,401,7],[402,5,402,7],[385,7,385,8],[325,0,364,0],[326,2,326,9],[327,1,328,3],[327,4,327,5],[328,4,328,5],[329,2,329,7],[311,3,311,7],[313,8,313,9],[316,3,316,7],[317,1,318,2],[317,3,318,3],[317,4,318,4],[317,5,317,7],[317,9,318,9],[352,3,352,7],[354,8,354,9],[357,3,357,7],[358,1,359,2],[358,3,359,3],[358,4,359,4],[358,5,358,7],[358,9,359,9],[340,3,340,7],[418,3,418,7],[409,8,409,9],[410,1,411,2],[410,3,411,3],[410,4,410,5],[330,6,330,7],[337,7,337,9],[379,3,379,7],[380,3,380,7],[381,3,381,7],[384,7,384,9],[387,3,387,7],[388,7,388,9],[370,8,370,9],[371,1,372,2],[371,3,372,3],[371,4,371,5],[371,6,371,7],[376,7,376,9],[362,3,362,7],[363,5,363,7],[341,3,341,7],[342,3,342,7],[345,7,345,9],[348,3,348,7],[349,7,349,9],[470,3,470,7],[444,0,482,0],[445,2,445,9],[446,1,447,3],[446,4,446,5],[447,4,447,5],[448,2,448,7],[480,3,480,7],[481,5,481,7],[424,7,424,8],[405,0,442,0],[406,2,406,9],[407,1,408,3],[407,4,407,5],[408,4,408,5],[409,2,409,7],[391,3,391,7],[393,8,393,9],[396,3,396,7],[397,1,398,2],[397,3,398,3],[397,4,398,4],[397,5,397,7],[397,9,398,9],[430,3,430,7],[432,8,432,9],[435,3,435,7],[436,1,437,2],[436,3,437,3],[436,4,437,4],[436,5,436,7],[436,9,437,9],[509,7,509,8],[535,5,535,7],[563,3,563,7],[565,8,565,9],[568,3,568,7],[569,1,570,2],[569,3,570,3],[569,4,570,4],[569,5,569,7],[569,9,570,9],[410,6,410,7],[415,7,415,9],[458,3,458,7],[459,3,459,7],[460,3,460,7],[463,7,463,9],[466,3,466,7],[467,7,467,9],[448,8,448,9],[449,1,450,2],[449,3,450,3],[449,4,449,5],[449,6,449,7],[455,7,455,9],[440,3,440,7],[441,5,441,7],[419,3,419,7],[420,3,420,7],[423,7,423,9],[426,3,426,7],[427,7,427,9],[514,7,514,9],[556,7,556,9],[559,3,559,7],[560,7,560,9],[542,8,542,9],[543,1,544,2],[543,3,544,3],[543,4,543,5],[543,6,543,7],[548,7,548,9],[590,3,590,7],[591,3,591,7],[592,3,592,7],[595,7,595,9],[598,3,598,7],[542,2,542,7],[472,8,472,9],[475,3,475,7],[476,1,477,2],[476,3,477,3],[476,4,477,4],[476,5,476,7],[476,9,477,9],[526,1,527,2],[526,3,527,3],[526,4,527,4],[526,5,526,7],[526,9,527,9],[534,3,534,7],[516,3,516,7],[518,8,518,9],[525,3,525,7],[551,3,551,7],[599,7,599,9],[581,8,581,9],[582,1,583,2],[582,3,583,3],[582,4,582,5],[582,6,582,7],[587,7,587,9],[573,3,573,7],[574,5,574,7],[577,0,614,0],[578,2,578,9],[579,1,580,3],[579,4,579,5],[580,4,580,5],[581,2,581,7],[612,3,612,7],[613,5,613,7],[538,0,575,0],[539,2,539,9],[540,1,541,3],[540,4,540,5],[541,4,541,5],[602,3,602,7],[604,8,604,9],[607,3,607,7],[608,1,609,2],[608,3,609,3],[608,4,609,4],[608,5,608,7],[608,9,609,9],[552,3,552,7],[553,3,553,7],[641,3,641,7],[643,8,643,9],[646,3,646,7],[647,1,648,2],[647,3,648,3],[647,4,648,4],[647,5,647,7],[647,9,648,9],[629,3,629,7],[630,3,630,7],[631,3,631,7],[634,7,634,9],[637,3,637,7],[638,7,638,9],[620,8,620,9],[621,1,622,2],[621,3,622,3],[621,4,621,5],[621,6,621,7],[626,7,626,9],[668,3,668,7],[669,3,669,7],[670,3,670,7],[673,7,673,9],[676,3,676,7],[677,7,677,9],[659,8,659,9],[660,1,661,2],[660,3,661,3],[660,4,660,5],[660,6,660,7],[665,7,665,9],[651,3,651,7],[652,5,652,7],[655,0,692,0],[656,2,656,9],[657,1,658,3],[657,4,657,5],[658,4,658,5],[659,2,659,7],[690,3,690,7],[691,5,691,7],[616,0,653,0],[617,2,617,9],[618,1,619,3],[618,4,618,5],[619,4,619,5],[620,2,620,7],[680,3,680,7],[682,8,682,9],[685,3,685,7],[686,1,687,2],[686,3,687,3],[686,4,687,4],[686,5,686,7],[686,9,687,9],[719,3,719,7],[721,8,721,9],[724,3,724,7],[725,1,726,2],[725,3,726,3],[725,4,726,4],[725,5,725,7],[725,9,726,9],[707,3,707,7],[708,3,708,7],[709,3,709,7],[712,7,712,9],[715,3,715,7],[716,7,716,9],[698,8,698,9],[699,1,700,2],[699,3,700,3],[699,4,699,5],[699,6,699,7],[704,7,704,9],[746,3,746,7],[747,3,747,7],[748,3,748,7],[751,7,751,9],[756,3,756,7],[757,7,757,9],[737,8,737,9],[738,1,739,2],[738,3,739,3],[738,4,738,5],[738,6,738,7],[743,7,743,9],[729,3,729,7],[730,5,730,7],[733,0,772,0],[734,2,734,9],[735,1,736,3],[735,4,735,5],[736,4,736,5],[737,2,737,7],[770,3,770,7],[771,5,771,7],[694,0,731,0],[695,2,695,9],[696,1,697,3],[696,4,696,5],[697,4,697,5],[698,2,698,7],[760,3,760,7],[762,8,762,9],[765,3,765,7],[766,1,767,2],[766,3,767,3],[766,4,767,4],[766,5,766,7],[766,9,767,9],[801,3,801,7],[803,8,803,9],[806,3,806,7],[807,1,808,2],[807,3,808,3],[807,4,808,4],[807,5,807,7],[807,9,808,9],[788,3,788,7],[789,3,789,7],[790,3,790,7],[793,7,793,9],[797,3,797,7],[798,7,798,9],[778,8,778,9],[779,1,780,2],[779,3,780,3],[779,4,779,5],[779,6,779,7],[785,7,785,9],[828,3,828,7],[829,3,829,7],[830,3,830,7],[833,7,833,9],[836,3,836,7],[837,7,837,9],[819,8,819,9],[820,1,821,2],[820,3,821,3],[820,4,820,5],[820,6,820,7],[825,7,825,9],[811,3,811,7],[812,5,812,7],[815,0,854,0],[816,2,816,9],[817,1,818,3],[817,4,817,5],[818,4,818,5],[819,2,819,7],[852,3,852,7],[853,5,853,7],[774,0,813,0],[775,2,775,9],[776,1,777,3],[776,4,776,5],[777,4,777,5],[778,2,778,7],[842,3,842,7],[844,8,844,9],[847,3,847,7],[848,1,849,2],[848,3,849,3],[848,4,849,4],[848,5,848,7],[848,9,849,9],[883,3,883,7],[885,8,885,9],[888,3,888,7],[889,1,890,2],[889,3,890,3],[889,4,890,4],[889,5,889,7],[889,9,890,9],[869,3,869,7],[870,3,870,7],[871,3,871,7],[874,7,874,9],[876,3,876,7],[877,7,877,9],[860,8,860,9],[861,1,862,2],[861,3,862,3],[861,4,861,5],[861,6,861,7],[866,7,866,9],[910,3,910,7],[911,3,911,7],[912,3,912,7],[915,7,915,9],[918,3,918,7],[919,7,919,9],[901,8,901,9],[902,1,903,2],[902,3,903,3],[902,4,902,5],[902,6,902,7],[907,7,907,9],[893,3,893,7],[894,5,894,7],[897,0,936,0],[898,2,898,9],[899,1,900,3],[899,4,899,5],[900,4,900,5],[901,2,901,7],[934,3,934,7],[935,5,935,7],[856,0,895,0],[857,2,857,9],[858,1,859,3],[858,4,858,5],[859,4,859,5],[860,2,860,7],[924,3,924,7],[926,8,926,9],[929,3,929,7],[930,1,931,2],[930,3,931,3],[930,4,931,4],[930,5,930,7],[930,9,931,9],[967,3,967,7],[969,8,969,9],[972,3,972,7],[973,1,974,2],[973,3,974,3],[973,4,974,4],[973,5,973,7],[973,9,974,9],[951,3,951,7],[952,3,952,7],[953,3,953,7],[956,7,956,9],[959,3,959,7],[960,7,960,9],[942,8,942,9],[943,1,944,2],[943,3,944,3],[943,4,943,5],[943,6,943,7],[948,7,948,9],[994,3,994,7],[995,3,995,7],[996,3,996,7],[999,7,999,9],[1002,3,1002,7],[1003,7,1003,9],[985,8,985,9],[986,1,987,2],[986,3,987,3],[986,4,986,5],[986,6,986,7],[991,7,991,9],[977,3,977,7],[978,5,978,7],[981,0,1022,0],[982,2,982,9],[983,1,984,3],[983,4,983,5],[984,4,984,5],[985,2,985,7],[1020,3,1020,7],[1021,5,1021,7],[938,0,979,0],[939,2,939,9],[940,1,941,3],[940,4,940,5],[941,4,941,5],[942,2,942,7],[1010,3,1010,7],[1012,8,1012,9],[1015,3,1015,7],[1016,1,1017,2],[1016,3,1017,3],[1016,4,1017,4],[1016,5,1016,7],[1016,9,1017,9],[1050,3,1050,7],[1052,8,1052,9],[1055,3,1055,7],[1056,1,1057,2],[1056,3,1057,3],[1056,4,1057,4],[1056,5,1056,7],[1056,9,1057,9],[1037,3,1037,7],[1038,3,1038,7],[1039,3,1039,7],[1042,7,1042,9],[1045,3,1045,7],[1046,7,1046,9],[1028,8,1028,9],[1029,1,1030,2],[1029,3,1030,3],[1029,4,1029,5],[1029,6,1029,7],[1034,7,1034,9],[1117,3,1117,7],[1118,3,1118,7],[1119,3,1119,7],[1122,7,1122,9],[1125,3,1125,7],[1126,7,1126,9],[1108,8,1108,9],[1109,1,1110,2],[1109,3,1110,3],[1109,4,1109,5],[1109,6,1109,7],[1114,7,1114,9],[1060,3,1060,7],[1061,5,1061,7],[1104,0,1145,0],[1105,2,1105,9],[1106,1,1107,3],[1106,4,1106,5],[1107,4,1107,5],[1108,2,1108,7],[1143,3,1143,7],[1144,5,1144,7],[1024,0,1062,0],[1025,2,1025,9],[1026,1,1027,3],[1026,4,1026,5],[1027,4,1027,5],[1028,2,1028,7],[1133,3,1133,7],[1135,8,1135,9],[1138,3,1138,7],[1139,1,1140,2],[1139,3,1140,3],[1139,4,1140,4],[1139,5,1139,7],[1139,9,1140,9],[1160,3,1160,7],[1161,3,1161,7],[1162,3,1162,7],[1165,7,1165,9],[1168,3,1168,7],[1169,7,1169,9],[1151,8,1151,9],[1152,1,1153,2],[1152,3,1153,3],[1152,4,1152,5],[1152,6,1152,7],[1157,7,1157,9],[1147,0,1184,0],[1148,2,1148,9],[1149,1,1150,3],[1149,4,1149,5],[1150,4,1150,5],[1151,2,1151,7],[1182,3,1182,7],[1183,5,1183,7],[1172,3,1172,7],[1174,8,1174,9],[1177,3,1177,7],[1178,1,1179,2],[1178,3,1179,3],[1178,4,1179,4],[1178,5,1178,7],[1178,9,1179,9],[1211,3,1211,7],[1213,8,1213,9],[1216,3,1216,7],[1217,1,1218,2],[1217,3,1218,3],[1217,4,1218,4],[1217,5,1217,7],[1217,9,1218,9],[1199,3,1199,7],[1200,3,1200,7],[1201,3,1201,7],[1204,7,1204,9],[1207,3,1207,7],[1208,7,1208,9],[1190,8,1190,9],[1191,1,1192,2],[1191,3,1192,3],[1191,4,1191,5],[1191,6,1191,7],[1196,7,1196,9],[1238,3,1238,7],[1239,3,1239,7],[1240,3,1240,7],[1243,7,1243,9],[1247,3,1247,7],[1248,7,1248,9],[1229,8,1229,9],[1230,1,1231,2],[1230,3,1231,3],[1230,4,1230,5],[1230,6,1230,7],[1235,7,1235,9],[1221,3,1221,7],[1222,5,1222,7],[1225,0,1265,0],[1226,2,1226,9],[1227,1,1228,3],[1227,4,1227,5],[1228,4,1228,5],[1229,2,1229,7],[1263,3,1263,7],[1264,5,1264,7],[1186,0,1223,0],[1187,2,1187,9],[1188,1,1189,3],[1188,4,1188,5],[1189,4,1189,5],[1190,2,1190,7],[1251,3,1251,7],[1253,8,1253,9],[1257,3,1257,7],[1258,1,1259,2],[1258,3,1259,3],[1258,4,1259,4],[1258,5,1258,7],[1258,9,1259,9],[1292,3,1292,7],[1294,8,1294,9],[1297,3,1297,7],[1298,1,1299,2],[1298,3,1299,3],[1298,4,1299,4],[1298,5,1298,7],[1298,9,1299,9],[1280,3,1280,7],[1281,3,1281,7],[1282,3,1282,7],[1285,7,1285,9],[1288,3,1288,7],[1289,7,1289,9],[1271,8,1271,9],[1272,1,1273,2],[1272,3,1273,3],[1272,4,1272,5],[1272,6,1272,7],[1277,7,1277,9],[1320,3,1320,7],[1321,3,1321,7],[1322,3,1322,7],[1325,7,1325,9],[1331,3,1331,7],[1332,7,1332,9],[1310,8,1310,9],[1311,1,1312,2],[1311,3,1312,3],[1311,4,1311,5],[1311,6,1311,7],[1316,7,1316,9],[1302,3,1302,7],[1303,5,1303,7],[1306,0,1347,0],[1307,2,1307,9],[1308,1,1309,3],[1308,4,1308,5],[1309,4,1309,5],[1310,2,1310,7],[1345,3,1345,7],[1346,5,1346,7],[1267,0,1304,0],[1268,2,1268,9],[1269,1,1270,3],[1269,4,1269,5],[1270,4,1270,5],[1271,2,1271,7],[1335,3,1335,7],[1337,8,1337,9],[1340,3,1340,7],[1341,1,1342,2],[1341,3,1342,3],[1341,4,1342,4],[1341,5,1341,7],[1341,9,1342,9],[1374,3,1374,7],[1376,8,1376,9],[1379,3,1379,7],[1380,1,1381,2],[1380,3,1381,3],[1380,4,1381,4],[1380,5,1380,7],[1380,9,1381,9],[1362,3,1362,7],[1363,3,1363,7],[1364,3,1364,7],[1367,7,1367,9],[1370,3,1370,7],[1371,7,1371,9],[1353,8,1353,9],[1354,1,1355,2],[1354,3,1355,3],[1354,4,1354,5],[1354,6,1354,7],[1359,7,1359,9],[1401,3,1401,7],[1402,3,1402,7],[1403,3,1403,7],[1406,7,1406,9],[1409,3,1409,7],[1410,7,1410,9],[1392,8,1392,9],[1393,1,1394,2],[1393,3,1394,3],[1393,4,1393,5],[1393,6,1393,7],[1398,7,1398,9],[1384,3,1384,7],[1385,5,1385,7],[1388,0,1425,0],[1389,2,1389,9],[1390,1,1391,3],[1390,4,1390,5],[1391,4,1391,5],[1392,2,1392,7],[1423,3,1423,7],[1424,5,1424,7],[1349,0,1386,0],[1350,2,1350,9],[1351,1,1352,3],[1351,4,1351,5],[1352,4,1352,5],[1353,2,1353,7],[1413,3,1413,7],[1415,8,1415,9],[1418,3,1418,7],[1419,1,1420,2],[1469,4,1469,5],[1470,2,1470,7],[1508,3,1508,7],[1509,5,1509,7],[1494,3,1494,7],[1496,8,1496,9],[1501,3,1501,7],[1502,1,1503,2],[1419,3,1420,3],[1419,4,1420,4],[1419,5,1419,7],[1419,9,1420,9],[1452,3,1452,7],[1454,8,1454,9],[1457,3,1457,7],[1458,1,1459,2],[1458,3,1459,3],[1458,4,1459,4],[1458,5,1458,7],[1458,9,1459,9],[1440,3,1440,7],[1441,3,1441,7],[1442,3,1442,7],[1445,7,1445,9],[1448,3,1448,7],[1449,7,1449,9],[1431,8,1431,9],[1432,1,1433,2],[1432,3,1433,3],[1432,4,1432,5],[1432,6,1432,7],[1437,7,1437,9],[1535,3,1535,7],[1536,7,1536,9],[1516,8,1516,9],[1517,1,1518,2],[1517,3,1518,3],[1517,4,1517,5],[1517,6,1517,7],[1523,7,1523,9],[1462,3,1462,7],[1463,5,1463,7],[1427,0,1464,0],[1428,2,1428,9],[1429,1,1430,3],[1429,4,1429,5],[1430,4,1430,5],[1431,2,1431,7],[1479,3,1479,7]],"merged_total":1095,"flags":["merged_cut"]}
[1,"1ª/GRD",{"$nulls":8},{"$f":"J37","v":6943.14}]
[null,"OBRA:"," PAVIMENTAÇÃO ASFÁLTICA EM CBUQ - ESTRADA PARA SANTANA DO MUNDO NOVO (JURAMENTO / MG)"]
[null,"Custo Unitário de Referência",null,null,"Minas Gerais"]
[{"$nulls":4}," Janeiro/2025",null,null,"Produção da equipe ",0.5,{"$f":"VLOOKUP(A1,ORÇAMENTO!$A$10:$L$59,7,1)","v":"GL"}]
[null,"CPU.1","MOBILIZAÇÃO E DESMOBILIZAÇÃO",{"$nulls":5},"Valores em reais (R$)"]
[null,"A - EQUIPAMENTOS",null,"Quantidade","Utilização",null,"Custo Horário",null,null,"Custo"]
[{"$nulls":4},"Operativa","Improdutiva","Produtivo","Improdutivo",null,"Horário Total"]
[null,"E9687","Caminhão carroceria com capacidade de 5 t - 115 kW",4,0.5,0.5,146.88079999999999,57.423099999999998,null,{"$f":"D8*(E8*G8+F8*H8)","v":408.6078}]
[null,"E9575","Caminhão basculante com caçamba estanque com capacidade de 14 m³ - 210 kW",8,1,0,309.83940000000001,90.412199999999999,null,{"$f":"D9*(E9*G9+F9*H9)","v":2478.7152000000001}]
[{"$nulls":7},"Custo horário total de equipamentos",null,{"$f":"SUM(J8:J9)","v":2887.3230000000003}]
[null,"B - MÃO DE OBRA",null,"Quantidade","Unidade",null,"Custo Horário","Custo Horário Total"]
[null,"P9824","Servente",8,"h",null,21.3355,null,null,{"$f":"D12*G12","v":170.684}]
[{"$nulls":9},{"$f":"D13*G13","v":0}]
[null,null,null,"Custo horário total de mão de obra",{"$nulls":5},{"$f":"SUM(J12:J13)","v":170.684}]
[null,null,null,"Custo horário total de execução",{"$nulls":5},{"$f":"J10+J14","v":3058.0070000000005}]
[null,null,null,"Custo unitário de execução",{"$nulls":5},{"$f":"J15/I4","v":6116.014000000001}]
[{"$nulls":7},"Custo do FIC",null,0]
[{"$nulls":7},"Custo do FIT",null,0]
[null,"C - MATERIAL",null,"Quantidade","Unidade",null,"Preço Unitário","Custo Unitário"]
[null,"-",0,null,0,null,0,null,null,{"$f":"D20*G20","v":0}]
[null,"-",0,null,0,null,0,null,null,{"$f":"D21*G21","v":0}]
[null,null,null,"Custo unitário total de material",{"$nulls":5},{"$f":"SUM(J20:J21)","v":0}]
[null,"D - ATIVIDADES AUXILIARES",null,"Quantidade","Unidade",null,"Custo Unitário","Custo Unitário"]
[null,5914640,"Transporte com cavalo mecânico com semirreboque com capacidade de 30 t - rodovia pavimentada",1451.1000000000001,"tkm",null,0.56999999999999995,null,null,{"$f":"D24*G24","v":827.12699999999995}]
[null,"-",0,0,0,null,0,null,null,{"$f":"D25*G25","v":0}]
[null,null,null,"Custo total de atividades auxiliares",{"$nulls":5},{"$f":"SUM(J24:J25)","v":827.12699999999995}]
[{"$nulls":7},"Subtotal",null,{"$f":"J16+J22+J26+J17+J18","v":6943.1410000000014}]
[null,"E - TEMPO FIXO",null,"Código","Quantidade","Unidade",null,"Custo Unitário","Custo Unitário"]
[null,"-",0,"-",null,0,null,0,null,{"$f":"ROUNDDOWN(E29*H29,4)","v":0}]
[null,"-",0,"-",null,0,null,0,null,{"$f":"ROUNDDOWN(E30*H30,4)","v":0}]
[null,null,null,"Custo unitário total de tempo fixo",{"$nulls":5},{"$f":"SUM(J29:J30)","v":0}]
[null,"F - MOMENTO DE TRANSPORTE",null,"Quantidade","Unidade","DMT",null,null,null,"Custo Unitário"]
[{"$nulls":5},"LN","RP","P"]
[null,"-",0,null,"tkm"]
[null,"-",0,null,"tkm"]
[null,null,null,"Custo unitário total de transporte"]
[{"$nulls":5},"Custo unitário direto total",null,null,null,{"$f":"TRUNC(J27+J31,2)","v":6943.14}]
[null,"Obs."]
[]
[{"$f":"A1+1","v":2},"1ª/GRD",{"$nulls":8},{"$f":"J81","v":106670.22}]
[null,"OBRA:"," PAVIMENTAÇÃO ASFÁLTICA EM CBUQ - ESTRADA PARA SANTANA DO MUNDO NOVO (JURAMENTO / MG)"]
[null,"Custo Unitário de Referência",null,null,"Minas Gerais"]
[{"$nulls":4}," Janeiro/2025",null,null,"Produção da equipe ",0.2,{"$f":"VLOOKUP(A40,ORÇAMENTO!$A$10:$L$59,7,1)","v":"GL"}]
[null,"CPU.2","ADMINISTRAÇÃO LOCAL ",{"$nulls":5},"Valores em reais (R$)"]
[null,"A - EQUIPAMENTOS",null,"Quantidade","Utilização",null,"Custo Horário",null,null,"Custo"]
[{"$nulls":4},"Operativa","Improdutiva","Produtivo","Improdutivo",null,"Horário Total"]
[null,"-",0,null,null,null,0,0,null,{"$f":"D47*(E47*G47+F47*H47)","v":0}]
[null,"-",0,null,null,null,0,0,null,{"$f":"D48*(E48*G48+F48*H48)","v":0}]
[{"$nulls":7},"Custo horário total de equipamentos",null,{"$f":"SUM(J47:J48)","v":0}]
[null,"B - MÃO DE OBRA",null,"Quantidade","Unidade",null,"Custo Horário","Custo Horário Total"]
[null,"P9812","Engenheiro",0.19982087584583116,"mês",null,26055.551500000001,null,null,{"$f":"D51*G51","v":5206.44312137616}]
[null,"P9840","Encarregado geral",1,"mês",null,9923.372567802,null,null,{"$f":"D52*G52","v":9923.372567802}]
[null,"P9876","Técnico de segurança do trabalho",0.5,"mês",null,5491.8777199999995,null,null,2745.9388599999997]
[null,"P9858","Laboratorista",0.5,"mês",null,4464.0894899999994,null,null,2232.0447449999997]
[null,"P9806","Auxiliar administrativo",0.25,"mês",null,3130.4371699999997,null,null,782.60929249999992]
[null,null,null,"Custo horário total de mão de obra",{"$nulls":5},{"$f":"SUM(J51:J55)","v":20890.408586678161}]
[null,null,null,"Custo horário total de execução",{"$nulls":5},{"$f":"J49+J56","v":20890.408586678161}]
[null,null,null,"Custo unitário de execução",{"$nulls":5},{"$f":"J57/I43","v":104452.0429333908}]
[{"$nulls":7},"Custo do FIC",null,"-"]
[{"$nulls":7},"Custo do FIT",null,"-"]
[null,"C - MATERIAL",null,"Quantidade","Unidade",null,"Preço Unitário","Custo Unitário"]
[null,"-",0,0,0,null,0,null,null,{"$f":"D62*G62","v":0}]
[null,"-",0,0,0,null,0,null,null,0]
[null,null,null,"Custo unitário total de material",{"$nulls":5},{"$f":"SUM(J62:J63)","v":0}]
[null,"D - ATIVIDADES AUXILIARES",null,"Quantidade","Unidade",null,"Custo Unitário","Custo Unitário"]
[null,14250,"Energia Elétrica",200,"kwh",null,0.95,null,null,{"$f":"D66*G66","v":190}]
[null,44480,"Tarifa A - Água e Esgoto",20,"m³",null,17.97,null,null,{"$f":"D67*G67","v":359.4}]
[null,5212560,"Placa de advertência para sinalização de obras montada em suporte metálico móvel, lado 1,00 m - utilização de 600 ciclos - fornecimento, 01 implantação e 01 retirada diária",352,"un.dia",null,3.89,null,null,{"$f":"D68*G68","v":1369.28}]
[null,"Cotação","Telefone",5,"mês",null,59.9,null,null,{"$f":"D69*G69","v":299.5}]
[null,null,null,"Custo total de atividades auxiliares",{"$nulls":5},{"$f":"SUM(J66:J69)","v":2218.1799999999998}]
[{"$nulls":7},"Subtotal",null,{"$f":"J58+J64+J70","v":106670.22293339079}]
[null,"E - TEMPO FIXO",null,"Código","Quantidade","Unidade",null,"Custo Unitário","Custo Unitário"]
[null,"-",0,"-",0,"t",null,0,null,{"$f":"ROUNDDOWN(E73*H73,4)","v":0}]
[null,"-",0,"-",0,"t",null,0,null,{"$f":"ROUNDDOWN(E74*H74,4)","v":0}]
[null,null,null,"Custo unitário total de tempo fixo",{"$nulls":5},{"$f":"SUM(J73:J74)","v":0}]
[null,"F - MOMENTO DE TRANSPORTE",null,"Quantidade","Unidade","DMT",null,null,null,"Custo Unitário"]
[{"$nulls":5},"LN","RP","P"]
[null,"-",0,null,"tkm"]
[null,"-",0,null,"tkm"]
[null,null,null,"Custo unitário total de transporte"]
[{"$nulls":5},"Custo unitário direto total",null,null,null,{"$f":"TRUNC(J71+J75,2)","v":106670.22}]
[null,"Obs."]
[]
[{"$f":"A40+1","v":3},"1ª/GRD",{"$nulls":8},{"$f":"J120","v":11641.05}]
[null,"OBRA:"," PAVIMENTAÇÃO ASFÁLTICA EM CBUQ - ESTRADA PARA SANTANA DO MUNDO NOVO (JURAMENTO / MG)"]
[null,"Custo Unitário de Referência",null,null,"Minas Gerais"]
[{"$nulls":4}," Janeiro/2025",null,null,"Produção da equipe ",1,{"$f":"VLOOKUP(A84,ORÇAMENTO!$A$10:$L$59,7,1)","v":"GL"}]
[null,"CPU.3","CANTEIRO DE OBRAS ",{"$nulls":5},"Valores em reais (R$)"]
[null,"A - EQUIPAMENTOS",null,"Quantidade","Utilização",null,"Custo Horário",null,null,"Custo"]
[{"$nulls":4},"Operativa","Improdutiva","Produtivo","Improdutivo",null,"Horário Total"]
[null,"-",0,null,null,null,0,0,null,{"$f":"D91*(E91*G91+F91*H91)","v":0}]
[null,"-",0,null,null,null,0,0,null,{"$f":"D92*(E92*G92+F92*H92)","v":0}]
[{"$nulls":7},"Custo horário total de equipamentos",null,{"$f":"SUM(J91:J92)","v":0}]
[null,"B - MÃO DE OBRA",null,"Quantidade","Unidade",null,"Custo Horário","Custo Horário Total"]
[null,"P9824","Servente",8,"h",null,21.3355,null,null,{"$f":"D95*G95","v":170.684}]
[null,"P9808","Carpinteiro",8,"h",null,26.4529,null,null,{"$f":"D96*G96","v":211.6232}]
[null,null,null,"Custo horário total de mão de obra",{"$nulls":5},{"$f":"SUM(J95:J96)","v":382.30719999999997}]
[null,null,null,"Custo horário total de execução",{"$nulls":5},{"$f":"J93+J97","v":382.30719999999997}]
[null,null,null,"Custo unitário de execução",{"$nulls":5},{"$f":"J98/I87","v":382.30719999999997}]
[{"$nulls":7},"Custo do FIC",null,"-"]
[{"$nulls":7},"Custo do FIT",null,"-"]
[null,"C - MATERIAL",null,"Quantidade","Unidade",null,"Preço Unitário","Custo Unitário"]
[null,"M0053","Tela plástica em polipropileno na cor laranja para tapume - L = 1,2 m",100,"m",null,1.7749999999999999,null,null,{"$f":"D103*G103","v":177.5}]
[null,"-",0,0,0,null,0,null,null,{"$f":"D104*G104","v":0}]
[null,null,null,"Custo unitário total de material",{"$nulls":5},{"$f":"SUM(J103:J104)","v":177.5}]
[null,"D - ATIVIDADES AUXILIARES",null,"Quantidade","Unidade",null,"Custo Unitário","Custo Unitário"]
[null,10775,"Locação de container 2,30 X 6,00 m, alt. 2,50 m, com 1 sanitário, para escritório, completo, sem divisórias internas",5,"mês",null,985,null,null,{"$f":"D107*G107","v":4925}]
[null,10779,"Locação de container 2,30 X 4,30 m, alt. 2,50 M, p/ sanitário, c/ 5 bacias, 1 lavatório e 4 mictórios",5,"mês",null,1231.25,null,null,{"$f":"D108*G108","v":6156.25}]
[null,null,null,"Custo total de atividades auxiliares",{"$nulls":5},{"$f":"SUM(J107:J108)","v":11081.25}]
[{"$nulls":7},"Subtotal",null,{"$f":"J99+J105+J109","v":11641.057199999999}]
[null,"E - TEMPO FIXO",null,"Código","Quantidade","Unidade",null,"Custo Unitário","Custo Unitário"]
[null,"-",0,"-",0,"t",null,0,null,{"$f":"ROUNDDOWN(E112*H112,4)","v":0}]
[null,"-",0,"-",0,"t",null,0,null,{"$f":"ROUNDDOWN(E113*H113,4)","v":0}]
[null,null,null,"Custo unitário total de tempo fixo",{"$nulls":5},{"$f":"SUM(J112:J113)","v":0}]
[null,"F - MOMENTO DE TRANSPORTE",null,"Quantidade","Unidade","DMT",null,null,null,"Custo Unitário"]
[{"$nulls":5},"LN","RP","P"]
[null,"-",0,0,"tkm"]
[null,"-",0,0,"tkm"]
[null,null,null,"Custo unitário total de transporte"]
[{"$nulls":5},"Custo unitário direto total",null,null,null,{"$f":"TRUNC(J110+J114,2)","v":11641.05}]
[null,"Obs."]
[]
[{"$f":"A84+1","v":4},"1ª/GRD",{"$nulls":8},{"$f":"J161","v":351.42}]
[null,"OBRA:"," PAVIMENTAÇÃO ASFÁLTICA EM CBUQ - ESTRADA PARA SANTANA DO MUNDO NOVO (JURAMENTO / MG)"]
[null,"Custo Unitário de Referência",null,null,"Minas Gerais"]
[{"$nulls":4}," Janeiro/2025",null,null,"Produção da equipe ",1,{"$f":"VLOOKUP(A123,ORÇAMENTO!$A$10:$L$59,7,1)","v":"M2"}]
[null,103689,"PLACA DE OBRA EM CHAPA DE AÇO GALVANIZADO",{"$nulls":5},"Valores em reais (R$)"]
[null,"A - EQUIPAMENTOS",null,"Quantidade","Utilização",null,"Custo Horário",null,null,"Custo"]
[{"$nulls":4},"Operativa","Improdutiva","Produtivo","Improdutivo",null,"Horário Total"]
[null,"-",0,null,null,null,0,0,null,{"$f":"D130*(E130*G130+F130*H130)","v":0}]
[null,"-",0,null,null,null,0,0,null,{"$f":"D131*(E131*G131+F131*H131)","v":0}]
[{"$nulls":7},"Custo horário total de equipamentos",null,{"$f":"SUM(J130:J131)","v":0}]
[null,"B - MÃO DE OBRA",null,"Quantidade","Unidade",null,"Custo Horário","Custo Horário Total"]
[null,"P9824","Servente",1.1186,"h",null,21.3355,null,null,{"$f":"D134*G134","v":23.8658903}]
[null,"P9808","Carpinteiro",0.37290000000000001,"h",null,26.4529,null,null,{"$f":"D135*G135","v":9.8642864100000001}]
[null,null,null,"Custo horário total de mão de obra",{"$nulls":5},{"$f":"SUM(J134:J135)","v":33.730176710000002}]
[null,null,null,"Custo horário total de execução",{"$nulls":5},{"$f":"J132+J136","v":33.730176710000002}]
[null,null,null,"Custo unitário de execução",{"$nulls":5},{"$f":"J137/I126","v":33.730176710000002}]
[{"$nulls":7},"Custo do FIC",null,"-"]
[{"$nulls":7},"Custo do FIT",null,"-"]
[null,"C - MATERIAL",null,"Quantidade","Unidade",null,"Preço Unitário","Custo Unitário"]
[null,"M1358","Sarrafo em madeira de terceira - E = 2,5 cm e L = 5 cm",6.4165999999999999,"m",null,1.9665999999999999,null,null,{"$f":"D142*G142","v":12.618885559999999}]
[null,"M1205","Prego de ferro",2.4500000000000001E-2,"kg",null,16.544499999999999,null,null,{"$f":"D143*G143","v":0.40534025000000001}]
[null,"M0998","Madeira estrutural de eucalipto",2.2608E-2,"m³",null,2418.0391,null,null,{"$f":"D144*G144","v":54.6670279728}]
[null,4813,"Placa de obra (para construção civil) em chapa galvanizada *N. 22*, adesivada, de *2,4 X 1,2* m (sem postes para fixação)",1,"m²",null,250,null,null,250]
[null,null,null,"Custo unitário total de material",{"$nulls":5},{"$f":"SUM(J142:J145)","v":317.6912537828}]
[null,"D - ATIVIDADES AUXILIARES",null,"Quantidade","Unidade",null,"Custo Unitário","Custo Unitário"]
[null,"-",0,0,0,null,0,null,null,{"$f":"D148*G148","v":0}]
[null,"-",0,0,0,null,0,null,null,{"$f":"D149*G149","v":0}]
[null,null,null,"Custo total de atividades auxiliares",{"$nulls":5},{"$f":"SUM(J148:J149)","v":0}]
[{"$nulls":7},"Subtotal",null,{"$f":"J138+J146+J150","v":351.42143049280003}]
[null,"E - TEMPO FIXO",null,"Código","Quantidade","Unidade",null,"Custo Unitário","Custo Unitário"]
[null,"-",0,"-",0,"t",null,0,null,{"$f":"ROUNDDOWN(E153*H153,4)","v":0}]
[null,"-",0,"-",0,"t",null,0,null,{"$f":"ROUNDDOWN(E154*H154,4)","v":0}]
[null,null,null,"Custo unitário total de tempo fixo",{"$nulls":5},{"$f":"SUM(J153:J154)","v":0}]
[null,"F - MOMENTO DE TRANSPORTE",null,"Quantidade","Unidade","DMT",null,null,null,"Custo Unitário"]
[{"$nulls":5},"LN","RP","P"]
[null,"-",0,0,"tkm"]
[null,"-",0,0,"tkm"]
[null,null,null,"Custo unitário total de transporte"]
[{"$nulls":5},"Custo unitário direto total",null,null,null,{"$f":"TRUNC(J151+J155,2)","v":351.42}]
[null,"Obs."]
[]
[{"$f":"A123+1","v":5},"1ª/GRD",{"$nulls":8},{"$f":"J200","v":0.56000000000000005}]
[null,"OBRA:"," PAVIMENTAÇÃO ASFÁLTICA EM CBUQ - ESTRADA PARA SANTANA DO MUNDO NOVO (JURAMENTO / MG)"]
[null,"Custo Unitário de Referência",null,null,"Minas Gerais"]
[{"$nulls":4}," Janeiro/2025",null,null,"Produção da equipe ",622.95000000000005,{"$f":"VLOOKUP(A164,ORÇAMENTO!$A$10:$L$59,7,1)","v":"M2"}]
[null,5502985,"LIMPEZA MECANIZADA DE CAMADA VEGETAL",{"$nulls":5},"Valores em reais (R$)"]
[null,"A - EQUIPAMENTOS",null,"Quantidade","Utilização",null,"Custo Horário",null,null,"Custo"]
[{"$nulls":4},"Operativa","Improdutiva","Produtivo","Improdutivo",null,"Horário Total"]
[null,"E9540","Trator sobre esteiras com lâmina - 127 kW",1,1,0,323.26330000000002,130.7561,null,{"$f":"D171*(E171*G171+F171*H171)","v":323.26330000000002}]
[null,"-",0,null,null,null,0,0,null,{"$f":"D172*(E172*G172+F172*H172)","v":0}]
[{"$nulls":7},"Custo horário total de equipamentos",null,{"$f":"SUM(J171:J172)","v":323.26330000000002}]
[null,"B - MÃO DE OBRA",null,"Quantidade","Unidade",null,"Custo Horário","Custo Horário Total"]
[null,"P9824","Servente",1,"h",null,21.3355,null,null,{"$f":"D175*G175","v":21.3355}]
[null,"-",0,0,0,null,0,null,null,{"$f":"D176*G176","v":0}]
[null,null,null,"Custo horário total de mão de obra",{"$nulls":5},{"$f":"SUM(J175:J176)","v":21.3355}]
[null,null,null,"Custo horário total de execução",{"$nulls":5},{"$f":"J173+J177","v":344.59880000000004}]
[null,null,null,"Custo unitário de execução",{"$nulls":5},{"$f":"J178/I167","v":0.55317248575327072}]
[{"$nulls":7},"Custo do FIC",null,1.1299999999999999E-2]
[{"$nulls":7},"Custo do FIT",null,0]
[null,"C - MATERIAL",null,"Quantidade","Unidade",null,"Preço Unitário","Custo Unitário"]
[null,"-",0,null,0,null,0,null,null,{"$f":"D183*G183","v":0}]
[null,"-",0,null,0,null,0,null,null,{"$f":"D184*G184","v":0}]
[null,null,null,"Custo unitário total de material",{"$nulls":5},{"$f":"SUM(J183:J184)","v":0}]
[null,"D - ATIVIDADES AUXILIARES",null,"Quantidade","Unidade",null,"Custo Unitário","Custo Unitário"]
[null,"-",0,0,0,null,0,null,null,{"$f":"D187*G187","v":0}]
[null,"-",0,0,0,null,0,null,null,{"$f":"D188*G188","v":0}]
[null,null,null,"Custo total de atividades auxiliares",{"$nulls":5},{"$f":"SUM(J187:J188)","v":0}]
[{"$nulls":7},"Subtotal",null,{"$f":"J179+J185+J189+J180+J181","v":0.56447248575327069}]
[null,"E - TEMPO FIXO",null,"Código","Quantidade","Unidade",null,"Custo Unitário","Custo Unitário"]
[null,"-",0,"-",0,"t",null,0,null,{"$f":"ROUNDDOWN(E192*H192,4)","v":0}]
[null,"-",0,"-",0,"t",null,0,null,{"$f":"ROUNDDOWN(E193*H193,4)","v":0}]
[null,null,null,"Custo unitário total de tempo fixo",{"$nulls":5},{"$f":"SUM(J192:J193)","v":0}]
[null,"F - MOMENTO DE TRANSPORTE",null,"Quantidade","Unidade","DMT",null,null,null,"Custo Unitário"]
[{"$nulls":5},"LN","RP","P"]
[null,"-",0]
[null,"-",0]
[null,null,null,"Custo unitário total de transporte"]
[{"$nulls":5},"Custo unitário direto total",null,null,null,{"$f":"TRUNC(J190+J194,2)","v":0.56000000000000005}]
[null,"Obs."]
[]
[{"$f":"A164+1","v":6},"1ª/GRD",{"$nulls":8},{"$f":"J241","v":0.39}]
[null,"OBRA:"," PAVIMENTAÇÃO ASFÁLTICA EM CBUQ - ESTRADA PARA SANTANA DO MUNDO NOVO (JURAMENTO / MG)"]
[null,"Custo Unitário de Referência",null,null,"Minas Gerais"]
[{"$nulls":4}," Janeiro/2025",null,null,"Produção da equipe ",1,{"$f":"VLOOKUP(A203,ORÇAMENTO!$A$10:$L$59,7,1)","v":"M2"}]
[null,78472,"SERVIÇOS TOPOGRÁFICOS PARA PAVIMENTAÇÃO, INCLUSIVE LEVANTAMENTO PLANIALTIMÉTRICO CADASTRAL, GERAÇÃO DE NOTAS DE SERVIÇO, SEÇÕES TRANSVERSAIS E GREIDE, ESTAQUEAMENTO E ACOMPANHAMENTO EXECUTIVO",{"$nulls":5},"Valores em reais (R$)"]
[null,"A - EQUIPAMENTOS",null,"Quantidade","Utilização",null,"Custo Horário",null,null,"Custo"]
[{"$nulls":4},"Operativa","Improdutiva","Produtivo","Improdutivo",null,"Horário Total"]
[null,92145,"Caminhonete cabine simples com motor 1.6 flex, câmbio manual, potência 101/104 cv, 2 portas",5.0000000000000001E-4,1,0,76.5,0,null,{"$f":"D210*(E210*G210+F210*H210)","v":3.8249999999999999E-2}]
[null,"-",0,0,1,0,0,0,null,{"$f":"D211*(E211*G211+F211*H211)","v":0}]
[{"$nulls":7},"Custo horário total de equipamentos",null,{"$f":"SUM(J210:J211)","v":3.8249999999999999E-2}]
[null,"B - MÃO DE OBRA",null,"Quantidade","Unidade",null,"Custo Horário","Custo Horário Total"]
[null,"P9949","Topógrafo",9.2592592592592591E-6,"mês",null,6816.9715999999999,28.404048333333332,null,{"$f":"D214*G214","v":6.3120107407407408E-2}]
[null,"P9950","Auxiliar de topografia",9.2592592592592591E-6,"mês",null,6157.8463000000002,22.806838148148149,null,{"$f":"D215*G215","v":5.701709537037037E-2}]
[null,"P9824","Servente",7.4999999999999997E-3,"h",null,21.3355,8.889791666666666E-2,null,{"$f":"D216*G216","v":0.16001625}]
[null,"P9848","Desenhista",7.4074074074074075E-6,"mês",null,10307.748600000001,38.17684666666667,null,{"$f":"D217*G217","v":7.6353693333333333E-2}]
[null,null,null,"Custo horário total de mão de obra",{"$nulls":5},{"$f":"SUM(J214:J217)","v":0.35650714611111112}]
[null,null,null,"Custo horário total de execução",{"$nulls":5},{"$f":"J212+J218","v":0.39475714611111112}]
[null,null,null,"Custo unitário de execução",{"$nulls":5},{"$f":"J219/I206","v":0.39475714611111112}]
[{"$nulls":7},"Custo do FIC",null,"-"]
[{"$nulls":7},"Custo do FIT",null,"-"]
[null,"C - MATERIAL",null,"Quantidade","Unidade",null,"Preço Unitário","Custo Unitário"]
[null,"-",0,0,0,null,0,null,null,{"$f":"D224*G224","v":0}]
[null,"-",0,0,0,null,0,null,null,0]
[null,null,null,"Custo unitário total de material",{"$nulls":5},{"$f":"SUM(J224:J225)","v":0}]
[null,"D - ATIVIDADES AUXILIARES",null,"Quantidade","Unidade",null,"Custo Unitário","Custo Unitário"]
[null,"-",0,0,0,null,0,null,null,{"$f":"D228*G228","v":0}]
[null,"-",0,0,0,null,0,null,null,{"$f":"D229*G229","v":0}]
[null,null,null,"Custo total de atividades auxiliares",{"$nulls":5},{"$f":"SUM(J228:J229)","v":0}]
[{"$nulls":7},"Subtotal",null,{"$f":"J220+J226+J230","v":0.39475714611111112}]
[null,"E - TEMPO FIXO",null,"Código","Quantidade","Unidade",null,"Custo Unitário","Custo Unitário"]
[null,"-",0,"-",0,"t",null,0,null,{"$f":"ROUNDDOWN(E233*H233,4)","v":0}]
[null,"-",0,"-",0,"t",null,0,null,{"$f":"ROUNDDOWN(E234*H234,4)","v":0}]
[null,null,null,"Custo unitário total de tempo fixo",{"$nulls":5},{"$f":"SUM(J233:J234)","v":0}]
[null,"F - MOMENTO DE TRANSPORTE",null,"Quantidade","Unidade","DMT",null,null,null,"Custo Unitário"]
[{"$nulls":5},"LN","RP","P"]
[null,"-",0,0,"tkm"]
[null,"-",0,0,"tkm"]
[null,null,null,"Custo unitário total de transporte"]
[{"$nulls":5},"Custo unitário direto total",null,null,null,{"$f":"TRUNC(J231+J235,2)","v":0.39}]
[null,"Obs."]
[]
[{"$f":"A203+1","v":7},"1ª/GRD",{"$nulls":8},{"$f":"J280","v":6.73}]
[null,"OBRA:"," PAVIMENTAÇÃO ASFÁLTICA EM CBUQ - ESTRADA PARA SANTANA DO MUNDO NOVO (JURAMENTO / MG)"]
[null,"Custo Unitário de Referência",null,null,"Minas Gerais"]
[{"$nulls":4}," Janeiro/2025",null,null,"Produção da equipe ",230.19,{"$f":"VLOOKUP(A244,ORÇAMENTO!$A$10:$L$59,7,1)","v":"M3"}]
[null,5502114,"ESCAVAÇÃO, CARGA E TRANSPORTE DE MATERIAL DE 1ª CATEGORIA - DMT 1.000 A 1.200M, CAMINHO DE SERVIÇO EM REVESTIMENTO PRIMÁRIO",{"$nulls":5},"Valores em reais (R$)"]
[null,"A - EQUIPAMENTOS",null,"Quantidade","Utilização",null,"Custo Horário",null,null,"Custo"]
[{"$nulls":4},"Operativa","Improdutiva","Produtivo","Improdutivo",null,"Horário Total"]
[null,"E9667","Caminhão basculante com capacidade de 14 m³ - 210 kW",4,0.96,0.04,309.83940000000001,90.412199999999999,null,{"$f":"D251*(E251*G251+F251*H251)","v":1204.2492480000001}]
[null,"E9515","Escavadeira hidráulica sobre esteiras com caçamba com capacidade de 1,56 m³ - 118 kW",1,1,0,287.62189999999998,129.0472,null,{"$f":"D252*(E252*G252+F252*H252)","v":287.62189999999998}]
[{"$nulls":7},"Custo horário total de equipamentos",null,{"$f":"SUM(J251:J252)","v":1491.8711480000002}]
[null,"B - MÃO DE OBRA",null,"Quantidade","Unidade",null,"Custo Horário","Custo Horário Total"]
[null,"P9824","Servente",1,"h",null,21.3355,null,null,{"$f":"D255*G255","v":21.3355}]
[{"$nulls":9},{"$f":"D256*G256","v":0}]
[null,null,null,"Custo horário total de mão de obra",{"$nulls":5},{"$f":"SUM(J255:J256)","v":21.3355}]
[null,null,null,"Custo horário total de execução",{"$nulls":5},{"$f":"J253+J257","v":1513.2066480000001}]
[null,null,null,"Custo unitário de execução",{"$nulls":5},{"$f":"J258/I247","v":6.5737288674573184}]
[{"$nulls":7},"Custo do FIC",null,0.161]
[{"$nulls":7},"Custo do FIT",null,0]
[null,"C - MATERIAL",null,"Quantidade","Unidade",null,"Preço Unitário","Custo Unitário"]
[null,"-",0,null,0,null,0,null,null,{"$f":"D263*G263","v":0}]
[null,"-",0,null,0,null,0,null,null,{"$f":"D264*G264","v":0}]
[null,null,null,"Custo unitário total de material",{"$nulls":5},{"$f":"SUM(J263:J264)","v":0}]
[null,"D - ATIVIDADES AUXILIARES",null,"Quantidade","Unidade",null,"Custo Unitário","Custo Unitário"]
[null,"-",0,0,0,null,0,null,null,{"$f":"D267*G267","v":0}]
[null,"-",0,0,0,null,0,null,null,{"$f":"D268*G268","v":0}]
[null,null,null,"Custo total de atividades auxiliares",{"$nulls":5},{"$f":"SUM(J267:J268)","v":0}]
[{"$nulls":7},"Subtotal",null,{"$f":"J259+J265+J269+J260+J261","v":6.734728867457318}]
[null,"E - TEMPO FIXO",null,"Código","Quantidade","Unidade",null,"Custo Unitário","Custo Unitário"]
[null,"-",0,"-",0,"t",null,0,null,{"$f":"ROUNDDOWN(E272*H272,4)","v":0}]
[null,"-",0,"-",0,"t",null,0,null,{"$f":"ROUNDDOWN(E273*H273,4)","v":0}]
[null,null,null,"Custo unitário total de tempo fixo",{"$nulls":5},{"$f":"SUM(J272:J273)","v":0}]
[null,"F - MOMENTO DE TRANSPORTE",null,"Quantidade","Unidade","DMT",null,null,null,"Custo Unitário"]
[{"$nulls":5},"LN","RP","P"]
[null,"-",0,null,"tkm","5914449","5914464","5914479"]
[null,"-",0,null,"tkm","5914449","5914464","5914479"]
[null,null,null,"Custo unitário total de transporte"]
[{"$nulls":5},"Custo unitário direto total",null,null,null,{"$f":"TRUNC(J270+J274,2)","v":6.73}]
[null,"Obs."]
[]
[10,"1ª/GRD",{"$nulls":8},{"$f":"J323","v":1.54}]
[null,"OBRA:"," PAVIMENTAÇÃO ASFÁLTICA EM CBUQ - ESTRADA PARA SANTANA DO MUNDO NOVO (JURAMENTO / MG)"]
[null,"Custo Unitário de Referência",null,null,"Minas Gerais"]
[{"$nulls":4}," Janeiro/2025",null,null,"Produção da equipe ",672.8,{"$f":"VLOOKUP(A283,ORÇAMENTO!$A$10:$L$59,7,1)","v":"M2"}]
[null,4011209,"REGULARIZAÇÃO E COMPACTAÇÃO DO SUBLEITO ",{"$nulls":5},"Valores em reais (R$)"]
[null,"A - EQUIPAMENTOS",null,"Quantidade","Utilização",null,"Custo Horário",null,null,"Custo"]
[{"$nulls":4},"Operativa","Improdutiva","Produtivo","Improdutivo",null,"Horário Total"]
[null,"E9571","Caminhão tanque com capacidade de 10.000 l - 188 kW",1,0.61,0.39,323.59019999999998,80.173299999999998,null,{"$f":"D290*(E290*G290+F290*H290)","v":228.65760899999998}]
[null,"E9518","Grade de 24 discos rebocável de D = 60 cm (24\")",1,0.41,0.59,4.9436,3.4426000000000001,null,{"$f":"D291*(E291*G291+F291*H291)","v":4.0580099999999995}]
[null,"E9524","Motoniveladora - 93 kW",1,0.43,0.56999999999999995,288.51479999999998,125.7629,null,195.74621699999997]
[null,"E9762","Rolo compactador de pneus autopropelido de 27 t - 85 kW",1,0.96,0.04,255.65049999999999,124.5621,null,250.40696399999999]
[null,"E9685","Rolo compactador pé de carneiro vibratório autopropelido por pneus de 11,6 t - 82 kW",1,1,0,225.9264,101.55289999999999,null,225.9264]
[null,"E9577","Trator agrícola sobre pneus - 77 kW",1,0.41,0.59,152.69229999999999,55.394399999999997,null,95.286538999999991]
[{"$nulls":7},"Custo horário total de equipamentos",null,{"$f":"SUM(J290:J295)","v":1000.081739}]
[null,"B - MÃO DE OBRA",null,"Quantidade","Unidade",null,"Custo Horário","Custo Horário Total"]
[null,"P9824","Servente",1,"h",null,21.3355,null,null,{"$f":"D298*G298","v":21.3355}]
[null,"-",null,0,0,null,0,null,null,{"$f":"D299*G299","v":0}]
[null,null,null,"Custo horário total de mão de obra",{"$nulls":5},{"$f":"SUM(J298:J299)","v":21.3355}]
[null,null,null,"Custo horário total de execução",{"$nulls":5},{"$f":"J296+J300","v":1021.417239}]
[null,null,null,"Custo unitário de execução",{"$nulls":5},{"$f":"J301/I286","v":1.5181587975624258}]
[{"$nulls":7},"Custo do FIC",null,3.1E-2]
[{"$nulls":7},"Custo do FIT",null,0]
[null,"C - MATERIAL",null,"Quantidade","Unidade",null,"Preço Unitário","Custo Unitário"]
[null,"-",0,null,0,null,0,null,null,{"$f":"D306*G306","v":0}]
[null,"-",0,null,0,null,0,null,null,{"$f":"D307*G307","v":0}]
[null,null,null,"Custo unitário total de material",{"$nulls":5},{"$f":"SUM(J306:J307)","v":0}]
[null,"D - ATIVIDADES AUXILIARES",null,"Quantidade","Unidade",null,"Custo Unitário","Custo Unitário"]
[null,"-",0,0,0,null,0,null,null,{"$f":"D310*G310","v":0}]
[null,"-",0,0,0,null,0,null,null,{"$f":"D311*G311","v":0}]
[null,null,null,"Custo total de atividades auxiliares",{"$nulls":5},{"$f":"SUM(J310:J311)","v":0}]
[{"$nulls":7},"Subtotal",null,{"$f":"J302+J308+J312+J303+J304","v":1.5491587975624257}]
[null,"E - TEMPO FIXO",null,"Código","Quantidade","Unidade",null,"Custo Unitário","Custo Unitário"]
[null,"-",0,"-",0,"t",null,0,null,{"$f":"ROUNDDOWN(E315*H315,4)","v":0}]
[null,"-",0,"-",0,"t",null,0,null,{"$f":"ROUNDDOWN(E316*H316,4)","v":0}]
[null,null,null,"Custo unitário total de tempo fixo",{"$nulls":5},{"$f":"SUM(J315:J316)","v":0}]
[null,"F - MOMENTO DE TRANSPORTE",null,"Quantidade","Unidade","DMT",null,null,null,"Custo Unitário"]
[{"$nulls":5},"LN","RP","P"]
[null,"-",0,null,"tkm","5914449","5914464","5914479"]
[null,"-",0,null,"tkm","5914449","5914464","5914479"]
[null,null,null,"Custo unitário total de transporte"]
[{"$nulls":5},"Custo unitário direto total",null,null,null,{"$f":"TRUNC(J313+J317,2)","v":1.54}]
[null,"Obs."]
[]
[{"$f":"A283+1","v":11},"1ª/GRD",{"$nulls":8},{"$f":"J364","v":149.72999999999999}]
[null,"OBRA:"," PAVIMENTAÇÃO ASFÁLTICA EM CBUQ - ESTRADA PARA SANTANA DO MUNDO NOVO (JURAMENTO / MG)"]
[null,"Custo Unitário de Referência",null,null,"Minas Gerais"]
[{"$nulls":4}," Janeiro/2025",null,null,"Produção da equipe ",113.18,{"$f":"VLOOKUP(A326,ORÇAMENTO!$A$10:$L$59,7,1)","v":"M3"}]
[null,4011276,"EXECUÇÃO E COMPACTAÇÃO DE BASE E OU SUB BASE PARA PAVIMENTAÇÃO DE BICA CORRIDA - EXCLUSIVE TRANSPORTE",{"$nulls":5},"Valores em reais (R$)"]
[null,"A - EQUIPAMENTOS",null,"Quantidade","Utilização",null,"Custo Horário",null,null,"Custo"]
[{"$nulls":4},"Operativa","Improdutiva","Produtivo","Improdutivo",null,"Horário Total"]
[null,"E9571","Caminhão tanque com capacidade de 10.000 l - 188 kW",1,0.34,0.66,323.59019999999998,80.173299999999998,null,{"$f":"D333*(E333*G333+F333*H333)","v":162.935046}]
[null,"E9514","Distribuidor de agregados sobre pneus autopropelido - 130 kW",1,1,0,292.00130000000001,107.6279,null,{"$f":"D334*(E334*G334+F334*H334)","v":292.00130000000001}]
[null,"E9762","Rolo compactador de pneus autopropelido de 27 t - 85 kW",1,0.97,0.03,255.65049999999999,124.5621,null,{"$f":"D335*(E335*G335+F335*H335)","v":251.71784799999998}]
[null,"E9530","Rolo compactador liso vibratório autopropelido por pneus de 11 t - 97 kW",1,0.79,0.21,259.53739999999999,112.9601,null,228.756167]
[{"$nulls":7},"Custo horário total de equipamentos",null,{"$f":"SUM(J333:J336)","v":935.41036099999997}]
[null,"B - MÃO DE OBRA",null,"Quantidade","Unidade",null,"Custo Horário","Custo Horário Total"]
[null,"P9824","Servente",1,"h",null,21.3355,null,null,{"$f":"D339*G339","v":21.3355}]
[null,"-",0,0,0,null,0,null,null,{"$f":"D340*G340","v":0}]
[null,null,null,"Custo horário total de mão de obra",{"$nulls":5},{"$f":"SUM(J339:J340)","v":21.3355}]
[null,null,null,"Custo horário total de execução",{"$nulls":5},{"$f":"J337+J341","v":956.74586099999999}]
[null,null,null,"Custo unitário de execução",{"$nulls":5},{"$f":"J342/I329","v":8.4533120781056716}]
[{"$nulls":7},"Custo do FIC",null,5.7599999999999998E-2]
[{"$nulls":7},"Custo do FIT",null,0]
[null,"C - MATERIAL",null,"Quantidade","Unidade",null,"Preço Unitário","Custo Unitário"]
[null,"-",0,null,0,null,0,null,null,{"$f":"D347*G347","v":0}]
[null,"-",0,null,0,null,0,null,null,{"$f":"D348*G348","v":0}]
[null,null,null,"Custo unitário total de material",{"$nulls":5},{"$f":"SUM(J347:J348)","v":0}]
[null,"D - ATIVIDADES AUXILIARES",null,"Quantidade","Unidade",null,"Custo Unitário","Custo Unitário"]
[null,6416040,"Usinagem de brita graduada com brita comercial em usina de 300 t/h",1,"m³",null,133.5,"COTAÇÃO",null,{"$f":"D351*G351","v":133.5}]
[null,"-",0,0,0,null,0,null,null,{"$f":"D352*G352","v":0}]
[null,null,null,"Custo total de atividades auxiliares",{"$nulls":5},{"$f":"SUM(J351:J352)","v":133.5}]
[{"$nulls":7},"Subtotal",null,{"$f":"J343+J349+J353+J344+J345","v":142.01091207810569}]
[null,"E - TEMPO FIXO",null,"Código","Quantidade","Unidade",null,"Custo Unitário","Custo Unitário"]
[null,6416040,"Usinagem de brita graduada com brita comercial em usina de 300 t/h",5914652,2.2000000000000002,"t",null,3.51,null,{"$f":"ROUNDDOWN(E356*H356,4)","v":7.7220000000000004}]
[null,"-",0,"-",null,"t",null,0,null,{"$f":"ROUNDDOWN(E357*H357,4)","v":0}]
[null,null,null,"Custo unitário total de tempo fixo",{"$nulls":5},{"$f":"SUM(J356:J357)","v":7.7220000000000004}]
[null,"F - MOMENTO DE TRANSPORTE",null,"Quantidade","Unidade","DMT",null,null,null,"Custo Unitário"]
[{"$nulls":5},"LN","RP","P"]
[null,6416040,"Usinagem de brita graduada com brita comercial em usina de 300 t/h",2.2000000000000002,"tkm","5914359","5914374","5914389"]
[null,"-",0,0,"tkm"]
[null,null,null,"Custo unitário total de transporte"]
[{"$nulls":5},"Custo unitário direto total",null,null,null,{"$f":"TRUNC(J354+J358,2)","v":149.72999999999999}]
[null,"Obs."]
[]
[{"$f":"A326+1","v":12},"1ª/GRD",{"$nulls":8},{"$f":"J403","v":0.4}]
[null,"OBRA:"," PAVIMENTAÇÃO ASFÁLTICA EM CBUQ - ESTRADA PARA SANTANA DO MUNDO NOVO (JURAMENTO / MG)"]
[null,"Custo Unitário de Referência",null,null,"Minas Gerais"]
[{"$nulls":4}," Janeiro/2025",null,null,"Produção da equipe ",1038.46,{"$f":"VLOOKUP(A367,ORÇAMENTO!$A$10:$L$59,7,1)","v":"M2"}]
[null,4011352,"IMPRIMAÇÃO COM EMULSÃO ASFÁLTICA (EAI)",{"$nulls":5},"Valores em reais (R$)"]
[null,"A - EQUIPAMENTOS",null,"Quantidade","Utilização",null,"Custo Horário",null,null,"Custo"]
[{"$nulls":4},"Operativa","Improdutiva","Produtivo","Improdutivo",null,"Horário Total"]
[null,"E9509","Caminhão tanque distribuidor de asfalto com capacidade de 6.000 l - 7 kW/136 kW",1,1,0,261.03050000000002,72.388300000000001,null,{"$f":"D374*(E374*G374+F374*H374)","v":261.03050000000002}]
[null,"E9558","Tanque de estocagem de asfalto com capacidade de 30.000 l",2,1,0,56.138500000000001,38.346699999999998,null,{"$f":"D375*(E375*G375+F375*H375)","v":112.277}]
[{"$nulls":7},"Custo horário total de equipamentos",null,{"$f":"SUM(J374:J375)","v":373.3075}]
[null,"B - MÃO DE OBRA",null,"Quantidade","Unidade",null,"Custo Horário","Custo Horário Total"]
[null,"P9824","Servente",2,"h",null,21.3355,null,null,{"$f":"D378*G378","v":42.670999999999999}]
[null,"-",{"$nulls":7},{"$f":"D379*G379","v":0}]
[null,null,null,"Custo horário total de mão de obra",{"$nulls":5},{"$f":"SUM(J378:J379)","v":42.670999999999999}]
[null,null,null,"Custo horário total de execução",{"$nulls":5},{"$f":"J376+J380","v":415.9785}]
[null,null,null,"Custo unitário de execução",{"$nulls":5},{"$f":"J381/I370","v":0.40057248232960341}]
[{"$nulls":7},"Custo do FIC",null,1.4E-3]
[{"$nulls":7},"Custo do FIT",null,0]
[null,"C - MATERIAL",null,"Quantidade","Unidade",null,"Preço Unitário","Custo Unitário"]
[null,"M2092","Emulsão asfáltica para imprimação",1.2999999999999999E-3,"t",null,0,"FORNECIMENTO COM BDI DIFERENCIADO",null,{"$f":"D386*G386","v":0}]
[null,"-",0,89.28,0,null,0,null,null,{"$f":"D387*G387","v":0}]
[null,null,null,"Custo unitário total de material",{"$nulls":5},{"$f":"SUM(J386:J387)","v":0}]
[null,"D - ATIVIDADES AUXILIARES",null,"Quantidade","Unidade",null,"Custo Unitário","Custo Unitário"]
[null,"-",0,0,0,null,0,null,null,{"$f":"D390*G390","v":0}]
[null,"-",0,0,0,null,0,null,null,{"$f":"D391*G391","v":0}]
[null,null,null,"Custo total de atividades auxiliares",{"$nulls":5},{"$f":"SUM(J390:J391)","v":0}]
[{"$nulls":7},"Subtotal",null,{"$f":"J382+J388+J392+J383+J384","v":0.40197248232960342}]
[null,"E - TEMPO FIXO",null,"Código","Quantidade","Unidade",null,"Custo Unitário","Custo Unitário"]
[null,"-",0,"-",0,"t",null,0,null,{"$f":"ROUNDDOWN(E395*H395,4)","v":0}]
[null,"-",0,"-",0,"t",null,0,null,{"$f":"ROUNDDOWN(E396*H396,4)","v":0}]
[null,null,null,"Custo unitário total de tempo fixo",{"$nulls":5},{"$f":"SUM(J395:J396)","v":0}]
[null,"F - MOMENTO DE TRANSPORTE",null,"Quantidade","Unidade","DMT",null,null,null,"Custo Unitário"]
[{"$nulls":5},"LN","RP","P"]
[null,"-",0,null,"tkm"]
[null,"-",0,null,"tkm"]
[null,null,null,"Custo unitário total de transporte"]
[{"$nulls":5},"Custo unitário direto total",null,null,null,{"$f":"TRUNC(J393+J397,2)","v":0.4}]
[null,"Obs."]
[]
[{"$f":"A367+1","v":13},"1ª/GRD",{"$nulls":8},{"$f":"J442","v":0.27}]
[null,"OBRA:"," PAVIMENTAÇÃO ASFÁLTICA EM CBUQ - ESTRADA PARA SANTANA DO MUNDO NOVO (JURAMENTO / MG)"]
[null,"Custo Unitário de Referência",null,null,"Minas Gerais"]
[{"$nulls":4}," Janeiro/2025",null,null,"Produção da equipe ",1500,{"$f":"VLOOKUP(A406,ORÇAMENTO!$A$10:$L$59,7,1)","v":"M2"}]
[null,4011353,"PINTURA DE LIGAÇÃO COM EMULSÃO ASFÁLTICA RR-1C",{"$nulls":5},"Valores em reais (R$)"]
[null,"A - EQUIPAMENTOS",null,"Quantidade","Utilização",null,"Custo Horário",null,null,"Custo"]
[{"$nulls":4},"Operativa","Improdutiva","Produtivo","Improdutivo",null,"Horário Total"]
[null,"E9509","Caminhão tanque distribuidor de asfalto com capacidade de 6.000 l - 7 kW/136 kW",1,1,0,261.03050000000002,72.388300000000001,null,{"$f":"D413*(E413*G413+F413*H413)","v":261.03050000000002}]
[null,"E9558","Tanque de estocagem de asfalto com capacidade de 30.000 l",2,1,0,56.138500000000001,38.346699999999998,null,{"$f":"D414*(E414*G414+F414*H414)","v":112.277}]
[{"$nulls":7},"Custo horário total de equipamentos",null,{"$f":"SUM(J413:J414)","v":373.3075}]
[null,"B - MÃO DE OBRA",null,"Quantidade","Unidade",null,"Custo Horário","Custo Horário Total"]
[null,"P9824","Servente",2,"h",null,21.3355,null,null,{"$f":"D417*G417","v":42.670999999999999}]
[null,"-",{"$nulls":7},{"$f":"D418*G418","v":0}]
[null,null,null,"Custo horário total de mão de obra",{"$nulls":5},{"$f":"SUM(J417:J418)","v":42.670999999999999}]
[null,null,null,"Custo horário total de execução",{"$nulls":5},{"$f":"J415+J419","v":415.9785}]
[null,null,null,"Custo unitário de execução",{"$nulls":5},{"$f":"J420/I409","v":0.27731899999999998}]
[{"$nulls":7},"Custo do FIC",null,8.9999999999999998E-4]
[{"$nulls":7},"Custo do FIT",null,0]
[null,"C - MATERIAL",null,"Quantidade","Unidade",null,"Preço Unitário","Custo Unitário"]
[null,"M1946","Emulsão asfáltica - RR-1C",4.4999999999999999E-4,"t",null,0,"FORNECIMENTO COM BDI DIFERENCIADO",null,{"$f":"D425*G425","v":0}]
[null,"-",0,null,0,null,0,null,null,{"$f":"D426*G426","v":0}]
[null,null,null,"Custo unitário total de material",{"$nulls":5},{"$f":"SUM(J425:J426)","v":0}]
[null,"D - ATIVIDADES AUXILIARES",null,"Quantidade","Unidade",null,"Custo Unitário","Custo Unitário"]
[null,"-",0,0,0,null,0,null,null,{"$f":"D429*G429","v":0}]
[null,"-",0,0,0,null,0,null,null,{"$f":"D430*G430","v":0}]
[null,null,null,"Custo total de atividades auxiliares",{"$nulls":5},{"$f":"SUM(J429:J430)","v":0}]
[{"$nulls":7},"Subtotal",null,{"$f":"J421+J427+J431+J422+J423","v":0.27821899999999999}]
[null,"E - TEMPO FIXO",null,"Código","Quantidade","Unidade",null,"Custo Unitário","Custo Unitário"]
[null,"-",0,"-",0,"t",null,0,null,{"$f":"ROUNDDOWN(E434*H434,4)","v":0}]
[null,"-",0,"-",0,"t",null,0,null,{"$f":"ROUNDDOWN(E435*H435,4)","v":0}]
[null,null,null,"Custo unitário total de tempo fixo",{"$nulls":5},{"$f":"SUM(J434:J435)","v":0}]
[null,"F - MOMENTO DE TRANSPORTE",null,"Quantidade","Unidade","DMT",null,null,null,"Custo Unitário"]
[{"$nulls":5},"LN","RP","P"]
[null,"-",0,null,"tkm"]
[null,"-",0,null,"tkm"]
[null,null,null,"Custo unitário total de transporte"]
[{"$nulls":5},"Custo unitário direto total",null,null,null,{"$f":"TRUNC(J432+J436,2)","v":0.27}]
[null,"Obs."]
[]
[{"$f":"A406+1","v":14},"1ª/GRD",{"$nulls":8},{"$f":"J482","v":198.1}]
[null,"OBRA:"," PAVIMENTAÇÃO ASFÁLTICA EM CBUQ - ESTRADA PARA SANTANA DO MUNDO NOVO (JURAMENTO / MG)"]
[null,"Custo Unitário de Referência",null,null,"Minas Gerais"]
[{"$nulls":4}," Janeiro/2025",null,null,"Produção da equipe ",99.6,{"$f":"VLOOKUP(A445,ORÇAMENTO!$A$10:$L$59,7,1)","v":"T"}]
[null,4011463,"EXECUÇÃO DE PAVIMENTO COM APLICAÇÃO DE CONCRETO ASFÁLTICO USINADO A QUENTE (CBUQ), CAMADA DE ROLAMENTO - EXCLUSIVE TRANSPORTE",{"$nulls":5},"Valores em reais (R$)"]
[null,"A - EQUIPAMENTOS",null,"Quantidade","Utilização",null,"Custo Horário",null,null,"Custo"]
[{"$nulls":4},"Operativa","Improdutiva","Produtivo","Improdutivo",null,"Horário Total"]
[null,"E9762","Rolo compactador de pneus autopropelido de 27 t - 85 kW",1,0.71,0.28999999999999998,255.65049999999999,124.5621,null,{"$f":"D452*(E452*G452+F452*H452)","v":217.63486399999999}]
[null,"E9681","Rolo compactador liso tandem vibratório autopropelido de 10,4 t - 82 kW",1,0.82,0.18,296.77460000000002,113.3899,null,{"$f":"D453*(E453*G453+F453*H453)","v":263.765354}]
[null,"E9545","Vibroacabadora de asfalto sobre esteiras - 97 kW",1,1,0,359.27379999999999,154.22659999999999,null,{"$f":"D454*(E454*G454+F454*H454)","v":359.27379999999999}]
[{"$nulls":7},"Custo horário total de equipamentos",null,{"$f":"SUM(J452:J454)","v":840.67401799999993}]
[null,"B - MÃO DE OBRA",null,"Quantidade","Unidade",null,"Custo Horário","Custo Horário Total"]
[null,"P9824","Servente",8,"h",null,21.3355,null,null,{"$f":"D457*G457","v":170.684}]
[null,"-",0,null,0,null,0,null,null,{"$f":"D458*G458","v":0}]
[null,null,null,"Custo horário total de mão de obra",{"$nulls":5},{"$f":"SUM(J457:J458)","v":170.684}]
[null,null,null,"Custo horário total de execução",{"$nulls":5},{"$f":"J455+J459","v":1011.3580179999999}]
[null,null,null,"Custo unitário de execução",{"$nulls":5},{"$f":"J460/I448","v":10.154196967871485}]
[{"$nulls":7},"Custo do FIC",null,3.4500000000000003E-2]
[{"$nulls":7},"Custo do FIT",null,0]
[null,"C - MATERIAL",null,"Quantidade","Unidade",null,"Preço Unitário","Custo Unitário"]
[null,"-",0,null,0,null,0,null,null,{"$f":"D465*G465","v":0}]
[null,"-",0,null,0,null,0,null,null,{"$f":"D466*G466","v":0}]
[null,null,null,"Custo unitário total de material",{"$nulls":5},{"$f":"SUM(J465:J466)","v":0}]
[null,"D - ATIVIDADES AUXILIARES",null,"Quantidade","Unidade",null,"Custo Unitário","Custo Unitário"]
[null,6416078,"Usinagem de concreto asfáltico - faixa C-12,5 - areia e brita comerciais",1,"t",null,179.86599311976303,"CPU-AUXILIAR",null,{"$f":"D469*G469","v":179.86599311976303}]
[null,"-",0,0,0,null,0,null,null,{"$f":"D470*G470","v":0}]
[null,null,null,"Custo total de atividades auxiliares",{"$nulls":5},{"$f":"SUM(J469:J470)","v":179.86599311976303}]
[{"$nulls":7},"Subtotal",null,{"$f":"J461+J467+J471+J462+J463","v":190.05469008763453}]
[null,"E - TEMPO FIXO",null,"Código","Quantidade","Unidade",null,"Custo Unitário","Custo Unitário"]
[null,6416078,"Usinagem de concreto asfáltico - faixa C-12,5 - areia e brita comerciais",5914649,1,"t",null,8.0500000000000007,null,{"$f":"ROUNDDOWN(E474*H474,4)","v":8.0500000000000007}]
[null,"-",0,"-",0,"t",null,0,null,{"$f":"ROUNDDOWN(E475*H475,4)","v":0}]
[null,null,null,"Custo unitário total de tempo fixo",{"$nulls":5},{"$f":"SUM(J474:J475)","v":8.0500000000000007}]
[null,"F - MOMENTO DE TRANSPORTE",null,"Quantidade","Unidade","DMT",null,null,null,"Custo Unitário"]
[{"$nulls":5},"LN","RP","P"]
[null,6416078,"Usinagem de concreto asfáltico - faixa C-12,5 - areia e brita comerciais",1,"tkm"]
[null,"-",0,0,"tkm"]
[null,null,null,"Custo unitário total de transporte"]
[{"$nulls":5},"Custo unitário direto total",null,null,null,{"$f":"TRUNC(J472+J476,2)","v":198.1}]
[null,"Obs."]
[]
[null,"1ª/GRD",{"$nulls":8},{"$f":"J536","v":179.86599311976303}]
[null,"OBRA:"," PAVIMENTAÇÃO ASFÁLTICA EM CBUQ - ESTRADA PARA SANTANA DO MUNDO NOVO (JURAMENTO / MG)"]
[null,"Custo Unitário de Referência - Auxiliar",null,null,"Minas Gerais"]
[{"$nulls":4}," Janeiro/2025",null,null,"Produção da equipe ",99.6,"t"]
[null,6416078,"Usinagem de concreto asfáltico - faixa C - areia e brita comerciais",{"$nulls":5},"Valores em reais (R$)"]
[null,"A - EQUIPAMENTOS",null,"Quantidade","Utilização",null,"Custo Horário",null,null,"Custo"]
[{"$nulls":4},"Operativa","Improdutiva","Produtivo","Improdutivo",null,"Horário Total"]
[null,"E9559","Aquecedor de fluido térmico - 12 kW",1,1,0,70.491399999999999,40.1297,null,{"$f":"D492*(E492*G492+F492*H492)","v":70.491399999999999}]
[null,"E9584","Carregadeira de pneus com capacidade de 1,72 m³ - 113 kW",1,0.86,0.14000000000000001,207.59360000000001,103.7398,null,{"$f":"D493*(E493*G493+F493*H493)","v":193.054068}]
[null,"E9021","Grupo gerador - 456 kVA",1,1,0,415.94510000000002,22.186399999999999,null,415.94510000000002]
[null,"E9558","Tanque de estocagem de asfalto com capacidade de 30.000 l",2,1,0,56.138500000000001,38.346699999999998,null,112.277]
[null,"E9689","Usina de asfalto a quente gravimétrica com capacidade de 100/140 t/h - 260 kW",1,1,0,1239.9634000000001,657.78120000000001,null,{"$f":"D496*(E496*G496+F496*H496)","v":1239.9634000000001}]
[{"$nulls":7},"Custo horário total de equipamentos",null,{"$f":"SUM(J492:J496)","v":2031.7309680000003}]
[null,"B - MÃO DE OBRA",null,"Quantidade","Unidade",null,"Custo Horário","Custo Horário Total"]
[null,"P9824","Servente",4,"h",null,21.3355,null,null,{"$f":"D499*G499","v":85.341999999999999}]
[null,null,null,"Custo horário total de mão de obra",{"$nulls":5},{"$f":"SUM(J499:J499)","v":85.341999999999999}]
[null,null,null,"Custo horário total de execução",{"$nulls":5},{"$f":"J497+J500","v":2117.0729680000004}]
[null,null,null,"Custo unitário de execução",{"$nulls":5},{"$f":"J501/I488","v":21.255752690763057}]
[{"$nulls":7},"Custo do FIC",null,0]
[{"$nulls":7},"Custo do FIT",null,0]
[null,"C - MATERIAL",null,"Quantidade","Unidade",null,"Preço Unitário","Custo Unitário"]
[null,"M0028","Areia média",2.7009999999999999E-2,"m³",null,158.15639999999999,null,null,{"$f":"D506*G506","v":4.2718043639999994}]
[null,"M0005","Brita 0",9.0029999999999999E-2,"m³",null,116.2,null,null,{"$f":"D507*G507","v":10.461486000000001}]
[null,"M0191","Brita 1",3.2149999999999998E-2,"m³",null,116.2,null,null,3.73583]
[null,"M0344","Cal hidratada - a granel",14.4636,"kg",null,0.61650000000000005,null,null,8.9168094]
[null,"M1943","Cimento asfáltico de petróleo - CAP 50/70",5.5449999999999999E-2,"t",null,0,"FORNECIMENTO COM BDI DIFERENCIADO",null,0]
[null,"M1941","Óleo tipo A1",8,"l",null,6.3849,null,null,51.0792]
[null,"M1103","Pedrisco",0.1479,"m³",null,176.94059999999999,null,null,{"$f":"D512*G512","v":26.16951474}]
[null,"M1135","Pó de pedra",0.33631,"m³",null,154.5675,null,null,51.982595924999998]
[null,null,null,"Custo unitário total de material",{"$nulls":5},{"$f":"SUM(J506:J513)","v":156.61724042899999}]
[null,"D - ATIVIDADES AUXILIARES",null,"Quantidade","Unidade",null,"Custo Unitário","Custo Unitário"]
[null,"-",0,0,0,null,0,null,null,{"$f":"D516*G516","v":0}]
[null,null,null,"Custo total de atividades auxiliares",{"$nulls":5},{"$f":"SUM(J516:J516)","v":0}]
[{"$nulls":7},"Subtotal",null,{"$f":"J502+J514+J517+J503+J504","v":177.87299311976304}]
[null,"E - TEMPO FIXO",null,"Código","Quantidade","Unidade",null,"Custo Unitário","Custo Unitário"]
[null,"M0028","Areia média",5914647,4.052E-2,"t",null,1.83,null,{"$f":"ROUNDDOWN(E520*H520,4)","v":7.4099999999999999E-2}]
[null,"M0005","Brita 0",5914647,0.13505,"t",null,1.83,null,0.24709999999999999]
[null,"M0191","Brita 1",5914647,4.8230000000000002E-2,"t",null,1.83,null,8.8200000000000001E-2]
[null,"M0344","Cal hidratada - a granel",5914363,1.4460000000000001E-2,"t",null,17.61,null,0.25459999999999999]
[null,"M1103","Pedrisco",5914647,0.22184999999999999,"t",null,1.83,null,0.40589999999999998]
[null,"M1135","Pó de pedra",5914647,0.50446999999999997,"t",null,1.83,null,{"$f":"ROUNDDOWN(E525*H525,4)","v":0.92310000000000003}]
[null,null,null,"Custo unitário total de tempo fixo",{"$nulls":5},{"$f":"SUM(J520:J525)","v":1.9929999999999999}]
[null,"F - MOMENTO DE TRANSPORTE",null,"Quantidade","Unidade","DMT",null,null,null,"Custo Unitário"]
[{"$nulls":5},"LN","RP","P"]
[null,"M0028","Areia média",4.052E-2,"tkm"]
[null,"M0005","Brita 0",0.13505,"tkm"]
[null,"M0191","Brita 1",4.8230000000000002E-2,"tkm"]
[null,"M0344","Cal hidratada - a granel",1.4460000000000001E-2,"tkm"]
[null,"M1103","Pedrisco",0.22184999999999999,"tkm"]
[null,"M1135","Pó de pedra",0.50446999999999997,"tkm"]
[null,null,null,"Custo unitário total de transporte"]
[{"$nulls":5},"Custo unitário direto total",null,null,null,{"$f":"J518+J526","v":179.86599311976303}]
[null,"Obs."]
[]
[{"$f":"A445+1","v":15},"1ª/GRD",{"$nulls":8},{"$f":"J575","v":0.65}]
[null,"OBRA:"," PAVIMENTAÇÃO ASFÁLTICA EM CBUQ - ESTRADA PARA SANTANA DO MUNDO NOVO (JURAMENTO / MG)"]
[null,"Custo Unitário de Referência",null,null,"Minas Gerais"]
[{"$nulls":4}," Janeiro/2025",null,null,"Produção da equipe ",470.61,{"$f":"VLOOKUP(A539,ORÇAMENTO!$A$10:$L$59,7,1)","v":"TXKM"}]
[null,5915321,"TRANSPORTE COM CAMINHÃO BASCULANTE, EM VIA URBANA PAVIMENTADA",{"$nulls":5},"Valores em reais (R$)"]
[null,"A - EQUIPAMENTOS",null,"Quantidade","Utilização",null,"Custo Horário",null,null,"Custo"]
[{"$nulls":4},"Operativa","Improdutiva","Produtivo","Improdutivo",null,"Horário Total"]
[null,"E9667","Caminhão basculante com capacidade de 14 m³ - 210 kW",1,1,0,309.83940000000001,90.412199999999999,null,{"$f":"D546*(E546*G546+F546*H546)","v":309.83940000000001}]
[null,"-",0,null,null,null,0,0,null,{"$f":"D547*(E547*G547+F547*H547)","v":0}]
[{"$nulls":7},"Custo horário total de equipamentos",null,{"$f":"SUM(J546:J547)","v":309.83940000000001}]
[null,"B - MÃO DE OBRA",null,"Quantidade","Unidade",null,"Custo Horário","Custo Horário Total"]
[null,"-",0,null,0,null,0,null,null,{"$f":"D550*G550","v":0}]
[null,"-",0,null,0,null,0,null,null,{"$f":"D551*G551","v":0}]
[null,null,null,"Custo horário total de mão de obra",{"$nulls":5},{"$f":"SUM(J550:J551)","v":0}]
[null,null,null,"Custo horário total de execução",{"$nulls":5},{"$f":"J548+J552","v":309.83940000000001}]
[null,null,null,"Custo unitário de execução",{"$nulls":5},{"$f":"J553/I542","v":0.65837827500478108}]
[{"$nulls":7},"Custo do FIC",null,0]
[{"$nulls":7},"Custo do FIT",null,0]
[null,"C - MATERIAL",null,"Quantidade","Unidade",null,"Preço Unitário","Custo Unitário"]
[null,"-",0,0,0,null,0,null,null,{"$f":"D558*G558","v":0}]
[null,"-",0,0,0,null,0,null,null,{"$f":"D559*G559","v":0}]
[null,null,null,"Custo unitário total de material",{"$nulls":5},{"$f":"SUM(J558:J559)","v":0}]
[null,"D - ATIVIDADES AUXILIARES",null,"Quantidade","Unidade",null,"Custo Unitário","Custo Unitário"]
[null,"-",0,0,0,null,0,null,null,{"$f":"D562*G562","v":0}]
[null,"-",0,0,0,null,0,null,null,{"$f":"D563*G563","v":0}]
[null,null,null,"Custo total de atividades auxiliares",{"$nulls":5},{"$f":"SUM(J562:J563)","v":0}]
[{"$nulls":7},"Subtotal",null,{"$f":"J554+J560+J564+J555+J556","v":0.65837827500478108}]
[null,"E - TEMPO FIXO",null,"Código","Quantidade","Unidade",null,"Custo Unitário","Custo Unitário"]
[null,"-",0,"-",0,"t",null,0,null,{"$f":"ROUNDDOWN(E567*H567,4)","v":0}]
[null,"-",0,"-",0,"t",null,0,null,{"$f":"ROUNDDOWN(E568*H568,4)","v":0}]
[null,null,null,"Custo unitário total de tempo fixo",{"$nulls":5},{"$f":"SUM(J567:J568)","v":0}]
[null,"F - MOMENTO DE TRANSPORTE",null,"Quantidade","Unidade","DMT",null,null,null,"Custo Unitário"]
[{"$nulls":5},"LN","RP","P"]
[null,"-",0,0,"tkm"]
[null,"-",0,0,"tkm"]
[null,null,null,"Custo unitário total de transporte"]
[{"$nulls":5},"Custo unitário direto total",null,null,null,{"$f":"TRUNC(J565+J569,2)","v":0.65}]
[null,"Obs."]
[]
[{"$f":"A539+1","v":16},"1ª/GRD",{"$nulls":8},{"$f":"J614","v":0.74}]
[null,"OBRA:"," PAVIMENTAÇÃO ASFÁLTICA EM CBUQ - ESTRADA PARA SANTANA DO MUNDO NOVO (JURAMENTO / MG)"]
[null,"Custo Unitário de Referência",null,null,"Minas Gerais"]
[{"$nulls":4}," Janeiro/2025",null,null,"Produção da equipe ",241.03,{"$f":"VLOOKUP(A578,ORÇAMENTO!$A$10:$L$59,7,1)","v":"TXKM"}]
[null,5914434,"TRANSPORTE COM CAMINHÃO CARROCERIA 9T, EM VIA URBANA PAVIMENTADA",{"$nulls":5},"Valores em reais (R$)"]
[null,"A - EQUIPAMENTOS",null,"Quantidade","Utilização",null,"Custo Horário",null,null,"Custo"]
[{"$nulls":4},"Operativa","Improdutiva","Produtivo","Improdutivo",null,"Horário Total"]
[null,"E9508","Caminhão carroceria com capacidade de 9 t - 136 kW",1,1,0,178.82759999999999,67.927099999999996,null,{"$f":"D585*(E585*G585+F585*H585)","v":178.82759999999999}]
[null,"-",0,null,null,null,0,0,null,{"$f":"D586*(E586*G586+F586*H586)","v":0}]
[{"$nulls":7},"Custo horário total de equipamentos",null,{"$f":"SUM(J585:J586)","v":178.82759999999999}]
[null,"B - MÃO DE OBRA",null,"Quantidade","Unidade",null,"Custo Horário","Custo Horário Total"]
[null,"-",0,0,0,null,0,null,null,{"$f":"D589*G589","v":0}]
[null,"-",0,0,0,null,0,null,null,{"$f":"D590*G590","v":0}]
[null,null,null,"Custo horário total de mão de obra",{"$nulls":5},{"$f":"SUM(J589:J590)","v":0}]
[null,null,null,"Custo horário total de execução",{"$nulls":5},{"$f":"J587+J591","v":178.82759999999999}]
[null,null,null,"Custo unitário de execução",{"$nulls":5},{"$f":"J592/I581","v":0.7419308799734472}]
[{"$nulls":7},"Custo do FIC",null,0]
[{"$nulls":7},"Custo do FIT",null,0]
[null,"C - MATERIAL",null,"Quantidade","Unidade",null,"Preço Unitário","Custo Unitário"]
[null,"-",0,0,0,null,0,null,null,{"$f":"D597*G597","v":0}]
[null,"-",0,0,0,null,0,null,null,{"$f":"D598*G598","v":0}]
[null,null,null,"Custo unitário total de material",{"$nulls":5},{"$f":"SUM(J597:J598)","v":0}]
[null,"D - ATIVIDADES AUXILIARES",null,"Quantidade","Unidade",null,"Custo Unitário","Custo Unitário"]
[null,"-",0,0,0,null,0,null,null,{"$f":"D601*G601","v":0}]
[null,"-",0,0,0,null,0,null,null,{"$f":"D602*G602","v":0}]
[null,null,null,"Custo total de atividades auxiliares",{"$nulls":5},{"$f":"SUM(J601:J602)","v":0}]
[{"$nulls":7},"Subtotal",null,{"$f":"J593+J599+J603+J594+J595","v":0.7419308799734472}]
[null,"E - TEMPO FIXO",null,"Código","Quantidade","Unidade",null,"Custo Unitário","Custo Unitário"]
[null,"-",0,"-",0,"t",null,0,null,{"$f":"ROUNDDOWN(E606*H606,4)","v":0}]
[null,"-",0,"-",0,"t",null,0,null,{"$f":"ROUNDDOWN(E607*H607,4)","v":0}]
[null,null,null,"Custo unitário total de tempo fixo",{"$nulls":5},{"$f":"SUM(J606:J607)","v":0}]
[null,"F - MOMENTO DE TRANSPORTE",null,"Quantidade","Unidade","DMT",null,null,null,"Custo Unitário"]
[{"$nulls":5},"LN","RP","P"]
[null,"-",0,0,"tkm"]
[null,"-",0,0,"tkm"]
[null,null,null,"Custo unitário total de transporte"]
[{"$nulls":5},"Custo unitário direto total",null,null,null,{"$f":"TRUNC(J604+J608,2)","v":0.74}]
[null,"Obs."]
[]
[{"$f":"A578+1","v":17},"1ª/GRD",{"$nulls":8},{"$f":"J653","v":1.18}]
[null,"OBRA:"," PAVIMENTAÇÃO ASFÁLTICA EM CBUQ - ESTRADA PARA SANTANA DO MUNDO NOVO (JURAMENTO / MG)"]
[null,"Custo Unitário de Referência",null,null,"Minas Gerais"]
[{"$nulls":4}," Janeiro/2025",null,null,"Produção da equipe ",224.1,{"$f":"VLOOKUP(A617,ORÇAMENTO!$A$10:$L$59,7,1)","v":"TXKM"}]
[null,5914612,"TRANSPORTE DE MASSA ASFÁLTICA COM CAMINHÃO BASCULANTE, EM VIA URBANA PAVIMENTADA ",{"$nulls":5},"Valores em reais (R$)"]
[null,"A - EQUIPAMENTOS",null,"Quantidade","Utilização",null,"Custo Horário",null,null,"Custo"]
[{"$nulls":4},"Operativa","Improdutiva","Produtivo","Improdutivo",null,"Horário Total"]
[null,"E9520","Caminhão com caçamba térmica com capacidade de 6 m³ - 188 kW",1,1,0,265.74349999999998,76.6511,null,{"$f":"D624*(E624*G624+F624*H624)","v":265.74349999999998}]
[null,"-",0,null,null,null,0,0,null,{"$f":"D625*(E625*G625+F625*H625)","v":0}]
[{"$nulls":7},"Custo horário total de equipamentos",null,{"$f":"SUM(J624:J625)","v":265.74349999999998}]
[null,"B - MÃO DE OBRA",null,"Quantidade","Unidade",null,"Custo Horário","Custo Horário Total"]
[null,"-",0,0,0,null,0,null,null,{"$f":"D628*G628","v":0}]
[null,"-",0,0,0,null,0,null,null,{"$f":"D629*G629","v":0}]
[null,null,null,"Custo horário total de mão de obra",{"$nulls":5},{"$f":"SUM(J628:J629)","v":0}]
[null,null,null,"Custo horário total de execução",{"$nulls":5},{"$f":"J626+J630","v":265.74349999999998}]
[null,null,null,"Custo unitário de execução",{"$nulls":5},{"$f":"J631/I620","v":1.1858255243195002}]
[{"$nulls":7},"Custo do FIC",null,0]
[{"$nulls":7},"Custo do FIT",null,0]
[null,"C - MATERIAL",null,"Quantidade","Unidade",null,"Preço Unitário","Custo Unitário"]
[null,"-",0,0,0,null,0,null,null,{"$f":"D636*G636","v":0}]
[null,"-",0,0,0,null,0,null,null,{"$f":"D637*G637","v":0}]
[null,null,null,"Custo unitário total de material",{"$nulls":5},{"$f":"SUM(J636:J637)","v":0}]
[null,"D - ATIVIDADES AUXILIARES",null,"Quantidade","Unidade",null,"Custo Unitário","Custo Unitário"]
[null,"-",0,0,0,null,0,null,null,{"$f":"D640*G640","v":0}]
[null,"-",0,0,0,null,0,null,null,{"$f":"D641*G641","v":0}]
[null,null,null,"Custo total de atividades auxiliares",{"$nulls":5},{"$f":"SUM(J640:J641)","v":0}]
[{"$nulls":7},"Subtotal",null,{"$f":"J632+J638+J642+J633+J634","v":1.1858255243195002}]
[null,"E - TEMPO FIXO",null,"Código","Quantidade","Unidade",null,"Custo Unitário","Custo Unitário"]
[null,"-",0,"-",0,"t",null,0,null,{"$f":"ROUNDDOWN(E645*H645,4)","v":0}]
[null,"-",0,"-",0,"t",null,0,null,{"$f":"ROUNDDOWN(E646*H646,4)","v":0}]
[null,null,null,"Custo unitário total de tempo fixo",{"$nulls":5},{"$f":"SUM(J645:J646)","v":0}]
[null,"F - MOMENTO DE TRANSPORTE",null,"Quantidade","Unidade","DMT",null,null,null,"Custo Unitário"]
[{"$nulls":5},"LN","RP","P"]
[null,"-",0,0,"tkm"]
[null,"-",0,0,"tkm"]
[null,null,null,"Custo unitário total de transporte"]
[{"$nulls":5},"Custo unitário direto total",null,null,null,{"$f":"TRUNC(J643+J647,2)","v":1.18}]
[null,"Obs."]
[]
[{"$f":"A617+1","v":18},"1ª/GRD",{"$nulls":8},{"$f":"J692","v":1.74}]
[null,"OBRA:"," PAVIMENTAÇÃO ASFÁLTICA EM CBUQ - ESTRADA PARA SANTANA DO MUNDO NOVO (JURAMENTO / MG)"]
[null,"Custo Unitário de Referência",null,null,"Minas Gerais"]
[{"$nulls":4}," Janeiro/2025",null,null,"Produção da equipe ",149.4,{"$f":"VLOOKUP(A656,ORÇAMENTO!$A$10:$L$59,7,1)","v":"TXKM"}]
[null,5914622,"TRANSPORTE COM CAMINHÃO TANQUE DE TRANSPORTE DE MATERIAL ASFÁLTICO DE 30000 L, EM VIA URBANA PAVIMENTADA ",{"$nulls":5},"Valores em reais (R$)"]
[null,"A - EQUIPAMENTOS",null,"Quantidade","Utilização",null,"Custo Horário",null,null,"Custo"]
[{"$nulls":4},"Operativa","Improdutiva","Produtivo","Improdutivo",null,"Horário Total"]
[null,"E9509","Caminhão tanque distribuidor de asfalto com capacidade de 6.000 l - 7 kW/136 kW",1,1,0,261.03050000000002,72.388300000000001,null,{"$f":"D663*(E663*G663+F663*H663)","v":261.03050000000002}]
[null,"-",0,null,null,null,0,0,null,{"$f":"D664*(E664*G664+F664*H664)","v":0}]
[{"$nulls":7},"Custo horário total de equipamentos",null,{"$f":"SUM(J663:J664)","v":261.03050000000002}]
[null,"B - MÃO DE OBRA",null,"Quantidade","Unidade",null,"Custo Horário","Custo Horário Total"]
[null,"-",0,0,0,null,0,null,null,{"$f":"D667*G667","v":0}]
[null,"-",0,0,0,null,0,null,null,{"$f":"D668*G668","v":0}]
[null,null,null,"Custo horário total de mão de obra",{"$nulls":5},{"$f":"SUM(J667:J668)","v":0}]
[null,null,null,"Custo horário total de execução",{"$nulls":5},{"$f":"J665+J669","v":261.03050000000002}]
[null,null,null,"Custo unitário de execução",{"$nulls":5},{"$f":"J670/I659","v":1.7471921017402945}]
[{"$nulls":7},"Custo do FIC",null,0]
[{"$nulls":7},"Custo do FIT",null,0]
[null,"C - MATERIAL",null,"Quantidade","Unidade",null,"Preço Unitário","Custo Unitário"]
[null,"-",0,996,0,null,0,null,null,{"$f":"D675*G675","v":0}]
[null,"-",0,89.28,0,null,0,null,null,{"$f":"D676*G676","v":0}]
[null,null,null,"Custo unitário total de material",{"$nulls":5},{"$f":"SUM(J675:J676)","v":0}]
[null,"D - ATIVIDADES AUXILIARES",null,"Quantidade","Unidade",null,"Custo Unitário","Custo Unitário"]
[null,"-",0,0,0,null,0,null,null,{"$f":"D679*G679","v":0}]
[null,"-",0,0,0,null,0,null,null,{"$f":"D680*G680","v":0}]
[null,null,null,"Custo total de atividades auxiliares",{"$nulls":5},{"$f":"SUM(J679:J680)","v":0}]
[{"$nulls":7},"Subtotal",null,{"$f":"J671+J677+J681+J672+J673","v":1.7471921017402945}]
[null,"E - TEMPO FIXO",null,"Código","Quantidade","Unidade",null,"Custo Unitário","Custo Unitário"]
[null,"-",0,"-",0,"t",null,0,null,{"$f":"ROUNDDOWN(E684*H684,4)","v":0}]
[null,"-",0,"-",0,"t",null,0,null,{"$f":"ROUNDDOWN(E685*H685,4)","v":0}]
[null,null,null,"Custo unitário total de tempo fixo",{"$nulls":5},{"$f":"SUM(J684:J685)","v":0}]
[null,"F - MOMENTO DE TRANSPORTE",null,"Quantidade","Unidade","DMT",null,null,null,"Custo Unitário"]
[{"$nulls":5},"LN","RP","P"]
[null,"-",0,0,"tkm"]
[null,"-",0,0,"tkm"]
[null,null,null,"Custo unitário total de transporte"]
[{"$nulls":5},"Custo unitário direto total",null,null,null,{"$f":"TRUNC(J682+J686,2)","v":1.74}]
[null,"Obs."]
[]
[{"$f":"A656+1","v":19},"1ª/GRD",{"$nulls":8},{"$f":"J731","v":49.2}]
[null,"OBRA:"," PAVIMENTAÇÃO ASFÁLTICA EM CBUQ - ESTRADA PARA SANTANA DO MUNDO NOVO (JURAMENTO / MG)"]
[null,"Custo Unitário de Referência",null,null,"Minas Gerais"]
[{"$nulls":4}," Janeiro/2025",null,null,"Produção da equipe ",1,{"$f":"VLOOKUP(A695,ORÇAMENTO!$A$10:$L$59,7,1)","v":"M"}]
[null,94273,"ASSENTAMENTO DE GUIA (MEIO-FIO) PRÉ-MOLDADO DE CONCRETO - 100X15X13X30 CM (COMPRIMENTO X BASE INFERIOR X BASE SUPERIOR X ALTURA) - USO VIÁRIO",{"$nulls":5},"Valores em reais (R$)"]
[null,"A - EQUIPAMENTOS",null,"Quantidade","Utilização",null,"Custo Horário",null,null,"Custo"]
[{"$nulls":4},"Operativa","Improdutiva","Produtivo","Improdutivo",null,"Horário Total"]
[null,"-",0,1,1,0,0,0,null,{"$f":"D702*(E702*G702+F702*H702)","v":0}]
[null,"-",0,null,null,null,0,0,null,{"$f":"D703*(E703*G703+F703*H703)","v":0}]
[{"$nulls":7},"Custo horário total de equipamentos",null,{"$f":"SUM(J702:J703)","v":0}]
[null,"B - MÃO DE OBRA",null,"Quantidade","Unidade",null,"Custo Horário","Custo Horário Total"]
[null,"P9824","Servente",0.2296,"h",null,21.3355,null,null,{"$f":"D706*G706","v":4.8986308000000003}]
[null,"P9821","Pedreiro",0.2296,"h",null,26.6785,null,null,{"$f":"D707*G707","v":6.1253836000000002}]
[null,null,null,"Custo horário total de mão de obra",{"$nulls":5},{"$f":"SUM(J706:J707)","v":11.0240144}]
[null,null,null,"Custo horário total de execução",{"$nulls":5},{"$f":"J704+J708","v":11.0240144}]
[null,null,null,"Custo unitário de execução",{"$nulls":5},{"$f":"J709/I698","v":11.0240144}]
[{"$nulls":7},"Custo do FIC",null,0]
[{"$nulls":7},"Custo do FIT",null,0]
[null,"C - MATERIAL",null,"Quantidade","Unidade",null,"Preço Unitário","Custo Unitário"]
[null,"M0082","Areia média lavada",6.6E-3,"m³",null,164.1893,null,null,{"$f":"D714*G714","v":1.08364938}]
[null,4059,"Meio-fio ou guia de concreto, pré-moldado, comp.1,0m x 30 x 12/15 cm (H X L1/L2)",1.0049999999999999,"m",null,36,null,null,36.179999999999993]
[null,null,null,"Custo unitário total de material",{"$nulls":5},{"$f":"SUM(J714:J715)","v":37.26364937999999}]
[null,"D - ATIVIDADES AUXILIARES",null,"Quantidade","Unidade",null,"Custo Unitário","Custo Unitário"]
[null,1109669,"Argamassa de cimento e areia 1:3 - confecção em betoneira e lançamento manual - areia comercial",1.8E-3,"m³",null,507.26,null,null,{"$f":"D718*G718","v":0.91306799999999999}]
[null,"-",0,0,0,null,0,null,null,{"$f":"D719*G719","v":0}]
[null,null,null,"Custo total de atividades auxiliares",{"$nulls":5},{"$f":"SUM(J718:J719)","v":0.91306799999999999}]
[{"$nulls":7},"Subtotal",null,{"$f":"J710+J716+J720+J711+J712","v":49.200731779999991}]
[null,"E - TEMPO FIXO",null,"Código","Quantidade","Unidade",null,"Custo Unitário","Custo Unitário"]
[null,"-",0,"-",null,"t",null,0,null,{"$f":"ROUNDDOWN(E723*H723,4)","v":0}]
[null,"-",0,"-",null,"t",null,0,null,{"$f":"ROUNDDOWN(E724*H724,4)","v":0}]
[null,null,null,"Custo unitário total de tempo fixo",{"$nulls":5},{"$f":"SUM(J723:J724)","v":0}]
[null,"F - MOMENTO DE TRANSPORTE",null,"Quantidade","Unidade","DMT",null,null,null,"Custo Unitário"]
[{"$nulls":5},"LN","RP","P"]
[null,"-",0,0,"tkm","5914449","5914464","5914479"]
[null,"-",0,0,"tkm"]
[null,null,null,"Custo unitário total de transporte"]
[{"$nulls":5},"Custo unitário direto total",null,null,null,{"$f":"TRUNC(J721+J725,2)","v":49.2}]
[null,"Obs."]
[]
[{"$f":"A695+1","v":20},"1ª/GRD",{"$nulls":8},{"$f":"J772","v":22.2}]
[null,"OBRA:"," PAVIMENTAÇÃO ASFÁLTICA EM CBUQ - ESTRADA PARA SANTANA DO MUNDO NOVO (JURAMENTO / MG)"]
[null,"Custo Unitário de Referência",null,null,"Minas Gerais"]
[{"$nulls":4}," Janeiro/2025",null,null,"Produção da equipe ",1,{"$f":"VLOOKUP(A734,ORÇAMENTO!$A$10:$L$59,7,1)","v":"M"}]
[null,94287,"EXECUÇÃO DE SARJETA EM CONCRETO USINADO, MOLDADO IN LOCO - 30CM DE BASE X 5CM DE ALTURA",{"$nulls":5},"Valores em reais (R$)"]
[null,"A - EQUIPAMENTOS",null,"Quantidade","Utilização",null,"Custo Horário",null,null,"Custo"]
[{"$nulls":4},"Operativa","Improdutiva","Produtivo","Improdutivo",null,"Horário Total"]
[null,"-",0,null,null,null,0,0,null,{"$f":"D741*(E741*G741+F741*H741)","v":0}]
[null,"-",0,null,null,null,0,0,null,{"$f":"D742*(E742*G742+F742*H742)","v":0}]
[{"$nulls":7},"Custo horário total de equipamentos",null,{"$f":"SUM(J741:J742)","v":0}]
[null,"B - MÃO DE OBRA",null,"Quantidade","Unidade",null,"Custo Horário","Custo Horário Total"]
[null,"P9821","Pedreiro",0.2326,"h",null,26.6785,null,null,{"$f":"D745*G745","v":6.2054191000000003}]
[null,"P9824","Servente",0.2326,"h",null,21.3355,null,null,{"$f":"D746*G746","v":4.9626372999999999}]
[null,null,null,"Custo horário total de mão de obra",{"$nulls":5},{"$f":"SUM(J745:J746)","v":11.168056400000001}]
[null,null,null,"Custo horário total de execução",{"$nulls":5},{"$f":"J743+J747","v":11.168056400000001}]
[null,null,null,"Custo unitário de execução",{"$nulls":5},{"$f":"J748/I737","v":11.168056400000001}]
[{"$nulls":7},"Custo do FIC",null,0]
[{"$nulls":7},"Custo do FIT",null,0]
[null,"C - MATERIAL",null,"Quantidade","Unidade",null,"Preço Unitário","Custo Unitário"]
[null,"M0082","Areia média lavada",9.9000000000000008E-3,"m³",null,164.1893,null,null,{"$f":"D753*G753","v":1.6254740700000001}]
[null,"M0286","Tábua - E = 2,5 cm e L = 30 cm",8.3299999999999999E-2,"m",null,15.537800000000001,null,null,{"$f":"D754*G754","v":1.2942987400000001}]
[null,"M0451","Concreto usinado - fck = 20 MPa (comercial)",1.4999999999999999E-2,"m³",null,502.1,null,null,7.5315000000000003]
[null,"M1358","Sarrafo em madeira de terceira - E = 2,5 cm e L = 5 cm",0.3,"m",null,1.9665999999999999,null,null,0.58997999999999995]
[null,null,null,"Custo unitário total de material",{"$nulls":5},{"$f":"SUM(J753:J756)","v":11.041252810000001}]
[null,"D - ATIVIDADES AUXILIARES",null,"Quantidade","Unidade",null,"Custo Unitário","Custo Unitário"]
[null,"-",0,0,0,null,0,null,null,{"$f":"D759*G759","v":0}]
[null,"-",0,0,0,null,0,null,null,{"$f":"D760*G760","v":0}]
[null,null,null,"Custo total de atividades auxiliares",{"$nulls":5},{"$f":"SUM(J759:J760)","v":0}]
[{"$nulls":7},"Subtotal",null,{"$f":"J749+J757+J761+J750+J751","v":22.209309210000001}]
[null,"E - TEMPO FIXO",null,"Código","Quantidade","Unidade",null,"Custo Unitário","Custo Unitário"]
[null,"-",0,"-",0,"t",null,0,null,{"$f":"ROUNDDOWN(E764*H764,4)","v":0}]
[null,"-",0,"-",0,"t",null,0,null,{"$f":"ROUNDDOWN(E765*H765,4)","v":0}]
[null,null,null,"Custo unitário total de tempo fixo",{"$nulls":5},{"$f":"SUM(J764:J765)","v":0}]
[null,"F - MOMENTO DE TRANSPORTE",null,"Quantidade","Unidade","DMT",null,null,null,"Custo Unitário"]
[{"$nulls":5},"LN","RP","P"]
[null,"-",0,0,"tkm"]
[null,"-",0,0,"tkm"]
[null,null,null,"Custo unitário total de transporte"]
[{"$nulls":5},"Custo unitário direto total",null,null,null,{"$f":"TRUNC(J762+J766,2)","v":22.2}]
[null,"Obs."]
[]
[{"$f":"A734+1","v":21},"1ª/GRD",{"$nulls":8},{"$f":"J813","v":1.86}]
[null,"OBRA:"," PAVIMENTAÇÃO ASFÁLTICA EM CBUQ - ESTRADA PARA SANTANA DO MUNDO NOVO (JURAMENTO / MG)"]
[null,"Custo Unitário de Referência",null,null,"Minas Gerais"]
[{"$nulls":4}," Janeiro/2025",null,null,"Produção da equipe ",155.59,{"$f":"VLOOKUP(A775,ORÇAMENTO!$A$10:$L$59,7,1)","v":"M2"}]
[null,4915724,"CAIAÇÃO COM FIXADOR DE CAL",{"$nulls":5},"Valores em reais (R$)"]
[null,"A - EQUIPAMENTOS",null,"Quantidade","Utilização",null,"Custo Horário",null,null,"Custo"]
[{"$nulls":4},"Operativa","Improdutiva","Produtivo","Improdutivo",null,"Horário Total"]
[null,"E9256","Equipamento para pintura com cal rebocável com dois bicos aplicadores e capacidade de 2.200 l",1,1,0,33.162300000000002,29.625,null,{"$f":"D782*(E782*G782+F782*H782)","v":33.162300000000002}]
[null,"E9156","Soprador de ar costal - 2,6 kW",1,1,0,5.5557999999999996,0.4864,null,{"$f":"D783*(E783*G783+F783*H783)","v":5.5557999999999996}]
[null,"E9577","Trator agrícola sobre pneus - 77 kW",1,1,0,152.69229999999999,55.394399999999997,null,{"$f":"D784*(E784*G784+F784*H784)","v":152.69229999999999}]
[{"$nulls":7},"Custo horário total de equipamentos",null,{"$f":"SUM(J782:J784)","v":191.41039999999998}]
[null,"B - MÃO DE OBRA",null,"Quantidade","Unidade",null,"Custo Horário","Custo Horário Total"]
[null,"P9824","Servente",2,"h",null,21.3355,null,null,{"$f":"D787*G787","v":42.670999999999999}]
[null,"-",0,0,0,null,0,null,null,{"$f":"D788*G788","v":0}]
[null,null,null,"Custo horário total de mão de obra",{"$nulls":5},{"$f":"SUM(J787:J788)","v":42.670999999999999}]
[null,null,null,"Custo horário total de execução",{"$nulls":5},{"$f":"J785+J789","v":234.08139999999997}]
[null,null,null,"Custo unitário de execução",{"$nulls":5},{"$f":"J790/I778","v":1.5044758660582298}]
[{"$nulls":7},"Custo do FIC",null,"-"]
[{"$nulls":7},"Custo do FIT",null,"-"]
[null,"C - MATERIAL",null,"Quantidade","Unidade",null,"Preço Unitário","Custo Unitário"]
[null,"M0345","Cal hidratada - saco",0.41654999999999998,"kg",null,0.66579999999999995,null,null,{"$f":"D795*G795","v":0.27733898999999995}]
[null,"M0729","Fixador de cal para pintura",6.8999999999999997E-4,"l",null,4.0522,null,null,{"$f":"D796*G796","v":2.7960179999999999E-3}]
[null,"M0043","Óleo diesel",1.389E-2,"l",null,5.5088999999999997,null,null,7.6518620999999995E-2]
[null,null,null,"Custo unitário total de material",{"$nulls":5},{"$f":"SUM(J795:J797)","v":0.35665362899999997}]
[null,"D - ATIVIDADES AUXILIARES",null,"Quantidade","Unidade",null,"Custo Unitário","Custo Unitário"]
[null,"-",0,0,0,null,0,null,null,{"$f":"D800*G800","v":0}]
[null,"-",0,0,0,null,0,null,null,{"$f":"D801*G801","v":0}]
[null,null,null,"Custo total de atividades auxiliares",{"$nulls":5},{"$f":"SUM(J800:J801)","v":0}]
[{"$nulls":7},"Subtotal",null,{"$f":"J791+J798+J802","v":1.8611294950582298}]
[null,"E - TEMPO FIXO",null,"Código","Quantidade","Unidade",null,"Custo Unitário","Custo Unitário"]
[null,"-",0,"-",0,"t",null,0,null,{"$f":"ROUNDDOWN(E805*H805,4)","v":0}]
[null,"-",0,"-",0,"t",null,0,null,{"$f":"ROUNDDOWN(E806*H806,4)","v":0}]
[null,null,null,"Custo unitário total de tempo fixo",{"$nulls":5},{"$f":"SUM(J805:J806)","v":0}]
[null,"F - MOMENTO DE TRANSPORTE",null,"Quantidade","Unidade","DMT",null,null,null,"Custo Unitário"]
[{"$nulls":5},"LN","RP","P"]
[null,"-",0,0,"tkm"]
[null,"-",0,0,"tkm"]
[null,null,null,"Custo unitário total de transporte"]
[{"$nulls":5},"Custo unitário direto total",null,null,null,{"$f":"TRUNC(J803+J807,2)","v":1.86}]
[null,"Obs."]
[]
[{"$f":"A775+1","v":22},"1ª/GRD",{"$nulls":8},{"$f":"J854","v":192.82}]
[null,"OBRA:"," PAVIMENTAÇÃO ASFÁLTICA EM CBUQ - ESTRADA PARA SANTANA DO MUNDO NOVO (JURAMENTO / MG)"]
[null,"Custo Unitário de Referência",null,null,"Minas Gerais"]
[{"$nulls":4}," Janeiro/2025",null,null,"Produção da equipe ",1,{"$f":"VLOOKUP(A816,ORÇAMENTO!$A$10:$L$59,7,1)","v":"UNID."}]
[null,2003103,"ENTRADA PARA DESCIDA D'ÁGUA - EDA 01 - AREIA E BRITA COMERCIAIS",{"$nulls":5},"Valores em reais (R$)"]
[null,"A - EQUIPAMENTOS",null,"Quantidade","Utilização",null,"Custo Horário",null,null,"Custo"]
[{"$nulls":4},"Operativa","Improdutiva","Produtivo","Improdutivo",null,"Horário Total"]
[null,"-",0,null,null,null,0,0,null,{"$f":"D823*(E823*G823+F823*H823)","v":0}]
[null,"-",0,null,null,null,0,0,null,{"$f":"D824*(E824*G824+F824*H824)","v":0}]
[{"$nulls":7},"Custo horário total de equipamentos",null,{"$f":"SUM(J823:J824)","v":0}]
[null,"B - MÃO DE OBRA",null,"Quantidade","Unidade",null,"Custo Horário","Custo Horário Total"]
[null,"-",0,null,0,null,0,null,null,{"$f":"D827*G827","v":0}]
[{"$nulls":9},{"$f":"D828*G828","v":0}]
[null,null,null,"Custo horário total de mão de obra",{"$nulls":5},{"$f":"SUM(J827:J828)","v":0}]
[null,null,null,"Custo horário total de execução",{"$nulls":5},{"$f":"J825+J829","v":0}]
[null,null,null,"Custo unitário de execução",{"$nulls":5},{"$f":"J830/I819","v":0}]
[{"$nulls":7},"Custo do FIC",null,0]
[{"$nulls":7},"Custo do FIT",null,0]
[null,"C - MATERIAL",null,"Quantidade","Unidade",null,"Preço Unitário","Custo Unitário"]
[null,"-",0,null,0,null,0,null,null,{"$f":"D835*G835","v":0}]
[null,"-",0,null,0,null,0,null,null,0]
[null,null,null,"Custo unitário total de material",{"$nulls":5},{"$f":"SUM(J835:J836)","v":0}]
[null,"D - ATIVIDADES AUXILIARES",null,"Quantidade","Unidade",null,"Custo Unitário","Custo Unitário"]
[null,4805756,"Apiloamento manual de superfície com espessura de 15 cm",1.2107000000000001,"m²",null,4.8,null,null,{"$f":"D839*G839","v":5.8113600000000005}]
[null,1107892,"Concreto fck = 20 MPa - confecção em betoneira e lançamento manual - areia e brita comerciais",0.17910000000000001,"m³",null,483.94,null,null,{"$f":"D840*G840","v":86.673653999999999}]
[null,4805750,"Escavação manual em material de 1ª categoria na profundidade de até 1 m",0.1211,"m³",null,43.54,null,null,5.2726939999999995]
[null,3103302,"Fôrmas de tábuas de pinho para dispositivos de drenagem - utilização de 3 vezes - confecção, instalação e retirada",1.2862,"m²",null,73.91,null,null,{"$f":"D842*G842","v":95.063041999999996}]
[null,null,null,"Custo total de atividades auxiliares",{"$nulls":5},{"$f":"SUM(J839:J842)","v":192.82075}]
[{"$nulls":7},"Subtotal",null,{"$f":"J831+J837+J843+J832+J833","v":192.82075}]
[null,"E - TEMPO FIXO",null,"Código","Quantidade","Unidade",null,"Custo Unitário","Custo Unitário"]
[null,"-",0,"-",0,"t",null,0,null,{"$f":"ROUNDDOWN(E846*H846,4)","v":0}]
[null,"-",0,"-",0,"t",null,0,null,{"$f":"ROUNDDOWN(E847*H847,4)","v":0}]
[null,null,null,"Custo unitário total de tempo fixo",{"$nulls":5},{"$f":"SUM(J846:J847)","v":0}]
[null,"F - MOMENTO DE TRANSPORTE",null,"Quantidade","Unidade","DMT",null,null,null,"Custo Unitário"]
[{"$nulls":5},"LN","RP","P"]
[null,"-",0,0,"tkm"]
[null,"-",0,0,"tkm"]
[null,null,null,"Custo unitário total de transporte"]
[{"$nulls":5},"Custo unitário direto total",null,null,null,{"$f":"TRUNC(J844+J848,2)","v":192.82}]
[null,"Obs."]
[]
[{"$f":"A816+1","v":23},"1ª/GRD",{"$nulls":8},{"$f":"J895","v":228.56}]
[null,"OBRA:"," PAVIMENTAÇÃO ASFÁLTICA EM CBUQ - ESTRADA PARA SANTANA DO MUNDO NOVO (JURAMENTO / MG)"]
[null,"Custo Unitário de Referência",null,null,"Minas Gerais"]
[{"$nulls":4}," Janeiro/2025",null,null,"Produção da equipe ",1,{"$f":"VLOOKUP(A857,ORÇAMENTO!$A$10:$L$59,7,1)","v":"M"}]
[null,2003389,"DESCIDA D'ÁGUA DE ATERRO TIPO RÁPIDO - DAR 01 - AREIA E BRITA COMERCIAIS",{"$nulls":5},"Valores em reais (R$)"]
[null,"A - EQUIPAMENTOS",null,"Quantidade","Utilização",null,"Custo Horário",null,null,"Custo"]
[{"$nulls":4},"Operativa","Improdutiva","Produtivo","Improdutivo",null,"Horário Total"]
[null,"-",0,null,null,null,0,0,null,{"$f":"D864*(E864*G864+F864*H864)","v":0}]
[null,"-",0,null,null,null,0,0,null,{"$f":"D865*(E865*G865+F865*H865)","v":0}]
[{"$nulls":7},"Custo horário total de equipamentos",null,{"$f":"SUM(J864:J865)","v":0}]
[null,"B - MÃO DE OBRA",null,"Quantidade","Unidade",null,"Custo Horário","Custo Horário Total"]
[null,"P9821","Pedreiro",0.25,"h",null,26.6785,null,null,{"$f":"D868*G868","v":6.6696249999999999}]
[null,"P9824","Servente",2,"h",null,21.3355,null,null,{"$f":"D869*G869","v":42.670999999999999}]
[null,null,null,"Custo horário total de mão de obra",{"$nulls":5},{"$f":"SUM(J868:J869)","v":49.340625000000003}]
[null,null,null,"Custo horário total de execução",{"$nulls":5},{"$f":"J866+J870","v":49.340625000000003}]
[null,null,null,"Custo unitário de execução",{"$nulls":5},{"$f":"J871/I860","v":49.340625000000003}]
[{"$nulls":7},"Custo do FIC",null,0]
[{"$nulls":7},"Custo do FIT",null,0]
[null,"C - MATERIAL",null,"Quantidade","Unidade",null,"Preço Unitário","Custo Unitário"]
[null,"M2117","Meio tubo de concreto simples - D = 0,40 m",1,"m",null,47.0441,null,null,{"$f":"D876*G876","v":47.0441}]
[null,null,null,"Custo unitário total de material",{"$nulls":5},{"$f":"SUM(J876:J876)","v":47.0441}]
[null,"D - ATIVIDADES AUXILIARES",null,"Quantidade","Unidade",null,"Custo Unitário","Custo Unitário"]
[null,4805756,"Apiloamento manual de superfície com espessura de 15 cm",0.68,"m²",null,4.8,null,null,{"$f":"D879*G879","v":3.2640000000000002}]
[null,1109669,"Argamassa de cimento e areia 1:3 - confecção em betoneira e lançamento manual - areia comercial",4.0000000000000002E-4,"m³",null,507.26,null,null,{"$f":"D880*G880","v":0.202904}]
[null,1107892,"Concreto fck = 20 MPa - confecção em betoneira e lançamento manual - areia e brita comerciais",0.1389,"m³",null,483.94,null,null,{"$f":"D881*G881","v":67.219266000000005}]
[null,4805750,"Escavação manual em material de 1ª categoria na profundidade de até 1 m",0.17710000000000001,"m³",null,43.54,null,null,{"$f":"D882*G882","v":7.710934}]
[null,3103302,"Fôrmas de tábuas de pinho para dispositivos de drenagem - utilização de 3 vezes - confecção, instalação e retirada",0.68,"m²",null,73.91,null,null,{"$f":"D883*G883","v":50.258800000000001}]
[null,null,null,"Custo total de atividades auxiliares",{"$nulls":5},{"$f":"SUM(J879:J883)","v":128.65590399999999}]
[{"$nulls":7},"Subtotal",null,{"$f":"J872+J877+J884+J873+J874","v":225.040629}]
[null,"E - TEMPO FIXO",null,"Código","Quantidade","Unidade",null,"Custo Unitário","Custo Unitário"]
[null,"M2117","Meio tubo de concreto simples - D = 0,40 m",5914655,0.10838,"t",null,32.520000000000003,null,{"$f":"ROUNDDOWN(E887*H887,4)","v":3.5245000000000002}]
[null,"-",0,"-",null,"t",null,0,null,0]
[null,null,null,"Custo unitário total de tempo fixo",{"$nulls":5},{"$f":"SUM(J887:J888)","v":3.5245000000000002}]
[null,"F - MOMENTO DE TRANSPORTE",null,"Quantidade","Unidade","DMT",null,null,null,"Custo Unitário"]
[{"$nulls":5},"LN","RP","P"]
[null,"M2117","Meio tubo de concreto simples - D = 0,40 m",0.10838,"tkm"]
[null,"-",0,0,"tkm"]
[null,null,null,"Custo unitário total de transporte"]
[{"$nulls":5},"Custo unitário direto total",null,null,null,{"$f":"TRUNC(J885+J889,2)","v":228.56}]
[null,"Obs."]
[]
[{"$f":"A857+1","v":24},"1ª/GRD",{"$nulls":8},{"$f":"J936","v":960.73}]
[null,"OBRA:"," PAVIMENTAÇÃO ASFÁLTICA EM CBUQ - ESTRADA PARA SANTANA DO MUNDO NOVO (JURAMENTO / MG)"]
[null,"Custo Unitário de Referência",null,null,"Minas Gerais"]
[{"$nulls":4}," Janeiro/2025",null,null,"Produção da equipe ",1,{"$f":"VLOOKUP(A898,ORÇAMENTO!$A$10:$L$59,7,1)","v":"UNID."}]
[null,2003453,"DISSIPADOR DE ENERGIA - DEB 03 - AREIA, BRITA E PEDRA DE MÃO COMERCIAIS",{"$nulls":5},"Valores em reais (R$)"]
[null,"A - EQUIPAMENTOS",null,"Quantidade","Utilização",null,"Custo Horário",null,null,"Custo"]
[{"$nulls":4},"Operativa","Improdutiva","Produtivo","Improdutivo",null,"Horário Total"]
[null,"-",0,null,null,null,0,0,null,{"$f":"D905*(E905*G905+F905*H905)","v":0}]
[null,"-",0,null,null,null,0,0,null,{"$f":"D906*(E906*G906+F906*H906)","v":0}]
[{"$nulls":7},"Custo horário total de equipamentos",null,{"$f":"SUM(J905:J906)","v":0}]
[null,"B - MÃO DE OBRA",null,"Quantidade","Unidade",null,"Custo Horário","Custo Horário Total"]
[null,"P9824","Servente",0.94679999999999997,"h",null,21.3355,null,null,{"$f":"D909*G909","v":20.200451399999999}]
[null,"-",0,0,0,null,0,null,null,{"$f":"D910*G910","v":0}]
[null,null,null,"Custo horário total de mão de obra",{"$nulls":5},{"$f":"SUM(J909:J910)","v":20.200451399999999}]
[null,null,null,"Custo horário total de execução",{"$nulls":5},{"$f":"J907+J911","v":20.200451399999999}]
[null,null,null,"Custo unitário de execução",{"$nulls":5},{"$f":"J912/I901","v":20.200451399999999}]
[{"$nulls":7},"Custo do FIC",null,0]
[{"$nulls":7},"Custo do FIT",null,0]
[null,"C - MATERIAL",null,"Quantidade","Unidade",null,"Preço Unitário","Custo Unitário"]
[null,"M1097","Pedra de mão ou rachão",0.37480000000000002,"m³",null,159.5925,null,null,{"$f":"D917*G917","v":59.815269000000001}]
[null,"-",0,0,0,null,0,null,null,{"$f":"D918*G918","v":0}]
[null,null,null,"Custo unitário total de material",{"$nulls":5},{"$f":"SUM(J917:J918)","v":59.815269000000001}]
[null,"D - ATIVIDADES AUXILIARES",null,"Quantidade","Unidade",null,"Custo Unitário","Custo Unitário"]
[null,4805756,"Apiloamento manual de superfície com espessura de 15 cm",5.4370000000000003,"m²",null,4.8,null,null,{"$f":"D921*G921","v":26.0976}]
[null,1107892,"Concreto fck = 20 MPa - confecção em betoneira e lançamento manual - areia e brita comerciais",0.99890000000000001,"m³",null,483.94,null,null,{"$f":"D922*G922","v":483.40766600000001}]
[null,4805750,"Escavação manual em material de 1ª categoria na profundidade de até 1 m",1.0873999999999999,"m³",null,43.54,null,null,{"$f":"D923*G923","v":47.345395999999994}]
[null,3103302,"Fôrmas de tábuas de pinho para dispositivos de drenagem - utilização de 3 vezes - confecção, instalação e retirada",4.3680000000000003,"m²",null,73.91,null,null,{"$f":"D924*G924","v":322.83888000000002}]
[null,null,null,"Custo total de atividades auxiliares",{"$nulls":5},{"$f":"SUM(J921:J924)","v":879.68954200000007}]
[{"$nulls":7},"Subtotal",null,{"$f":"J913+J919+J925+J914+J915","v":959.70526240000004}]
[null,"E - TEMPO FIXO",null,"Código","Quantidade","Unidade",null,"Custo Unitário","Custo Unitário"]
[null,"M1097","Pedra de mão ou rachão",5914647,0.56220000000000003,"t",null,1.83,null,{"$f":"ROUNDDOWN(E928*H928,4)","v":1.0287999999999999}]
[null,"-",0,"-",0,"t",null,0,null,0]
[null,null,null,"Custo unitário total de tempo fixo",{"$nulls":5},{"$f":"SUM(J928:J929)","v":1.0287999999999999}]
[null,"F - MOMENTO DE TRANSPORTE",null,"Quantidade","Unidade","DMT",null,null,null,"Custo Unitário"]
[{"$nulls":5},"LN","RP","P"]
[null,"M1097","Pedra de mão ou rachão",0.56220000000000003,"tkm"]
[null,"-",0,0,"tkm"]
[null,null,null,"Custo unitário total de transporte"]
[{"$nulls":5},"Custo unitário direto total",null,null,null,{"$f":"TRUNC(J926+J930,2)","v":960.73}]
[null,"Obs."]
[]
[{"$f":"A898+1","v":25},"1ª/GRD",{"$nulls":8},{"$f":"J979","v":914.82}]
[null,"OBRA:"," PAVIMENTAÇÃO ASFÁLTICA EM CBUQ - ESTRADA PARA SANTANA DO MUNDO NOVO (JURAMENTO / MG)"]
[null,"Custo Unitário de Referência",null,null,"Minas Gerais"]
[{"$nulls":4}," Janeiro/2025",null,null,"Produção da equipe ",1,{"$f":"VLOOKUP(A939,ORÇAMENTO!$A$10:$L$59,7,1)","v":"UNID."}]
[null,2003626,"BOCA DE LOBO SIMPLES - GRELHA DE CONCRETO - AREIA E BRITA COMERCIAIS",{"$nulls":5},"Valores em reais (R$)"]
[null,"A - EQUIPAMENTOS",null,"Quantidade","Utilização",null,"Custo Horário",null,null,"Custo"]
[{"$nulls":4},"Operativa","Improdutiva","Produtivo","Improdutivo",null,"Horário Total"]
[null,"-",0,null,null,null,0,0,null,{"$f":"D946*(E946*G946+F946*H946)","v":0}]
[null,"-",0,null,null,null,0,0,null,{"$f":"D947*(E947*G947+F947*H947)","v":0}]
[{"$nulls":7},"Custo horário total de equipamentos",null,{"$f":"SUM(J946:J947)","v":0}]
[null,"B - MÃO DE OBRA",null,"Quantidade","Unidade",null,"Custo Horário","Custo Horário Total"]
[null,"P9824","Servente",0.1,"h",null,21.3355,null,null,{"$f":"D950*G950","v":2.1335500000000001}]
[null,"-",0,null,0,null,0,null,null,{"$f":"D951*G951","v":0}]
[null,null,null,"Custo horário total de mão de obra",{"$nulls":5},{"$f":"SUM(J950:J951)","v":2.1335500000000001}]
[null,null,null,"Custo horário total de execução",{"$nulls":5},{"$f":"J948+J952","v":2.1335500000000001}]
[null,null,null,"Custo unitário de execução",{"$nulls":5},{"$f":"J953/I942","v":2.1335500000000001}]
[{"$nulls":7},"Custo do FIC",null,0]
[{"$nulls":7},"Custo do FIT",null,0]
[null,"C - MATERIAL",null,"Quantidade","Unidade",null,"Preço Unitário","Custo Unitário"]
[null,"-",0,0,0,null,0,null,null,{"$f":"D958*G958","v":0}]
[null,"-",0,0,0,null,0,null,null,0]
[null,null,null,"Custo unitário total de material",{"$nulls":5},{"$f":"SUM(J958:J959)","v":0}]
[null,"D - ATIVIDADES AUXILIARES",null,"Quantidade","Unidade",null,"Custo Unitário","Custo Unitário"]
[null,2009619,"Alvenaria de blocos de concreto 19 x 19 x 39 cm com espessura de 20 cm - areia comercial",3.81,"m²",null,118.76,null,null,{"$f":"D962*G962","v":452.47560000000004}]
[null,1109669,"Argamassa de cimento e areia 1:3 - confecção em betoneira e lançamento manual - areia comercial",0.06,"m³",null,507.26,null,null,{"$f":"D963*G963","v":30.435599999999997}]
[null,407819,"Armação em aço CA-50 - fornecimento, preparo e colocação",4.0999999999999996,"kg",null,12.08,null,null,49.527999999999999]
[null,1107892,"Concreto fck = 20 MPa - confecção em betoneira e lançamento manual - areia e brita comerciais",0.25,"m³",null,483.94,null,null,120.985]
[null,1107896,"Concreto fck = 25 MPa - confecção em betoneira e lançamento manual - areia e brita comerciais",0.06,"m³",null,502.41,null,null,30.144600000000001]
[null,3103302,"Fôrmas de tábuas de pinho para dispositivos de drenagem - utilização de 3 vezes - confecção, instalação e retirada",3.1,"m²",null,73.91,null,null,{"$f":"D967*G967","v":229.12100000000001}]
[null,null,null,"Custo total de atividades auxiliares",{"$nulls":5},{"$f":"SUM(J962:J967)","v":912.68979999999999}]
[{"$nulls":7},"Subtotal",null,{"$f":"J954+J960+J968+J955+J956","v":914.82335}]
[null,"E - TEMPO FIXO",null,"Código","Quantidade","Unidade",null,"Custo Unitário","Custo Unitário"]
[null,"-",0,"-",0,"t",null,0,null,{"$f":"ROUNDDOWN(E971*H971,4)","v":0}]
[null,"-",0,"-",0,"t",null,0,null,{"$f":"ROUNDDOWN(E972*H972,4)","v":0}]
[null,null,null,"Custo unitário total de tempo fixo",{"$nulls":5},{"$f":"SUM(J971:J972)","v":0}]
[null,"F - MOMENTO DE TRANSPORTE",null,"Quantidade","Unidade","DMT",null,null,null,"Custo Unitário"]
[{"$nulls":5},"LN","RP","P"]
[null,"-",0,0,"tkm","5914359","5914374","5914389"]
[null,"-",0,null,"tkm"]
[null,null,null,"Custo unitário total de transporte"]
[{"$nulls":5},"Custo unitário direto total",null,null,null,{"$f":"TRUNC(J969+J973,2)","v":914.82}]
[null,"Obs."]
[]
[{"$f":"A939+1","v":26},"1ª/GRD",{"$nulls":8},{"$f":"J1022","v":1764.65}]
[null,"OBRA:"," PAVIMENTAÇÃO ASFÁLTICA EM CBUQ - ESTRADA PARA SANTANA DO MUNDO NOVO (JURAMENTO / MG)"]
[null,"Custo Unitário de Referência",null,null,"Minas Gerais"]
[{"$nulls":4}," Janeiro/2025",null,null,"Produção da equipe ",1,{"$f":"VLOOKUP(A982,ORÇAMENTO!$A$10:$L$59,7,1)","v":"UNID."}]
[null,2003634,"BOCA DE LOBO DUPLA - GRELHA DE CONCRETO - AREIA E BRITA COMERCIAIS",{"$nulls":5},"Valores em reais (R$)"]
[null,"A - EQUIPAMENTOS",null,"Quantidade","Utilização",null,"Custo Horário",null,null,"Custo"]
[{"$nulls":4},"Operativa","Improdutiva","Produtivo","Improdutivo",null,"Horário Total"]
[null,"-",0,null,null,null,0,0,null,{"$f":"D989*(E989*G989+F989*H989)","v":0}]
[null,"-",0,null,null,null,0,0,null,{"$f":"D990*(E990*G990+F990*H990)","v":0}]
[{"$nulls":7},"Custo horário total de equipamentos",null,{"$f":"SUM(J989:J990)","v":0}]
[null,"B - MÃO DE OBRA",null,"Quantidade","Unidade",null,"Custo Horário","Custo Horário Total"]
[null,"P9824","Servente",0.2,"h",null,21.3355,null,null,{"$f":"D993*G993","v":4.2671000000000001}]
[null,"-",0,null,0,null,0,null,null,{"$f":"D994*G994","v":0}]
[null,null,null,"Custo horário total de mão de obra",{"$nulls":5},{"$f":"SUM(J993:J994)","v":4.2671000000000001}]
[null,null,null,"Custo horário total de execução",{"$nulls":5},{"$f":"J991+J995","v":4.2671000000000001}]
[null,null,null,"Custo unitário de execução",{"$nulls":5},{"$f":"J996/I985","v":4.2671000000000001}]
[{"$nulls":7},"Custo do FIC",null,"-"]
[{"$nulls":7},"Custo do FIT",null,"-"]
[null,"C - MATERIAL",null,"Quantidade","Unidade",null,"Preço Unitário","Custo Unitário"]
[null,"-",0,0,0,null,0,null,null,{"$f":"D1001*G1001","v":0}]
[null,"-",0,0,0,null,0,null,null,0]
[null,null,null,"Custo unitário total de material",{"$nulls":5},{"$f":"SUM(J1001:J1002)","v":0}]
[null,"D - ATIVIDADES AUXILIARES",null,"Quantidade","Unidade",null,"Custo Unitário","Custo Unitário"]
[null,2009619,"Alvenaria de blocos de concreto 19 x 19 x 39 cm com espessura de 20 cm - areia comercial",6.37,"m²",null,118.76,null,null,{"$f":"D1005*G1005","v":756.50120000000004}]
[null,1109669,"Argamassa de cimento e areia 1:3 - confecção em betoneira e lançamento manual - areia comercial",0.11,"m³",null,507.26,null,null,{"$f":"D1006*G1006","v":55.7986}]
[null,407819,"Armação em aço CA-50 - fornecimento, preparo e colocação",15.1,"kg",null,12.08,null,null,182.40799999999999]
[null,1107892,"Concreto fck = 20 MPa - confecção em betoneira e lançamento manual - areia e brita comerciais",0.46,"m³",null,483.94,null,null,222.61240000000001]
[null,1107896,"Concreto fck = 25 MPa - confecção em betoneira e lançamento manual - areia e brita comerciais",0.11,"m³",null,502.41,null,null,55.265100000000004]
[null,3103302,"Fôrmas de tábuas de pinho para dispositivos de drenagem - utilização de 3 vezes - confecção, instalação e retirada",6.6,"m²",null,73.91,null,null,{"$f":"D1010*G1010","v":487.80599999999993}]
[null,null,null,"Custo total de atividades auxiliares",{"$nulls":5},{"$f":"SUM(J1005:J1010)","v":1760.3913000000002}]
[{"$nulls":7},"Subtotal",null,{"$f":"J997+J1003+J1011","v":1764.6584000000003}]
[null,"E - TEMPO FIXO",null,"Código","Quantidade","Unidade",null,"Custo Unitário","Custo Unitário"]
[null,"-",0,"-",0,"t",null,0,null,{"$f":"ROUNDDOWN(E1014*H1014,4)","v":0}]
[null,"-",0,"-",0,"t",null,0,null,{"$f":"ROUNDDOWN(E1015*H1015,4)","v":0}]
[null,null,null,"Custo unitário total de tempo fixo",{"$nulls":5},{"$f":"SUM(J1014:J1015)","v":0}]
[null,"F - MOMENTO DE TRANSPORTE",null,"Quantidade","Unidade","DMT",null,null,null,"Custo Unitário"]
[{"$nulls":5},"LN","RP","P"]
[null,"-",0,0,"tkm","5914359","5914374","5914389"]
[null,"-",0,0,"tkm"]
[null,null,null,"Custo unitário total de transporte"]
[{"$nulls":5},"Custo unitário direto total",null,null,null,{"$f":"TRUNC(J1012+J1016,2)","v":1764.65}]
[null,"Obs."]
[]
[29,"1ª/GRD",{"$nulls":8},{"$f":"J1062","v":264.79000000000002}]
[null,"OBRA:"," PAVIMENTAÇÃO ASFÁLTICA EM CBUQ - ESTRADA PARA SANTANA DO MUNDO NOVO (JURAMENTO / MG)"]
[null,"Custo Unitário de Referência",null,null,"Minas Gerais"]
[{"$nulls":4}," Janeiro/2025",null,null,"Produção da equipe ",12.45,{"$f":"VLOOKUP(A1025,ORÇAMENTO!$A$10:$L$59,7,1)","v":"M"}]
[null,804013,"CORPO DE BUEIRO SIMPLES TUBULAR DE CONCRETO (BSTC), D=0,40M - PA-1 - AREIA E BRITA COMERCIAIS",{"$nulls":5},"Valores em reais (R$)"]
[null,"A - EQUIPAMENTOS",null,"Quantidade","Utilização",null,"Custo Horário",null,null,"Custo"]
[{"$nulls":4},"Operativa","Improdutiva","Produtivo","Improdutivo",null,"Horário Total"]
[null,"E9686","Caminhão carroceria com guindauto com capacidade de 20 t.m - 136 kW",1,1,0,309.04739999999998,116.0188,null,{"$f":"D1032*(E1032*G1032+F1032*H1032)","v":309.04739999999998}]
[null,"-",0,null,null,null,0,0,null,{"$f":"D1033*(E1033*G1033+F1033*H1033)","v":0}]
[{"$nulls":7},"Custo horário total de equipamentos",null,{"$f":"SUM(J1032:J1033)","v":309.04739999999998}]
[null,"B - MÃO DE OBRA",null,"Quantidade","Unidade",null,"Custo Horário","Custo Horário Total"]
[null,"P9824","Servente",3,"h",null,21.3355,null,null,{"$f":"D1036*G1036","v":64.006500000000003}]
[null,"-",0,0,0,null,0,null,null,{"$f":"D1037*G1037","v":0}]
[null,null,null,"Custo horário total de mão de obra",{"$nulls":5},{"$f":"SUM(J1036:J1037)","v":64.006500000000003}]
[null,null,null,"Custo horário total de execução",{"$nulls":5},{"$f":"J1034+J1038","v":373.0539}]
[null,null,null,"Custo unitário de execução",{"$nulls":5},{"$f":"J1039/I1028","v":29.964168674698797}]
[{"$nulls":7},"Custo do FIC",null,0]
[{"$nulls":7},"Custo do FIT",null,0]
[null,"C - MATERIAL",null,"Quantidade","Unidade",null,"Preço Unitário","Custo Unitário"]
[null,"M2163","Tubo de concreto armado PA1 - D = 0,40 m",1,"m",null,131.41659999999999,null,null,{"$f":"D1044*G1044","v":131.41659999999999}]
[null,"-",0,0,0,null,0,null,null,{"$f":"D1045*G1045","v":0}]
[null,null,null,"Custo unitário total de material",{"$nulls":5},{"$f":"SUM(J1044:J1045)","v":131.41659999999999}]
[null,"D - ATIVIDADES AUXILIARES",null,"Quantidade","Unidade",null,"Custo Unitário","Custo Unitário"]
[null,1109671,"Argamassa de cimento e areia 1:4 - confecção em betoneira e lançamento manual - areia comercial",1.65E-3,"m³",null,470.75,null,null,{"$f":"D1048*G1048","v":0.77673749999999997}]
[null,1106165,"Concreto ciclópico fck = 20 MPa - confecção em betoneira e lançamento manual - areia, brita e pedra de mão comerciais",0.151,"m³",null,435.01,null,null,{"$f":"D1049*G1049","v":65.686509999999998}]
[null,3103302,"Fôrmas de tábuas de pinho para dispositivos de drenagem - utilização de 3 vezes - confecção, instalação e retirada",0.5,"m²",null,73.91,null,null,{"$f":"D1050*G1050","v":36.954999999999998}]
[null,null,null,"Custo total de atividades auxiliares",{"$nulls":5},{"$f":"SUM(J1048:J1050)","v":103.41824749999999}]
[{"$nulls":7},"Subtotal",null,{"$f":"J1040+J1046+J1051+J1041+J1042","v":264.79901617469881}]
[null,"E - TEMPO FIXO",null,"Código","Quantidade","Unidade",null,"Custo Unitário","Custo Unitário"]
[null,"-",0,"-",0,"t",null,0,null,{"$f":"ROUNDDOWN(E1054*H1054,4)","v":0}]
[null,"-",0,"-",0,"t",null,0,null,{"$f":"ROUNDDOWN(E1055*H1055,4)","v":0}]
[null,null,null,"Custo unitário total de tempo fixo",{"$nulls":5},{"$f":"SUM(J1054:J1055)","v":0}]
[null,"F - MOMENTO DE TRANSPORTE",null,"Quantidade","Unidade","DMT",null,null,null,"Custo Unitário"]
[{"$nulls":5},"LN","RP","P"]
[null,"M2163","Tubo de concreto armado PA1 - D = 0,40 m",0.17268,"tkm","5914584","5914599","5914614"]
[null,"-",0,0,"tkm"]
[null,null,null,"Custo unitário total de transporte"]
[{"$nulls":5},"Custo unitário direto total",null,null,null,{"$f":"TRUNC(J1052+J1056,2)","v":264.79000000000002}]
[null,"Obs."]
[]
[31,"1ª/GRD",{"$nulls":8},{"$f":"J1102","v":936.07}]
[null,"OBRA:"," PAVIMENTAÇÃO ASFÁLTICA EM CBUQ - ESTRADA PARA SANTANA DO MUNDO NOVO (JURAMENTO / MG)"]
[null,"Custo Unitário de Referência",null,null,"Minas Gerais"]
[{"$nulls":4}," Janeiro/2025",null,null,"Produção da equipe ",2.0750000000000002,{"$f":"VLOOKUP(A1065,ORÇAMENTO!$A$10:$L$59,7,1)","v":"M"}]
[null,"804181a","CORPO DE BUEIRO DUPLO TUBULAR DE CONCRETO (BDTC), D=0,60M - PA-1 - AREIA E BRITA COMERCIAIS",{"$nulls":5},"Valores em reais (R$)"]
[null,"A - EQUIPAMENTOS",null,"Quantidade","Utilização",null,"Custo Horário",null,null,"Custo"]
[{"$nulls":4},"Operativa","Improdutiva","Produtivo","Improdutivo",null,"Horário Total"]
[null,"E9686","Caminhão carroceria com guindauto com capacidade de 20 t.m - 136 kW",1,1,0,309.04739999999998,116.0188,null,{"$f":"D1072*(E1072*G1072+F1072*H1072)","v":309.04739999999998}]
[null,"-",0,null,null,null,0,0,null,{"$f":"D1073*(E1073*G1073+F1073*H1073)","v":0}]
[{"$nulls":7},"Custo horário total de equipamentos",null,{"$f":"SUM(J1072:J1073)","v":309.04739999999998}]
[null,"B - MÃO DE OBRA",null,"Quantidade","Unidade",null,"Custo Horário","Custo Horário Total"]
[null,"P9824","Servente",3,"h",null,21.3355,null,null,{"$f":"D1076*G1076","v":64.006500000000003}]
[null,"-",0,0,0,null,0,null,null,{"$f":"D1077*G1077","v":0}]
[null,null,null,"Custo horário total de mão de obra",{"$nulls":5},{"$f":"SUM(J1076:J1077)","v":64.006500000000003}]
[null,null,null,"Custo horário total de execução",{"$nulls":5},{"$f":"J1074+J1078","v":373.0539}]
[null,null,null,"Custo unitário de execução",{"$nulls":5},{"$f":"J1079/I1068","v":179.78501204819275}]
[{"$nulls":7},"Custo do FIC",null,0]
[{"$nulls":7},"Custo do FIT",null,0]
[null,"C - MATERIAL",null,"Quantidade","Unidade",null,"Preço Unitário","Custo Unitário"]
[null,"M2167","Tubo de concreto armado PA1 - D = 0,60 m",2,"m",null,215.7,null,null,{"$f":"D1084*G1084","v":431.4}]
[null,"-",0,0,0,null,0,null,null,{"$f":"D1085*G1085","v":0}]
[null,null,null,"Custo unitário total de material",{"$nulls":5},{"$f":"SUM(J1084:J1085)","v":431.4}]
[null,"D - ATIVIDADES AUXILIARES",null,"Quantidade","Unidade",null,"Custo Unitário","Custo Unitário"]
[null,1109671,"Argamassa de cimento e areia 1:4 - confecção em betoneira e lançamento manual - areia comercial",1.1010000000000001E-2,"m³",null,470.75,null,null,{"$f":"D1088*G1088","v":5.1829575000000006}]
[null,1106165,"Concreto ciclópico fck = 20 MPa - confecção em betoneira e lançamento manual - areia, brita e pedra de mão comerciais",0.61599999999999999,"m³",null,435.01,null,null,{"$f":"D1089*G1089","v":267.96616}]
[null,3103302,"Fôrmas de tábuas de pinho para dispositivos de drenagem - utilização de 3 vezes - confecção, instalação e retirada",0.7,"m²",null,73.91,null,null,{"$f":"D1090*G1090","v":51.736999999999995}]
[null,null,null,"Custo total de atividades auxiliares",{"$nulls":5},{"$f":"SUM(J1088:J1090)","v":324.88611749999995}]
[{"$nulls":7},"Subtotal",null,{"$f":"J1080+J1086+J1091+J1081+J1082","v":936.07112954819263}]
[null,"E - TEMPO FIXO",null,"Código","Quantidade","Unidade",null,"Custo Unitário","Custo Unitário"]
[null,"-",0,"-",0,"t",null,0,null,{"$f":"ROUNDDOWN(E1094*H1094,4)","v":0}]
[null,"-",0,"-",0,"t",null,0,null,{"$f":"ROUNDDOWN(E1095*H1095,4)","v":0}]
[null,null,null,"Custo unitário total de tempo fixo",{"$nulls":5},{"$f":"SUM(J1094:J1095)","v":0}]
[null,"F - MOMENTO DE TRANSPORTE",null,"Quantidade","Unidade","DMT",null,null,null,"Custo Unitário"]
[{"$nulls":5},"LN","RP","P"]
[null,"M2171","Tubo de concreto armado PA1 - D = 0,80 m",0,"tkm","5914584","5914599","5914614"]
[null,"-",0,0,"tkm"]
[null,null,null,"Custo unitário total de transporte"]
[{"$nulls":5},"Custo unitário direto total",null,null,null,{"$f":"TRUNC(J1092+J1096,2)","v":936.07}]
[null,"Obs."]
[]
[36,"1ª/GRD",{"$nulls":8},{"$f":"J1145","v":1045.3699999999999}]
[null,"OBRA:"," PAVIMENTAÇÃO ASFÁLTICA EM CBUQ - ESTRADA PARA SANTANA DO MUNDO NOVO (JURAMENTO / MG)"]
[null,"Custo Unitário de Referência",null,null,"Minas Gerais"]
[{"$nulls":4}," Janeiro/2025",null,null,"Produção da equipe ",1,{"$f":"VLOOKUP(A1105,ORÇAMENTO!$A$10:$L$59,7,1)","v":"M"}]
[null,2003365,"TRANSPOSIÇÃO DE SEGMENTO DE SARJETA - TSS 01 - AREIA E BRITA COMERCIAIS",{"$nulls":5},"Valores em reais (R$)"]
[null,"A - EQUIPAMENTOS",null,"Quantidade","Utilização",null,"Custo Horário",null,null,"Custo"]
[{"$nulls":4},"Operativa","Improdutiva","Produtivo","Improdutivo",null,"Horário Total"]
[null,"-",0,null,null,null,0,0,null,{"$f":"D1112*(E1112*G1112+F1112*H1112)","v":0}]
[null,"-",0,null,null,null,0,0,null,{"$f":"D1113*(E1113*G1113+F1113*H1113)","v":0}]
[{"$nulls":7},"Custo horário total de equipamentos",null,{"$f":"SUM(J1112:J1113)","v":0}]
[null,"B - MÃO DE OBRA",null,"Quantidade","Unidade",null,"Custo Horário","Custo Horário Total"]
[null,"-",0,null,0,null,0,null,null,{"$f":"D1116*G1116","v":0}]
[null,"-",0,null,0,null,0,null,null,{"$f":"D1117*G1117","v":0}]
[null,null,null,"Custo horário total de mão de obra",{"$nulls":5},{"$f":"SUM(J1116:J1117)","v":0}]
[null,null,null,"Custo horário total de execução",{"$nulls":5},{"$f":"J1114+J1118","v":0}]
[null,null,null,"Custo unitário de execução",{"$nulls":5},{"$f":"J1119/I1108","v":0}]
[{"$nulls":7},"Custo do FIC",null,0]
[{"$nulls":7},"Custo do FIT",null,0]
[null,"C - MATERIAL",null,"Quantidade","Unidade",null,"Preço Unitário","Custo Unitário"]
[null,"-",0,0,0,null,0,null,null,{"$f":"D1124*G1124","v":0}]
[null,"-",0,0,0,null,0,null,null,0]
[null,null,null,"Custo unitário total de material",{"$nulls":5},{"$f":"SUM(J1124:J1125)","v":0}]
[null,"D - ATIVIDADES AUXILIARES",null,"Quantidade","Unidade",null,"Custo Unitário","Custo Unitário"]
[null,1100657,"Adensamento de concreto por vibrador de imersão",0.252,"m³",null,3.34,null,null,{"$f":"D1128*G1128","v":0.84167999999999998}]
[null,407819,"Armação em aço CA-50 - fornecimento, preparo e colocação",24.454799999999999,"kg",null,12.08,null,null,{"$f":"D1129*G1129","v":295.41398399999997}]
[null,1107892,"Concreto fck = 20 MPa - confecção em betoneira e lançamento manual - areia e brita comerciais",0.75790000000000002,"m³",null,483.94,null,null,{"$f":"D1130*G1130","v":366.77812599999999}]
[null,1107896,"Concreto fck = 25 MPa - confecção em betoneira e lançamento manual - areia e brita comerciais",0.252,"m³",null,502.41,null,null,{"$f":"D1131*G1131","v":126.60732}]
[null,4805750,"Escavação manual em material de 1ª categoria na profundidade de até 1 m",0.49980000000000002,"m³",null,43.54,null,null,21.761292000000001]
[null,3103302,"Fôrmas de tábuas de pinho para dispositivos de drenagem - utilização de 3 vezes - confecção, instalação e retirada",3.1656,"m²",null,73.91,null,null,{"$f":"D1133*G1133","v":233.96949599999999}]
[null,null,null,"Custo total de atividades auxiliares",{"$nulls":5},{"$f":"SUM(J1128:J1133)","v":1045.3718979999999}]
[{"$nulls":7},"Subtotal",null,{"$f":"J1120+J1126+J1134+J1121+J1122","v":1045.3718979999999}]
[null,"E - TEMPO FIXO",null,"Código","Quantidade","Unidade",null,"Custo Unitário","Custo Unitário"]
[null,"-",0,"-",0,"t",null,0,null,{"$f":"ROUNDDOWN(E1137*H1137,4)","v":0}]
[null,"-",0,"-",0,"t",null,0,null,{"$f":"ROUNDDOWN(E1138*H1138,4)","v":0}]
[null,null,null,"Custo unitário total de tempo fixo",{"$nulls":5},{"$f":"SUM(J1137:J1138)","v":0}]
[null,"F - MOMENTO DE TRANSPORTE",null,"Quantidade","Unidade","DMT",null,null,null,"Custo Unitário"]
[{"$nulls":5},"LN","RP","P"]
[null,"-",0,0,"tkm","5914584","5914599","5914614"]
[null,"-",0,0,"tkm"]
[null,null,null,"Custo unitário total de transporte"]
[{"$nulls":5},"Custo unitário direto total",null,null,null,{"$f":"TRUNC(J1135+J1139,2)","v":1045.3699999999999}]
[null,"Obs."]
[]
[38,"1ª/GRD",{"$nulls":8},{"$f":"J1184","v":6.63}]
[null,"OBRA:"," PAVIMENTAÇÃO ASFÁLTICA EM CBUQ - ESTRADA PARA SANTANA DO MUNDO NOVO (JURAMENTO / MG)"]
[null,"Custo Unitário de Referência",null,null,"Minas Gerais"]
[{"$nulls":4}," Janeiro/2025",null,null,"Produção da equipe ",26,{"$f":"VLOOKUP(A1148,ORÇAMENTO!$A$10:$L$59,7,1)","v":"M3"}]
[null,4805757,"ESCAVAÇÃO MECÂNICA DE VALAS EM MATERIAL DE 1ª CATEGORIA",{"$nulls":5},"Valores em reais (R$)"]
[null,"A - EQUIPAMENTOS",null,"Quantidade","Utilização",null,"Custo Horário",null,null,"Custo"]
[{"$nulls":4},"Operativa","Improdutiva","Produtivo","Improdutivo",null,"Horário Total"]
[null,"E9526","Retroescavadeira de pneus - capacidade da caçamba da pá-carregadeira de 0,76 m³ e da retroescavadeira de 0,29 m³ - 58 kW ",1,1,0,147.6585,74.887,null,{"$f":"D1155*(E1155*G1155+F1155*H1155)","v":147.6585}]
[null,"-",0,0,0,0,0,0,null,{"$f":"D1156*(E1156*G1156+F1156*H1156)","v":0}]
[{"$nulls":7},"Custo horário total de equipamentos",null,{"$f":"SUM(J1155:J1156)","v":147.6585}]
[null,"B - MÃO DE OBRA",null,"Quantidade","Unidade",null,"Custo Horário","Custo Horário Total"]
[null,"P9824","Servente",1,"h",null,21.3355,null,null,{"$f":"D1159*G1159","v":21.3355}]
[null,"-",0,0,0,null,0,null,null,{"$f":"D1160*G1160","v":0}]
[null,null,null,"Custo horário total de mão de obra",{"$nulls":5},{"$f":"SUM(J1159:J1160)","v":21.3355}]
[null,null,null,"Custo horário total de execução",{"$nulls":5},{"$f":"J1157+J1161","v":168.994}]
[null,null,null,"Custo unitário de execução",{"$nulls":5},{"$f":"J1162/I1151","v":6.499769230769231}]
[{"$nulls":7},"Custo do FIC",null,0.13750000000000001]
[{"$nulls":7},"Custo do FIT",null,0]
[null,"C - MATERIAL",null,"Quantidade","Unidade",null,"Preço Unitário","Custo Unitário"]
[null,"-",0,0,0,null,0,null,null,{"$f":"D1167*G1167","v":0}]
[null,"-",0,0,0,null,0,null,null,0]
[null,null,null,"Custo unitário total de material",{"$nulls":5},{"$f":"SUM(J1167:J1168)","v":0}]
[null,"D - ATIVIDADES AUXILIARES",null,"Quantidade","Unidade",null,"Custo Unitário","Custo Unitário"]
[null,"-",0,0,0,null,0,null,null,{"$f":"D1171*G1171","v":0}]
[null,"-",0,0,0,null,0,null,null,{"$f":"D1172*G1172","v":0}]
[null,null,null,"Custo total de atividades auxiliares",{"$nulls":5},{"$f":"SUM(J1171:J1172)","v":0}]
[{"$nulls":7},"Subtotal",null,{"$f":"J1163+J1169+J1173+J1164+J1165","v":6.6372692307692311}]
[null,"E - TEMPO FIXO",null,"Código","Quantidade","Unidade",null,"Custo Unitário","Custo Unitário"]
[null,"-",0,"-",0,"t",null,0,null,{"$f":"ROUNDDOWN(E1176*H1176,4)","v":0}]
[null,"-",0,"-",0,"t",null,0,null,{"$f":"ROUNDDOWN(E1177*H1177,4)","v":0}]
[null,null,null,"Custo unitário total de tempo fixo",{"$nulls":5},{"$f":"SUM(J1176:J1177)","v":0}]
[null,"F - MOMENTO DE TRANSPORTE",null,"Quantidade","Unidade","DMT",null,null,null,"Custo Unitário"]
[{"$nulls":5},"LN","RP","P"]
[null,"-",0,0,"tkm"]
[null,"-",0,0,"tkm"]
[null,null,null,"Custo unitário total de transporte"]
[{"$nulls":5},"Custo unitário direto total",null,null,null,{"$f":"TRUNC(J1174+J1178,2)","v":6.63}]
[null,"Obs."]
[]
[{"$f":"A1148+1","v":39},"1ª/GRD",{"$nulls":8},{"$f":"J1223","v":4.8}]
[null,"OBRA:"," PAVIMENTAÇÃO ASFÁLTICA EM CBUQ - ESTRADA PARA SANTANA DO MUNDO NOVO (JURAMENTO / MG)"]
[null,"Custo Unitário de Referência",null,null,"Minas Gerais"]
[{"$nulls":4}," Janeiro/2025",null,null,"Produção da equipe ",4.4444400000000002,{"$f":"VLOOKUP(A1187,ORÇAMENTO!$A$10:$L$59,7,1)","v":"M2"}]
[null,4805756,"APILOAMENTO MANUAL DE FUNDO DE VALA",{"$nulls":5},"Valores em reais (R$)"]
[null,"A - EQUIPAMENTOS",null,"Quantidade","Utilização",null,"Custo Horário",null,null,"Custo"]
[{"$nulls":4},"Operativa","Improdutiva","Produtivo","Improdutivo",null,"Horário Total"]
[null,"-",0,null,null,null,0,0,null,{"$f":"D1194*(E1194*G1194+F1194*H1194)","v":0}]
[null,"-",0,null,null,null,0,0,null,{"$f":"D1195*(E1195*G1195+F1195*H1195)","v":0}]
[{"$nulls":7},"Custo horário total de equipamentos",null,{"$f":"SUM(J1194:J1195)","v":0}]
[null,"B - MÃO DE OBRA",null,"Quantidade","Unidade",null,"Custo Horário","Custo Horário Total"]
[null,"P9824","Servente",1,"h",null,21.3355,null,null,{"$f":"D1198*G1198","v":21.3355}]
[null,"-",0,null,0,null,0,null,null,{"$f":"D1199*G1199","v":0}]
[null,null,null,"Custo horário total de mão de obra",{"$nulls":5},{"$f":"SUM(J1198:J1199)","v":21.3355}]
[null,null,null,"Custo horário total de execução",{"$nulls":5},{"$f":"J1196+J1200","v":21.3355}]
[null,null,null,"Custo unitário de execução",{"$nulls":5},{"$f":"J1201/I1190","v":4.8004923004923006}]
[{"$nulls":7},"Custo do FIC",null,0]
[{"$nulls":7},"Custo do FIT",null,0]
[null,"C - MATERIAL",null,"Quantidade","Unidade",null,"Preço Unitário","Custo Unitário"]
[null,"-",0,0,0,null,0,null,null,{"$f":"D1206*G1206","v":0}]
[null,"-",0,0,0,null,0,null,null,0]
[null,null,null,"Custo unitário total de material",{"$nulls":5},{"$f":"SUM(J1206:J1207)","v":0}]
[null,"D - ATIVIDADES AUXILIARES",null,"Quantidade","Unidade",null,"Custo Unitário","Custo Unitário"]
[null,"-",0,0,0,null,0,null,null,{"$f":"D1210*G1210","v":0}]
[null,"-",0,0,0,null,0,null,null,{"$f":"D1211*G1211","v":0}]
[null,null,null,"Custo total de atividades auxiliares",{"$nulls":5},{"$f":"SUM(J1210:J1211)","v":0}]
[{"$nulls":7},"Subtotal",null,{"$f":"J1202+J1208+J1212","v":4.8004923004923006}]
[null,"E - TEMPO FIXO",null,"Código","Quantidade","Unidade",null,"Custo Unitário","Custo Unitário"]
[null,"-",0,"-",0,"t",null,0,null,{"$f":"ROUNDDOWN(E1215*H1215,4)","v":0}]
[null,"-",0,"-",0,"t",null,0,null,{"$f":"ROUNDDOWN(E1216*H1216,4)","v":0}]
[null,null,null,"Custo unitário total de tempo fixo",{"$nulls":5},{"$f":"SUM(J1215:J1216)","v":0}]
[null,"F - MOMENTO DE TRANSPORTE",null,"Quantidade","Unidade","DMT",null,null,null,"Custo Unitário"]
[{"$nulls":5},"LN","RP","P"]
[null,"-",0,0,"tkm"]
[null,"-",0,0,"tkm"]
[null,null,null,"Custo unitário total de transporte"]
[{"$nulls":5},"Custo unitário direto total",null,null,null,{"$f":"TRUNC(J1213+J1217,2)","v":4.8}]
[null,"Obs."]
[]
[{"$f":"A1187+1","v":40},"1ª/GRD",{"$nulls":8},{"$f":"J1265","v":15.06}]
[null,"OBRA:"," PAVIMENTAÇÃO ASFÁLTICA EM CBUQ - ESTRADA PARA SANTANA DO MUNDO NOVO (JURAMENTO / MG)"]
[null,"Custo Unitário de Referência",null,null,"Minas Gerais"]
[{"$nulls":4}," Janeiro/2025",null,null,"Produção da equipe ",1,{"$f":"VLOOKUP(A1226,ORÇAMENTO!$A$10:$L$59,7,1)","v":"M2"}]
[null,101574,"ESCORAMENTO DE VALA TIPO PONTALETEAMENTO - CONFECÇÃO, INSTALAÇÃO E RETIRADA",{"$nulls":5},"Valores em reais (R$)"]
[null,"A - EQUIPAMENTOS",null,"Quantidade","Utilização",null,"Custo Horário",null,null,"Custo"]
[{"$nulls":4},"Operativa","Improdutiva","Produtivo","Improdutivo",null,"Horário Total"]
[null,"-",0,null,null,null,0,0,null,{"$f":"D1233*(E1233*G1233+F1233*H1233)","v":0}]
[null,"-",0,null,null,null,0,0,null,{"$f":"D1234*(E1234*G1234+F1234*H1234)","v":0}]
[{"$nulls":7},"Custo horário total de equipamentos",null,{"$f":"SUM(J1233:J1234)","v":0}]
[null,"B - MÃO DE OBRA",null,"Quantidade","Unidade",null,"Custo Horário","Custo Horário Total"]
[null,"P9801","Ajudante",9.5500000000000002E-2,"h",null,23.050599999999999,null,null,{"$f":"D1237*G1237","v":2.2013322999999998}]
[null,"P9808","Carpinteiro",0.2228,"h",null,26.4529,null,null,{"$f":"D1238*G1238","v":5.89370612}]
[null,null,null,"Custo horário total de mão de obra",{"$nulls":5},{"$f":"SUM(J1237:J1238)","v":8.0950384199999998}]
[null,null,null,"Custo horário total de execução",{"$nulls":5},{"$f":"J1235+J1239","v":8.0950384199999998}]
[null,null,null,"Custo unitário de execução",{"$nulls":5},{"$f":"J1240/I1229","v":8.0950384199999998}]
[{"$nulls":7},"Custo do FIC",null,0]
[{"$nulls":7},"Custo do FIT",null,0]
[null,"C - MATERIAL",null,"Quantidade","Unidade",null,"Preço Unitário","Custo Unitário"]
[null,"M1811","Longarina de madeira de primeira - L = 16 cm e E = 6 cm",7.2400000000000006E-2,"m",null,47.557499999999997,null,null,{"$f":"D1245*G1245","v":3.4431630000000002}]
[null,"M1205","Prego de ferro",1.2800000000000001E-2,"kg",null,16.544499999999999,null,null,{"$f":"D1246*G1246","v":0.2117696}]
[null,"M0286","Tábua - E = 2,5 cm e L = 30 cm",0.18110000000000001,"m",null,15.537800000000001,null,null,2.8138955800000005]
[null,null,null,"Custo unitário total de material",{"$nulls":5},{"$f":"SUM(J1245:J1247)","v":6.4688281800000009}]
[null,"D - ATIVIDADES AUXILIARES",null,"Quantidade","Unidade",null,"Custo Unitário","Custo Unitário"]
[null,"-",0,0,0,null,0,null,null,{"$f":"D1250*G1250","v":0}]
[null,"-",0,0,0,null,0,null,null,{"$f":"D1251*G1251","v":0}]
[null,null,null,"Custo total de atividades auxiliares",{"$nulls":5},{"$f":"SUM(J1250:J1251)","v":0}]
[{"$nulls":7},"Subtotal",null,{"$f":"J1241+J1248+J1252+J1242+J1243","v":14.563866600000001}]
[null,"E - TEMPO FIXO",null,"Código","Quantidade","Unidade",null,"Custo Unitário","Custo Unitário"]
[null,"M1811","Longarina de madeira de primeira - L = 16 cm e E = 6 cm",5914655,3.8800000000000002E-3,"t",null,32.520000000000003,null,{"$f":"ROUNDDOWN(E1255*H1255,4)","v":0.12609999999999999}]
[null,"M1205","Prego de ferro",5914655,9.0000000000000006E-5,"t",null,32.520000000000003,null,2.8999999999999998E-3]
[null,"M0286","Tábua - E = 2,5 cm e L = 30 cm",5914655,1.137E-2,"t",null,32.520000000000003,null,0.36969999999999997]
[null,null,null,"Custo unitário total de tempo fixo",{"$nulls":5},{"$f":"SUM(J1255:J1257)","v":0.49869999999999998}]
[null,"F - MOMENTO DE TRANSPORTE",null,"Quantidade","Unidade","DMT",null,null,null,"Custo Unitário"]
[{"$nulls":5},"LN","RP","P"]
[null,"M1811","Longarina de madeira de primeira - L = 16 cm e E = 6 cm",3.8800000000000002E-3,"tkm"]
[null,"M1205","Prego de ferro",9.0000000000000006E-5,"tkm"]
[null,"M0286","Tábua - E = 2,5 cm e L = 30 cm",1.137E-2,"tkm"]
[null,null,null,"Custo unitário total de transporte"]
[{"$nulls":5},"Custo unitário direto total",null,null,null,{"$f":"TRUNC(J1253+J1258,2)","v":15.06}]
[null,"Obs."]
[]
[{"$f":"A1226+1","v":41},"1ª/GRD",{"$nulls":8},{"$f":"J1304","v":16.68}]
[null,"OBRA:"," PAVIMENTAÇÃO ASFÁLTICA EM CBUQ - ESTRADA PARA SANTANA DO MUNDO NOVO (JURAMENTO / MG)"]
[null,"Custo Unitário de Referência",null,null,"Minas Gerais"]
[{"$nulls":4}," Janeiro/2025",null,null,"Produção da equipe ",3.1124999999999998,{"$f":"VLOOKUP(A1268,ORÇAMENTO!$A$10:$L$59,7,1)","v":"M3"}]
[null,4815671,"REATERRO E COMPACTAÇÃO MANUAL DE VALAS COM SOQUETE VIBRATÓRIO",{"$nulls":5},"Valores em reais (R$)"]
[null,"A - EQUIPAMENTOS",null,"Quantidade","Utilização",null,"Custo Horário",null,null,"Custo"]
[{"$nulls":4},"Operativa","Improdutiva","Produtivo","Improdutivo",null,"Horário Total"]
[null,"E9647","Compactador manual com soquete vibratório - 4,10 kW",1,1,0,9.2759,1.022,null,{"$f":"D1275*(E1275*G1275+F1275*H1275)","v":9.2759}]
[null,"-",0,0,0,0,0,0,null,{"$f":"D1276*(E1276*G1276+F1276*H1276)","v":0}]
[{"$nulls":7},"Custo horário total de equipamentos",null,{"$f":"SUM(J1275:J1276)","v":9.2759}]
[null,"B - MÃO DE OBRA",null,"Quantidade","Unidade",null,"Custo Horário","Custo Horário Total"]
[null,"P9824","Servente",2,"h",null,21.3355,null,null,{"$f":"D1279*G1279","v":42.670999999999999}]
[null,"-",0,0,0,null,0,null,null,{"$f":"D1280*G1280","v":0}]
[null,null,null,"Custo horário total de mão de obra",{"$nulls":5},{"$f":"SUM(J1279:J1280)","v":42.670999999999999}]
[null,null,null,"Custo horário total de execução",{"$nulls":5},{"$f":"J1277+J1281","v":51.946899999999999}]
[null,null,null,"Custo unitário de execução",{"$nulls":5},{"$f":"J1282/I1271","v":16.689767068273092}]
[{"$nulls":7},"Custo do FIC",null,0]
[{"$nulls":7},"Custo do FIT",null,0]
[null,"C - MATERIAL",null,"Quantidade","Unidade",null,"Preço Unitário","Custo Unitário"]
[null,"-",0,0,0,null,0,null,null,{"$f":"D1287*G1287","v":0}]
[null,"-",0,0,0,null,0,null,null,0]
[null,null,null,"Custo unitário total de material",{"$nulls":5},{"$f":"SUM(J1287:J1288)","v":0}]
[null,"D - ATIVIDADES AUXILIARES",null,"Quantidade","Unidade",null,"Custo Unitário","Custo Unitário"]
[null,"-",0,0,0,null,0,null,null,{"$f":"D1291*G1291","v":0}]
[null,"-",0,0,0,null,0,null,null,{"$f":"D1292*G1292","v":0}]
[null,null,null,"Custo total de atividades auxiliares",{"$nulls":5},{"$f":"SUM(J1291:J1292)","v":0}]
[{"$nulls":7},"Subtotal",null,{"$f":"J1283+J1289+J1293+J1284+J1285","v":16.689767068273092}]
[null,"E - TEMPO FIXO",null,"Código","Quantidade","Unidade",null,"Custo Unitário","Custo Unitário"]
[null,"-",0,"-",0,"t",null,0,null,{"$f":"ROUNDDOWN(E1296*H1296,4)","v":0}]
[null,"-",0,"-",0,"t",null,0,null,{"$f":"ROUNDDOWN(E1297*H1297,4)","v":0}]
[null,null,null,"Custo unitário total de tempo fixo",{"$nulls":5},{"$f":"SUM(J1296:J1297)","v":0}]
[null,"F - MOMENTO DE TRANSPORTE",null,"Quantidade","Unidade","DMT",null,null,null,"Custo Unitário"]
[{"$nulls":5},"LN","RP","P"]
[null,"-",0,0,"tkm"]
[null,"-",0,0,"tkm"]
[null,null,null,"Custo unitário total de transporte"]
[{"$nulls":5},"Custo unitário direto total",null,null,null,{"$f":"TRUNC(J1294+J1298,2)","v":16.68}]
[null,"Obs."]
[]
[{"$f":"A1268+1","v":42},"1ª/GRD",{"$nulls":8},{"$f":"J1347","v":696.66}]
[null,"OBRA:"," PAVIMENTAÇÃO ASFÁLTICA EM CBUQ - ESTRADA PARA SANTANA DO MUNDO NOVO (JURAMENTO / MG)"]
[null,"Custo Unitário de Referência",null,null,"Minas Gerais"]
[{"$nulls":4}," Janeiro/2025",null,null,"Produção da equipe ",1,{"$f":"VLOOKUP(A1307,ORÇAMENTO!$A$10:$L$59,7,1)","v":"M3"}]
[null,94990,"EXECUÇÃO DE PASSEIO (CALÇADA) OU PISO DE CONCRETO MOLDADO IN LOCO, ACABAMENTO CONVENCIONAL, NÃO ARMADO",{"$nulls":5},"Valores em reais (R$)"]
[null,"A - EQUIPAMENTOS",null,"Quantidade","Utilização",null,"Custo Horário",null,null,"Custo"]
[{"$nulls":4},"Operativa","Improdutiva","Produtivo","Improdutivo",null,"Horário Total"]
[null,"-",0,null,null,null,0,0,null,{"$f":"D1314*(E1314*G1314+F1314*H1314)","v":0}]
[null,"-",0,null,null,null,0,0,null,{"$f":"D1315*(E1315*G1315+F1315*H1315)","v":0}]
[{"$nulls":7},"Custo horário total de equipamentos",null,{"$f":"SUM(J1314:J1315)","v":0}]
[null,"B - MÃO DE OBRA",null,"Quantidade","Unidade",null,"Custo Horário","Custo Horário Total"]
[null,"P9808","Carpinteiro",1.268,"h",null,26.4529,null,null,{"$f":"D1318*G1318","v":33.542277200000001}]
[null,"P9821","Pedreiro",1.149,"h",null,26.6785,null,null,{"$f":"D1319*G1319","v":30.653596499999999}]
[null,"P9824","Servente",2.0417000000000001,"h",null,21.3355,null,null,43.560690350000002]
[null,null,null,"Custo horário total de mão de obra",{"$nulls":5},{"$f":"SUM(J1318:J1320)","v":107.75656404999999}]
[null,null,null,"Custo horário total de execução",{"$nulls":5},{"$f":"J1316+J1321","v":107.75656404999999}]
[null,null,null,"Custo unitário de execução",{"$nulls":5},{"$f":"J1322/I1310","v":107.75656404999999}]
[{"$nulls":7},"Custo do FIC",null,0]
[{"$nulls":7},"Custo do FIT",null,0]
[null,"C - MATERIAL",null,"Quantidade","Unidade",null,"Preço Unitário","Custo Unitário"]
[null,"M1358","Sarrafo em madeira de terceira - E = 2,5 cm e L = 5 cm",10,"m",null,1.9665999999999999,null,null,{"$f":"D1327*G1327","v":19.666}]
[null,"M1205","Prego de ferro",0.2994,"kg",null,16.544499999999999,null,null,{"$f":"D1328*G1328","v":4.9534232999999999}]
[null,"M3949","Desmoldante para fôrmas metálicas",2.1299999999999999E-2,"l",null,16.5001,null,null,0.35145212999999997]
[null,"M0451","Concreto usinado - fck = 20 MPa (comercial)",1.1231500000000001,"m³",null,502.1,null,null,563.93361500000003]
[null,"-",0,null,0,null,0,null,null,0]
[null,null,null,"Custo unitário total de material",{"$nulls":5},{"$f":"SUM(J1327:J1331)","v":588.90449043000001}]
[null,"D - ATIVIDADES AUXILIARES",null,"Quantidade","Unidade",null,"Custo Unitário","Custo Unitário"]
[null,"-",0,null,0,null,0,null,null,{"$f":"D1334*G1334","v":0}]
[null,"-",0,null,0,null,0,null,null,{"$f":"D1335*G1335","v":0}]
[null,null,null,"Custo total de atividades auxiliares",{"$nulls":5},{"$f":"SUM(J1334:J1335)","v":0}]
[{"$nulls":7},"Subtotal",null,{"$f":"J1323+J1332+J1336+J1324+J1325","v":696.66105447999996}]
[null,"E - TEMPO FIXO",null,"Código","Quantidade","Unidade",null,"Custo Unitário","Custo Unitário"]
[null,"-",0,"-",null,"t",null,0,null,{"$f":"ROUNDDOWN(E1339*H1339,4)","v":0}]
[null,"-",0,"-",null,"t",null,0,null,{"$f":"ROUNDDOWN(E1340*H1340,4)","v":0}]
[null,null,null,"Custo unitário total de tempo fixo",{"$nulls":5},{"$f":"SUM(J1339:J1340)","v":0}]
[null,"F - MOMENTO DE TRANSPORTE",null,"Quantidade","Unidade","DMT",null,null,null,"Custo Unitário"]
[{"$nulls":5},"LN","RP","P"]
[null,"-",0,null,"tkm"]
[null,"-",0,null,"tkm"]
[null,null,null,"Custo unitário total de transporte"]
[{"$nulls":5},"Custo unitário direto total",null,null,null,{"$f":"TRUNC(J1337+J1341,2)","v":696.66}]
[null,"Obs."]
[]
[{"$f":"A1307+1","v":43},"1ª/GRD",{"$nulls":8},{"$f":"J1386","v":901.16}]
[null,"OBRA:"," PAVIMENTAÇÃO ASFÁLTICA EM CBUQ - ESTRADA PARA SANTANA DO MUNDO NOVO (JURAMENTO / MG)"]
[null,"Custo Unitário de Referência",null,null,"Minas Gerais"]
[{"$nulls":4}," Janeiro/2025",null,null,"Produção da equipe ",2,{"$f":"VLOOKUP(A1350,ORÇAMENTO!$A$10:$L$59,7,1)","v":"UN."}]
[null,"5213489a","PLACA EM AÇO - 1,50X0,60M - PELÍCULA RETRORREFLETIVA - FORNECIMENTO E INSTALAÇÃO, INCLUSIVE  SUPORTE",{"$nulls":5},"Valores em reais (R$)"]
[null,"A - EQUIPAMENTOS",null,"Quantidade","Utilização",null,"Custo Horário",null,null,"Custo"]
[{"$nulls":4},"Operativa","Improdutiva","Produtivo","Improdutivo",null,"Horário Total"]
[null,"E9687","Caminhão carroceria com capacidade de 5 t - 115 kW",1,0.3,0.7,146.88079999999999,57.423099999999998,null,{"$f":"D1357*(E1357*G1357+F1357*H1357)","v":84.260409999999993}]
[null,"-",0,null,null,null,0,0,null,{"$f":"D1358*(E1358*G1358+F1358*H1358)","v":0}]
[{"$nulls":7},"Custo horário total de equipamentos",null,{"$f":"SUM(J1357:J1358)","v":84.260409999999993}]
[null,"B - MÃO DE OBRA",null,"Quantidade","Unidade",null,"Custo Horário","Custo Horário Total"]
[null,"P9830","Montador",1,"h",null,36.409500000000001,null,null,{"$f":"D1361*G1361","v":36.409500000000001}]
[null,"P9824","Servente",2,"h",null,21.3355,null,null,{"$f":"D1362*G1362","v":42.670999999999999}]
[null,null,null,"Custo horário total de mão de obra",{"$nulls":5},{"$f":"SUM(J1361:J1362)","v":79.080500000000001}]
[null,null,null,"Custo horário total de execução",{"$nulls":5},{"$f":"J1359+J1363","v":163.34091000000001}]
[null,null,null,"Custo unitário de execução",{"$nulls":5},{"$f":"J1364/I1353","v":81.670455000000004}]
[{"$nulls":7},"Custo do FIC",null,0]
[{"$nulls":7},"Custo do FIT",null,0]
[null,"C - MATERIAL",null,"Quantidade","Unidade",null,"Preço Unitário","Custo Unitário"]
[null,"-",0,0,0,null,0,null,null,{"$f":"D1369*G1369","v":0}]
[null,"-",0,0,0,null,0,null,null,0]
[null,null,null,"Custo unitário total de material",{"$nulls":5},{"$f":"SUM(J1369:J1370)","v":0}]
[null,"D - ATIVIDADES AUXILIARES",null,"Quantidade","Unidade",null,"Custo Unitário","Custo Unitário"]
[null,5213416,"Placa em aço nº 16 galvanizado com película retrorrefletiva tipo I + I - confecção",0.89999999999999991,"m²",null,402.67,null,null,{"$f":"D1373*G1373","v":362.40299999999996}]
[null,5213863,"Suporte metálico galvanizado para placa de advertência ou regulamentação - lado ou diâmetro de 0,60 m - fornecimento e implantação",1,"un",null,457.09,null,null,{"$f":"D1374*G1374","v":457.09}]
[null,null,null,"Custo total de atividades auxiliares",{"$nulls":5},{"$f":"SUM(J1373:J1374)","v":819.49299999999994}]
[{"$nulls":7},"Subtotal",null,{"$f":"J1365+J1371+J1375+J1366+J1367","v":901.16345499999989}]
[null,"E - TEMPO FIXO",null,"Código","Quantidade","Unidade",null,"Custo Unitário","Custo Unitário"]
[null,"-",0,"-",0,"t",null,0,null,{"$f":"ROUNDDOWN(E1378*H1378,4)","v":0}]
[null,"-",0,"-",0,"t",null,0,null,{"$f":"ROUNDDOWN(E1379*H1379,4)","v":0}]
[null,null,null,"Custo unitário total de tempo fixo",{"$nulls":5},{"$f":"SUM(J1378:J1379)","v":0}]
[null,"F - MOMENTO DE TRANSPORTE",null,"Quantidade","Unidade","DMT",null,null,null,"Custo Unitário"]
[{"$nulls":5},"LN","RP","P"]
[null,"-",0,0,"tkm"]
[null,"-",0,0,"tkm"]
[null,null,null,"Custo unitário total de transporte"]
[{"$nulls":5},"Custo unitário direto total",null,null,null,{"$f":"TRUNC(J1376+J1380,2)","v":901.16}]
[null,"Obs."]
[]
[{"$f":"A1350+1","v":44},"1ª/GRD",{"$nulls":8},{"$f":"J1425","v":716.58}]
[null,"OBRA:"," PAVIMENTAÇÃO ASFÁLTICA EM CBUQ - ESTRADA PARA SANTANA DO MUNDO NOVO (JURAMENTO / MG)"]
[null,"Custo Unitário de Referência",null,null,"Minas Gerais"]
[{"$nulls":4}," Janeiro/2025",null,null,"Produção da equipe ",3,{"$f":"VLOOKUP(A1389,ORÇAMENTO!$A$10:$L$59,7,1)","v":"UN."}]
[null,"5213464a","PLACA DE ADVERTÊNCIA EM AÇO, LADO DE 60CM - PELÍCULA RETRORREFLETIVA - FORNECIMENTO E INSTALAÇÃO, INCLUSIVE  SUPORTE",{"$nulls":5},"Valores em reais (R$)"]
[null,"A - EQUIPAMENTOS",null,"Quantidade","Utilização",null,"Custo Horário",null,null,"Custo"]
[{"$nulls":4},"Operativa","Improdutiva","Produtivo","Improdutivo",null,"Horário Total"]
[null,"E9687","Caminhão carroceria com capacidade de 5 t - 115 kW",1,0.3,0.7,146.88079999999999,57.423099999999998,null,{"$f":"D1396*(E1396*G1396+F1396*H1396)","v":84.260409999999993}]
[null,"-",0,null,null,null,0,0,null,{"$f":"D1397*(E1397*G1397+F1397*H1397)","v":0}]
[{"$nulls":7},"Custo horário total de equipamentos",null,{"$f":"SUM(J1396:J1397)","v":84.260409999999993}]
[null,"B - MÃO DE OBRA",null,"Quantidade","Unidade",null,"Custo Horário","Custo Horário Total"]
[null,"P9830","Montador",1,"h",null,36.409500000000001,null,null,{"$f":"D1400*G1400","v":36.409500000000001}]
[null,"P9824","Servente",2,"h",null,21.3355,null,null,{"$f":"D1401*G1401","v":42.670999999999999}]
[null,null,null,"Custo horário total de mão de obra",{"$nulls":5},{"$f":"SUM(J1400:J1401)","v":79.080500000000001}]
[null,null,null,"Custo horário total de execução",{"$nulls":5},{"$f":"J1398+J1402","v":163.34091000000001}]
[null,null,null,"Custo unitário de execução",{"$nulls":5},{"$f":"J1403/I1392","v":54.44697}]
[{"$nulls":7},"Custo do FIC",null,0]
[{"$nulls":7},"Custo do FIT",null,0]
[null,"C - MATERIAL",null,"Quantidade","Unidade",null,"Preço Unitário","Custo Unitário"]
[null,"-",0,null,0,null,0,null,null,{"$f":"D1408*G1408","v":0}]
[null,"-",0,null,0,null,0,null,null,0]
[null,null,null,"Custo unitário total de material",{"$nulls":5},{"$f":"SUM(J1408:J1409)","v":0}]
[null,"D - ATIVIDADES AUXILIARES",null,"Quantidade","Unidade",null,"Custo Unitário","Custo Unitário"]
[null,5213414,"Placa em aço nº 16 galvanizado com película retrorrefletiva tipo I + SI - confecção",0.36,"m²",null,569.58000000000004,null,null,{"$f":"D1412*G1412","v":205.0488}]
[null,5213863,"Suporte metálico galvanizado para placa de advertência ou regulamentação - lado ou diâmetro de 0,60 m - fornecimento e implantação",1,"un",null,457.09,null,null,{"$f":"D1413*G1413","v":457.09}]
[null,null,null,"Custo total de atividades auxiliares",{"$nulls":5},{"$f":"SUM(J1412:J1413)","v":662.13879999999995}]
[{"$nulls":7},"Subtotal",null,{"$f":"J1404+J1410+J1414+J1405+J1406","v":716.58576999999991}]
[null,"E - TEMPO FIXO",null,"Código","Quantidade","Unidade",null,"Custo Unitário","Custo Unitário"]
[null,"-",0,"-",null,"t",null,0,null,{"$f":"ROUNDDOWN(E1417*H1417,4)","v":0}]
[null,"-",0,"-",null,"t",null,0,null,{"$f":"ROUNDDOWN(E1418*H1418,4)","v":0}]
[null,null,null,"Custo unitário total de tempo fixo",{"$nulls":5},{"$f":"SUM(J1417:J1418)","v":0}]
[null,"F - MOMENTO DE TRANSPORTE",null,"Quantidade","Unidade","DMT",null,null,null,"Custo Unitário"]
[{"$nulls":5},"LN","RP","P"]
[null,"-",0,null,"tkm"]
[null,"-",0,null,"tkm"]
[null,null,null,"Custo unitário total de transporte"]
[{"$nulls":5},"Custo unitário direto total",null,null,null,{"$f":"TRUNC(J1415+J1419,2)","v":716.58}]
[null,"Obs."]
[]
[{"$f":"A1389+1","v":45},"1ª/GRD",{"$nulls":8},{"$f":"J1464","v":716.55}]
[null,"OBRA:"," PAVIMENTAÇÃO ASFÁLTICA EM CBUQ - ESTRADA PARA SANTANA DO MUNDO NOVO (JURAMENTO / MG)"]
[null,"Custo Unitário de Referência",null,null,"Minas Gerais"]
[{"$nulls":4}," Janeiro/2025",null,null,"Produção da equipe ",3,{"$f":"VLOOKUP(A1428,ORÇAMENTO!$A$10:$L$59,7,1)","v":"UN."}]
[null,"5213440a","PLACA DE REGULAMENTAÇÃO EM AÇO, D=60CM - PELÍCULA RETRORREFLETIVA - FORNECIMENTO E INSTALAÇÃO, INCLUSIVE  SUPORTE",{"$nulls":5},"Valores em reais (R$)"]
[null,"A - EQUIPAMENTOS",null,"Quantidade","Utilização",null,"Custo Horário",null,null,"Custo"]
[{"$nulls":4},"Operativa","Improdutiva","Produtivo","Improdutivo",null,"Horário Total"]
[null,"E9687","Caminhão carroceria com capacidade de 5 t - 115 kW",1,0.3,0.7,146.88079999999999,57.423099999999998,null,{"$f":"D1435*(E1435*G1435+F1435*H1435)","v":84.260409999999993}]
[null,"-",0,null,null,null,0,0,null,{"$f":"D1436*(E1436*G1436+F1436*H1436)","v":0}]
[{"$nulls":7},"Custo horário total de equipamentos",null,{"$f":"SUM(J1435:J1436)","v":84.260409999999993}]
[null,"B - MÃO DE OBRA",null,"Quantidade","Unidade",null,"Custo Horário","Custo Horário Total"]
[null,"P9830","Montador",1,"h",null,36.409500000000001,null,null,{"$f":"D1439*G1439","v":36.409500000000001}]
[null,"P9824","Servente",2,"h",null,21.3355,null,null,{"$f":"D1440*G1440","v":42.670999999999999}]
[null,null,null,"Custo horário total de mão de obra",{"$nulls":5},{"$f":"SUM(J1439:J1440)","v":79.080500000000001}]
[null,null,null,"Custo horário total de execução",{"$nulls":5},{"$f":"J1437+J1441","v":163.34091000000001}]
[null,null,null,"Custo unitário de execução",{"$nulls":5},{"$f":"J1442/I1431","v":54.44697}]
[{"$nulls":7},"Custo do FIC",null,0]
[{"$nulls":7},"Custo do FIT",null,0]
[null,"C - MATERIAL",null,"Quantidade","Unidade",null,"Preço Unitário","Custo Unitário"]
[null,"-",0,null,0,null,0,null,null,{"$f":"D1447*G1447","v":0}]
[null,"-",0,null,0,null,0,null,null,{"$f":"D1448*G1448","v":0}]
[null,null,null,"Custo unitário total de material",{"$nulls":5},{"$f":"SUM(J1447:J1448)","v":0}]
[null,"D - ATIVIDADES AUXILIARES",null,"Quantidade","Unidade",null,"Custo Unitário","Custo Unitário"]
[null,5213414,"Placa em aço nº 16 galvanizado com película retrorrefletiva tipo I + SI - confecção",0.35993999999999998,"m²",null,569.58000000000004,null,null,{"$f":"D1451*G1451","v":205.01462520000001}]
[null,5213863,"Suporte metálico galvanizado para placa de advertência ou regulamentação - lado ou diâmetro de 0,60 m - fornecimento e implantação",1,"un",null,457.09,null,null,{"$f":"D1452*G1452","v":457.09}]
[null,null,null,"Custo total de atividades auxiliares",{"$nulls":5},{"$f":"SUM(J1451:J1452)","v":662.10462519999999}]
[{"$nulls":7},"Subtotal",null,{"$f":"J1443+J1449+J1453+J1444+J1445","v":716.55159519999995}]
[null,"E - TEMPO FIXO",null,"Código","Quantidade","Unidade",null,"Custo Unitário","Custo Unitário"]
[null,"-",0,"-",null,"t",null,0,null,{"$f":"ROUNDDOWN(E1456*H1456,4)","v":0}]
[null,"-",0,"-",null,"t",null,0,null,{"$f":"ROUNDDOWN(E1457*H1457,4)","v":0}]
[null,null,null,"Custo unitário total de tempo fixo",{"$nulls":5},{"$f":"SUM(J1456:J1457)","v":0}]
[null,"F - MOMENTO DE TRANSPORTE",null,"Quantidade","Unidade","DMT",null,null,null,"Custo Unitário"]
[{"$nulls":5},"LN","RP","P"]
[null,"-",0,null,"tkm"]
[null,"-",0,null,"tkm"]
[null,null,null,"Custo unitário total de transporte"]
[{"$nulls":5},"Custo unitário direto total",null,null,null,{"$f":"TRUNC(J1454+J1458,2)","v":716.55}]
[null,"Obs."]
[]
[48,"1ª/GRD",{"$nulls":8},{"$f":"J1510","v":29.17}]
[null,"OBRA:"," PAVIMENTAÇÃO ASFÁLTICA EM CBUQ - ESTRADA PARA SANTANA DO MUNDO NOVO (JURAMENTO / MG)"]
[null,"Custo Unitário de Referência",null,null,"Minas Gerais"]
[{"$nulls":4}," Janeiro/2025",null,null,"Produção da equipe ",149.4,{"$f":"VLOOKUP(A1467,ORÇAMENTO!$A$10:$L$59,7,1)","v":"M2"}]
[null,5213401,"PINTURA DE EIXO VIÁRIO SOBRE ASFALTO COM TINTA RETRORREFLETIVA A BASE DE RESINA ACRÍLICA COM MICROESFERAS DE VIDRO, APLICAÇÃO MECÂNICA COM DEMARCADORA AUTOPROPELIDA",{"$nulls":5},"Valores em reais (R$)"]
[null,"A - EQUIPAMENTOS",null,"Quantidade","Utilização",null,"Custo Horário",null,null,"Custo"]
[{"$nulls":4},"Operativa","Improdutiva","Produtivo","Improdutivo",null,"Horário Total"]
[null,"E9644","Caminhão demarcador de faixas com sistema de pintura a frio - 28 kW/115 kW",1,1,0,374.84390000000002,155.3843,null,{"$f":"D1474*(E1474*G1474+F1474*H1474)","v":374.84390000000002}]
[null,"-",0,null,null,null,0,0,null,{"$f":"D1475*(E1475*G1475+F1475*H1475)","v":0}]
[{"$nulls":7},"Custo horário total de equipamentos",null,{"$f":"SUM(J1474:J1475)","v":374.84390000000002}]
[null,"B - MÃO DE OBRA",null,"Quantidade","Unidade",null,"Custo Horário","Custo Horário Total"]
[null,"P9853","Pré-marcador",1,"h",null,22.8993,null,null,{"$f":"D1478*G1478","v":22.8993}]
[null,"P9824","Servente",4,"h",null,21.3355,null,null,{"$f":"D1479*G1479","v":85.341999999999999}]
[null,null,null,"Custo horário total de mão de obra",{"$nulls":5},{"$f":"SUM(J1478:J1479)","v":108.2413}]
[null,null,null,"Custo horário total de execução",{"$nulls":5},{"$f":"J1476+J1480","v":483.08519999999999}]
[null,null,null,"Custo unitário de execução",{"$nulls":5},{"$f":"J1481/I1470","v":3.2335020080321284}]
[{"$nulls":7},"Custo do FIC",null,0]
[{"$nulls":7},"Custo do FIT",null,0]
[null,"C - MATERIAL",null,"Quantidade","Unidade",null,"Preço Unitário","Custo Unitário"]
[null,"M2037","Microesferas refletivas de vidro tipo I-B",0.12,"kg",null,8.7245000000000008,null,null,{"$f":"D1486*G1486","v":1.04694}]
[null,"M2038","Microesferas refletivas de vidro tipo II-A",0.35,"kg",null,8.9086999999999996,null,null,{"$f":"D1487*G1487","v":3.1180449999999995}]
[null,"M2034","Solvente para tinta à base de resina acrílica",0.03,"l",null,16.8491,null,null,0.50547299999999995]
[null,"M2044","Tinta à base de resina acrílica emulsionada em água para pré-marcação viária",9.7000000000000005E-4,"l",null,21.025400000000001,null,null,2.0394638000000003E-2]
[null,"M2027","Tinta à base de resina acrílica estirenada para demarcação viária",0.6,"l",null,35.350499999999997,null,null,21.210299999999997]
[null,null,null,"Custo unitário total de material",{"$nulls":5},{"$f":"SUM(J1486:J1490)","v":25.901152637999996}]
[null,"D - ATIVIDADES AUXILIARES",null,"Quantidade","Unidade",null,"Custo Unitário","Custo Unitário"]
[null,"-",0,null,0,null,0,null,null,{"$f":"D1493*G1493","v":0}]
[null,"-",0,null,0,null,0,null,null,{"$f":"D1494*G1494","v":0}]
[null,null,null,"Custo total de atividades auxiliares",{"$nulls":5},{"$f":"SUM(J1493:J1494)","v":0}]
[{"$nulls":7},"Subtotal",null,{"$f":"J1482+J1491+J1495+J1483+J1484","v":29.134654646032125}]
[null,"E - TEMPO FIXO",null,"Código","Quantidade","Unidade",null,"Custo Unitário","Custo Unitário"]
[null,"M2037","Microesferas refletivas de vidro tipo I-B",5914655,1.2E-4,"t",null,32.520000000000003,null,{"$f":"ROUNDDOWN(E1498*H1498,4)","v":3.8999999999999998E-3}]
[null,"M2038","Microesferas refletivas de vidro tipo II-A",5914655,3.5E-4,"t",null,32.520000000000003,null,{"$f":"ROUNDDOWN(E1499*H1499,4)","v":1.1299999999999999E-2}]
[null,"M2034","Solvente para tinta à base de resina acrílica",5914655,3.0000000000000001E-5,"t",null,32.520000000000003,null,8.9999999999999998E-4]
[null,"M2027","Tinta à base de resina acrílica estirenada para demarcação viária",5914655,8.3000000000000001E-4,"t",null,32.520000000000003,null,2.69E-2]
[null,null,null,"Custo unitário total de tempo fixo",{"$nulls":5},{"$f":"SUM(J1498:J1501)","v":4.2999999999999997E-2}]
[null,"F - MOMENTO DE TRANSPORTE",null,"Quantidade","Unidade","DMT",null,null,null,"Custo Unitário"]
[{"$nulls":5},"LN","RP","P"]
[null,"M2037","Microesferas refletivas de vidro tipo I-B",1.2E-4,"tkm"]
[null,"M2038","Microesferas refletivas de vidro tipo II-A",3.5E-4,"tkm"]
[null,"M2034","Solvente para tinta à base de resina acrílica",3.0000000000000001E-5,"tkm"]
[null,"M2027","Tinta à base de resina acrílica estirenada para demarcação viária",8.3000000000000001E-4,"tkm"]
[null,null,null,"Custo unitário total de transporte"]
[{"$nulls":5},"Custo unitário direto total",null,null,null,{"$f":"TRUNC(J1496+J1502,2)","v":29.17}]
[null,"Obs."]
[]
[{"$f":"A1467+1","v":49},"1ª/GRD",{"$nulls":8},{"$f":"J1551","v":31.08}]
[null,"OBRA:"," PAVIMENTAÇÃO ASFÁLTICA EM CBUQ - ESTRADA PARA SANTANA DO MUNDO NOVO (JURAMENTO / MG)"]
[null,"Custo Unitário de Referência",null,null,"Minas Gerais"]
[{"$nulls":4}," Janeiro/2025",null,null,"Produção da equipe ",36,{"$f":"VLOOKUP(A1513,ORÇAMENTO!$A$10:$L$59,7,1)","v":"UNID."}]
[null,5213360,"TACHA REFLETIVA EM PLÁSTICO INJETADO - BIDIRECIONAL COM UM PINO - FORNECIMENTO E COLOCAÇÃO",{"$nulls":5},"Valores em reais (R$)"]
[null,"A - EQUIPAMENTOS",null,"Quantidade","Utilização",null,"Custo Horário",null,null,"Custo"]
[{"$nulls":4},"Operativa","Improdutiva","Produtivo","Improdutivo",null,"Horário Total"]
[null,"E9687","Caminhão carroceria com capacidade de 5 t - 115 kW",1,1,0,146.88079999999999,57.423099999999998,null,{"$f":"D1520*(E1520*G1520+F1520*H1520)","v":146.88079999999999}]
[null,"E9764","Grupo gerador - 7,2 kVA",1,1,0,10.466200000000001,0.4899,null,{"$f":"D1521*(E1521*G1521+F1521*H1521)","v":10.466200000000001}]
[null,"E9675","Martelete perfurador/rompedor elétrico - 1,50 kW",1,1,0,1.2357,0.68189999999999995,null,{"$f":"D1522*(E1522*G1522+F1522*H1522)","v":1.2357}]
[{"$nulls":7},"Custo horário total de equipamentos",null,{"$f":"SUM(J1520:J1522)","v":158.58269999999999}]
[null,"B - MÃO DE OBRA",null,"Quantidade","Unidade",null,"Custo Horário","Custo Horário Total"]
[null,"P9830","Montador",1,"h",null,36.409500000000001,null,null,{"$f":"D1525*G1525","v":36.409500000000001}]
[null,"P9824","Servente",5,"h",null,21.3355,null,null,{"$f":"D1526*G1526","v":106.67749999999999}]
[null,null,null,"Custo horário total de mão de obra",{"$nulls":5},{"$f":"SUM(J1525:J1526)","v":143.08699999999999}]
[null,null,null,"Custo horário total de execução",{"$nulls":5},{"$f":"J1523+J1527","v":301.66969999999998}]
[null,null,null,"Custo unitário de execução",{"$nulls":5},{"$f":"J1528/I1516","v":8.3797138888888885}]
[{"$nulls":7},"Custo do FIC",null,0]
[{"$nulls":7},"Custo do FIT",null,0]
[null,"C - MATERIAL",null,"Quantidade","Unidade",null,"Preço Unitário","Custo Unitário"]
[null,"M2041","Adesivo à base de resina poliéster",0.10292,"kg",null,28.1373,null,null,{"$f":"D1533*G1533","v":2.8958909159999999}]
[null,"M1528","Broca de widia - D = 13 mm e C = 150 mm",3.4099999999999998E-3,"un",null,20.665500000000002,null,null,{"$f":"D1534*G1534","v":7.0469354999999997E-2}]
[null,"M3821","Tacha refletiva em plástico injetado bidirecional com um pino - tipo I",1,"un",null,19.734000000000002,null,null,19.734000000000002]
[null,null,null,"Custo unitário total de material",{"$nulls":5},{"$f":"SUM(J1533:J1535)","v":22.700360271000001}]
[null,"D - ATIVIDADES AUXILIARES",null,"Quantidade","Unidade",null,"Custo Unitário","Custo Unitário"]
[null,"-",0,null,0,null,0,null,null,{"$f":"D1538*G1538","v":0}]
[null,"-",0,null,0,null,0,null,null,{"$f":"D1539*G1539","v":0}]
[null,null,null,"Custo total de atividades auxiliares",{"$nulls":5},{"$f":"SUM(J1538:J1539)","v":0}]
[{"$nulls":7},"Subtotal",null,{"$f":"J1529+J1536+J1540+J1530+J1531","v":31.080074159888888}]
[null,"E - TEMPO FIXO",null,"Código","Quantidade","Unidade",null,"Custo Unitário","Custo Unitário"]
[null,"M2041","Adesivo à base de resina poliéster",5914655,1E-4,"t",null,32.520000000000003,null,{"$f":"ROUNDDOWN(E1543*H1543,4)","v":3.2000000000000002E-3}]
[null,"M3821","Tacha refletiva em plástico injetado bidirecional com um pino - tipo I",5914655,1.6000000000000001E-4,"t",null,32.520000000000003,null,{"$f":"ROUNDDOWN(E1544*H1544,4)","v":5.1999999999999998E-3}]
[null,null,null,"Custo unitário total de tempo fixo",{"$nulls":5},{"$f":"SUM(J1543:J1544)","v":8.3999999999999995E-3}]
[null,"F - MOMENTO DE TRANSPORTE",null,"Quantidade","Unidade","DMT",null,null,null,"Custo Unitário"]
[{"$nulls":5},"LN","RP","P"]
[null,"M2041","Adesivo à base de resina poliéster",1E-4,"tkm"]
[null,"M3821","Tacha refletiva em plástico injetado bidirecional com um pino - tipo I",1.6000000000000001E-4,"tkm"]
[null,null,null,"Custo unitário total de transporte"]
[{"$nulls":5},"Custo unitário direto total",null,null,null,{"$f":"TRUNC(J1541+J1545,2)","v":31.08}]
[null,"Obs."]
[]
[{"$f":"A1513+1","v":50},"1ª/GRD",{"$nulls":8},{"$f":"J1597","v":41.95}]
[null,"OBRA:"," PAVIMENTAÇÃO ASFÁLTICA EM CBUQ - ESTRADA PARA SANTANA DO MUNDO NOVO (JURAMENTO / MG)"]
[null,"Custo Unitário de Referência",null,null,"Minas Gerais"]
[{"$nulls":4}," Janeiro/2025",null,null,"Produção da equipe ",30.18,{"$f":"VLOOKUP(A1554,ORÇAMENTO!$A$10:$L$59,7,1)","v":"M2"}]
[null,5213405,"PINTURA DE FAIXA DE PEDESTRE OU ZEBRADA TINTA RETRORREFLETIVA A BASE DE RESINA ACRÍLICA COM MICROESFERAS DE VIDRO, APLICAÇÃO MANUAL",{"$nulls":5},"Valores em reais (R$)"]
[null,"A - EQUIPAMENTOS",null,"Quantidade","Utilização",null,"Custo Horário",null,null,"Custo"]
[{"$nulls":4},"Operativa","Improdutiva","Produtivo","Improdutivo",null,"Horário Total"]
[null,"E9644","Caminhão demarcador de faixas com sistema de pintura a frio - 28 kW/115 kW",1,1,0,374.84390000000002,155.3843,null,{"$f":"D1561*(E1561*G1561+F1561*H1561)","v":374.84390000000002}]
[null,"-",0,null,null,null,0,0,null,{"$f":"D1562*(E1562*G1562+F1562*H1562)","v":0}]
[{"$nulls":7},"Custo horário total de equipamentos",null,{"$f":"SUM(J1561:J1562)","v":374.84390000000002}]
[null,"B - MÃO DE OBRA",null,"Quantidade","Unidade",null,"Custo Horário","Custo Horário Total"]
[null,"P9853","Pré-marcador",1,"h",null,22.8993,null,null,{"$f":"D1565*G1565","v":22.8993}]
[null,"P9824","Servente",4,"h",null,21.3355,null,null,{"$f":"D1566*G1566","v":85.341999999999999}]
[null,null,null,"Custo horário total de mão de obra",{"$nulls":5},{"$f":"SUM(J1565:J1566)","v":108.2413}]
[null,null,null,"Custo horário total de execução",{"$nulls":5},{"$f":"J1563+J1567","v":483.08519999999999}]
[null,null,null,"Custo unitário de execução",{"$nulls":5},{"$f":"J1568/I1557","v":16.006799204771372}]
[{"$nulls":7},"Custo do FIC",null,0]
[{"$nulls":7},"Custo do FIT",null,0]
[null,"C - MATERIAL",null,"Quantidade","Unidade",null,"Preço Unitário","Custo Unitário"]
[null,"M2037","Microesferas refletivas de vidro tipo I-B",0.12,"kg",null,8.7245000000000008,null,null,{"$f":"D1573*G1573","v":1.04694}]
[null,"M2038","Microesferas refletivas de vidro tipo II-A",0.35,"kg",null,8.9086999999999996,null,null,{"$f":"D1574*G1574","v":3.1180449999999995}]
[null,"M2034","Solvente para tinta à base de resina acrílica",0.03,"l",null,16.8491,null,null,0.50547299999999995]
[null,"M2044","Tinta à base de resina acrílica emulsionada em água para pré-marcação viária",9.7000000000000005E-4,"l",null,21.025400000000001,null,null,2.0394638000000003E-2]
[null,"M2027","Tinta à base de resina acrílica estirenada para demarcação viária",0.6,"l",null,35.350499999999997,null,null,21.210299999999997]
[null,null,null,"Custo unitário total de material",{"$nulls":5},{"$f":"SUM(J1573:J1577)","v":25.901152637999996}]
[null,"D - ATIVIDADES AUXILIARES",null,"Quantidade","Unidade",null,"Custo Unitário","Custo Unitário"]
[null,"-",0,null,0,null,0,null,null,{"$f":"D1580*G1580","v":0}]
[null,"-",0,null,0,null,0,null,null,{"$f":"D1581*G1581","v":0}]
[null,null,null,"Custo total de atividades auxiliares",{"$nulls":5},{"$f":"SUM(J1580:J1581)","v":0}]
[{"$nulls":7},"Subtotal",null,{"$f":"J1569+J1578+J1582+J1570+J1571","v":41.907951842771368}]
[null,"E - TEMPO FIXO",null,"Código","Quantidade","Unidade",null,"Custo Unitário","Custo Unitário"]
[null,"M2037","Microesferas refletivas de vidro tipo I-B",5914655,1.2E-4,"t",null,32.520000000000003,null,{"$f":"ROUNDDOWN(E1585*H1585,4)","v":3.8999999999999998E-3}]
[null,"M2038","Microesferas refletivas de vidro tipo II-A",5914655,3.5E-4,"t",null,32.520000000000003,null,{"$f":"ROUNDDOWN(E1586*H1586,4)","v":1.1299999999999999E-2}]
[null,"M2034","Solvente para tinta à base de resina acrílica",5914655,3.0000000000000001E-5,"t",null,32.520000000000003,null,8.9999999999999998E-4]
[null,"M2027","Tinta à base de resina acrílica estirenada para demarcação viária",5914655,8.3000000000000001E-4,"t",null,32.520000000000003,null,2.69E-2]
[null,null,null,"Custo unitário total de tempo fixo",{"$nulls":5},{"$f":"SUM(J1585:J1588)","v":4.2999999999999997E-2}]
[null,"F - MOMENTO DE TRANSPORTE",null,"Quantidade","Unidade","DMT",null,null,null,"Custo Unitário"]
[{"$nulls":5},"LN","RP","P"]
[null,"M2037","Microesferas refletivas de vidro tipo I-B",1.2E-4,"tkm"]
[null,"M2038","Microesferas refletivas de vidro tipo II-A",3.5E-4,"tkm"]
[null,"M2034","Solvente para tinta à base de resina acrílica",3.0000000000000001E-5,"tkm"]
[null,"M2027","Tinta à base de resina acrílica estirenada para demarcação viária",8.3000000000000001E-4,"tkm"]
[null,null,null,"Custo unitário total de transporte"]
[{"$nulls":5},"Custo unitário direto total",null,null,null,{"$f":"TRUNC(J1583+J1589,2)","v":41.95}]
[null,"Obs."]

{"sheet":"CPU-FORNEC","index":2,"n_rows":92,"n_cols":14,"rows_kept":92,"cut":false,"hidden":false,"merged":[[71,0,80,0],[71,1,71,3],[71,4,71,7],[72,2,72,5],[73,2,73,3],[74,1,74,7],[77,1,77,3],[77,5,77,6],[78,1,78,6],[79,1,79,6],[80,1,80,6],[0,0,26,0],[0,1,0,3],[0,4,0,7],[22,1,22,3],[49,0,58,0],[49,1,49,3],[49,4,49,7],[50,2,50,5],[51,2,51,3],[52,1,52,7],[55,1,55,3],[55,5,55,6],[56,1,56,6],[57,1,57,6],[58,1,58,6],[27,1,27,3],[27,4,27,7],[28,2,28,5],[27,0,36,0],[29,2,29,3],[30,1,30,7],[33,1,33,3],[33,5,33,6],[34,1,34,6],[35,1,35,6],[36,1,36,6],[0,10,0,11],[1,2,1,5],[1,10,1,11],[2,2,2,3],[3,1,3,7],[22,5,22,6],[23,1,23,6],[24,1,24,6],[25,1,25,6],[5,1,5,7],[9,1,9,7],[13,1,13,7],[17,1,17,7],[38,0,47,0],[38,1,38,3],[38,4,38,7],[39,2,39,5],[40,2,40,3],[41,1,41,7],[44,1,44,3],[44,5,44,6],[45,1,45,6],[46,1,46,6],[47,1,47,6],[60,0,69,0],[60,1,60,3],[60,4,60,7],[61,2,61,5],[62,2,62,3],[63,1,63,7],[66,1,66,3],[66,5,66,6],[67,1,67,6],[68,1,68,6],[69,1,69,6],[81,1,81,7],[82,0,91,0],[82,1,82,3],[82,4,82,7],[83,2,83,5],[84,2,84,3],[85,1,85,7],[88,1,88,3],[88,5,88,6],[89,1,89,6],[90,1,90,6],[91,1,91,6]]}
[1,"CODEVASF",null,null," COMPOSIÇÃO DE PREÇO UNITÁRIO",null,null,null,{"$f":"H24","v":0},{"$f":"H26","v":0},"BDI CALCULADO:",null,{"$f":"ORÇAMENTO!L5","v":22.26}]
[null,"OBRA:  "," PAVIMENTAÇÃO ASFÁLTICA EM CBUQ - ESTRADA PARA SANTANA DO MUNDO NOVO (JURAMENTO / MG)",null,null,null,"DATA: ",{"$f":"ORÇAMENTO!C6","v":" ABRIL / 2025 "},null,null,"BDI DIFERENCIADO:",null,{"$f":"'BDI FORN'!D31/100","v":0.15}]
[null,"SERVIÇO:  ","CPU.1",null,"Referência:","CODEVASF","UNIDADE: ",{"$f":"VLOOKUP(A1,ORÇAMENTO!A11:L30,5)","v":"MOBILIZAÇÃO E DESMOBILIZAÇÃO"}]
[]
[null,"TIPO ITEM","CODIGO ITEM","DESCRIÇÃO ITEM","UNIDADE ITEM","COEFICIENTE","PRECO UNITARIO","CUSTO TOTAL",null,"distancia =",90,"B.DESPACHO"]
[null,"EQUIPAMENTOS",{"$nulls":7},"Pá carregadeira ",null,null,10.1," ton"]
[null,null,"E9001","E9001","E9001",null,"E9001"]
[]
[]
[null,"MÃO DE OBRA"]
[]
[]
[]
[null,"MATERIAIS"]
[]
[]
[{"$nulls":7},{"$f":"ROUNDDOWN(F17*G17,2)","v":0},null,"Motoniveladora ",null,null,12.47," ton"]
[null,"ATIVIDADES AUXILIARES",{"$nulls":7},"Trator de pneus",null,null,2.8," ton"]
[{"$nulls":7},{"$f":"ROUNDDOWN(F19*G19,2)","v":0}]
[{"$nulls":7},0]
[{"$nulls":7},0]
[{"$nulls":7},{"$f":"ROUNDDOWN(F22*G22,2)","v":0},null,"Rolo Compactador ",null,null,15.33," ton"]
[null,"PRODUÇÃO DA EQUIPE",null,null,1,"CUSTO ",null,{"$f":"SUM(H6:H22)","v":0},null,"Grade de disco",null,null,1," ton"]
[null,"TOTAL",{"$nulls":5},{"$f":"H23/E23","v":0},"OK","RETROESCAVADEIRA",null,null,6.67," ton"]
[null,"BDI                %",{"$nulls":5},{"$f":"1+$M$1","v":23.26}]
[null,"TOTAL DO SERVIÇO - R$",{"$nulls":5},{"$f":"ROUND(H24*H25,2)","v":0}]
[]
["F1","CODEVASF",null,null," COMPOSIÇÃO DE PREÇO UNITÁRIO",null,null,null,{"$f":"H35","v":3532.13},{"$f":"H37","v":4061.95}]
[null,"OBRA:  "," PAVIMENTAÇÃO ASFÁLTICA EM CBUQ - ESTRADA PARA SANTANA DO MUNDO NOVO (JURAMENTO / MG)",null,null,null,"DATA: ",{"$f":"$H$2","v":" ABRIL / 2025 "}]
[null,"SERVIÇO:  ","AQUISIÇÃO DE EMULSÃO ASFÁLTICA PARA IMPRIMAÇÃO (EAI) - EXCLUSIVE TRANSPORTE",null,"FONTE","CPU.7","UNIDADE: ",{"$f":"VLOOKUP(A28,ORÇAMENTO!$A$11:$L$66,7)","v":"T"}]
[]
[null,"TIPO ITEM","CODIGO ITEM","DESCRIÇÃO ITEM","UNIDADE ITEM","COEFICIENTE","PRECO UNITARIO","CUSTO TOTAL"]
[null,"INSUMO","ANP","EMULSÃO ASFÁLTICA PARA SERVIÇO DE IMPRIMAÇÃO (MEMÓRIA EM ANEXO)","T",1,3532.1370595881235,{"$f":"ROUNDDOWN(F33*G33,2)","v":3532.13}]
[null,"PRODUÇÃO DA EQUIPE",null,null,1,"CUSTO ",null,{"$f":"SUM(H33:H33)","v":3532.13}]
[null,"TOTAL",{"$nulls":5},{"$f":"H34/E34","v":3532.13}]
[null,"BDI                %",{"$nulls":5},{"$f":"1+$M$2","v":1.1499999999999999}]
[null,"TOTAL DO SERVIÇO - R$",{"$nulls":5},{"$f":"ROUND(H35*H36,2)","v":4061.95},"OK"]
[]
["F2","CODEVASF",null,null," COMPOSIÇÃO DE PREÇO UNITÁRIO",null,null,null,{"$f":"H46","v":401.49},{"$f":"H48","v":461.71}]
[null,"OBRA:  "," PAVIMENTAÇÃO ASFÁLTICA EM CBUQ - ESTRADA PARA SANTANA DO MUNDO NOVO (JURAMENTO / MG)",null,null,null,"DATA: ",{"$f":"$H$2","v":" ABRIL / 2025 "}]
[null,"SERVIÇO:  ","TRANSPORTE DE EMULSÃO ASFÁLTICA PARA IMPRIMAÇÃO (EAI)",null,"FONTE","CPU.8","UNIDADE: ",{"$f":"VLOOKUP(A39,ORÇAMENTO!$A$11:$L$66,7)","v":"T"}]
[]
[null,"TIPO ITEM","CODIGO ITEM","DESCRIÇÃO ITEM","UNIDADE ITEM","COEFICIENTE","PRECO UNITARIO","CUSTO TOTAL"]
[null,"INSUMO"," - ","TRANSPORTE DE EMULSÃO ASFÁLTICA PARA IMPRIMAÇÃO (EAI), INCLUINDO CUSTO TOTAL DO TRANSPORTE (COMBUSTÍVEL, PEDÁGIOS, ETC.) E ICMS - MEMÓRIA ANEXA","T",1,401.495,{"$f":"ROUNDDOWN(F44*G44,2)","v":401.49}]
[null,"PRODUÇÃO DA EQUIPE",null,null,1,"CUSTO ",null,{"$f":"SUM(H44:H44)","v":401.49}]
[null,"TOTAL",{"$nulls":5},{"$f":"H45/E45","v":401.49}]
[null,"BDI                %",{"$nulls":5},{"$f":"1+$M$2","v":1.1499999999999999}]
[null,"TOTAL DO SERVIÇO - R$",{"$nulls":5},{"$f":"ROUND(H46*H47,2)","v":461.71},"OK"]
[]
["F3","CODEVASF",null,null," COMPOSIÇÃO DE PREÇO UNITÁRIO",null,null,null,{"$f":"H57","v":3480.79},{"$f":"H59","v":4002.91}]
[null,"OBRA:  "," PAVIMENTAÇÃO ASFÁLTICA EM CBUQ - ESTRADA PARA SANTANA DO MUNDO NOVO (JURAMENTO / MG)",null,null,null,"DATA: ",{"$f":"$H$2","v":" ABRIL / 2025 "}]
[null,"SERVIÇO:  ","AQUISIÇÃO DE EMULSAO ASFALTICA CATIONICA RR-1C - EXCLUSIVE TRANSPORTE",null,"FONTE","CPU.9","UNIDADE: ",{"$f":"VLOOKUP(A50,ORÇAMENTO!$A$11:$L$66,7)","v":"T"}]
[]
[null,"TIPO ITEM","CODIGO ITEM","DESCRIÇÃO ITEM","UNIDADE ITEM","COEFICIENTE","PRECO UNITARIO","CUSTO TOTAL"]
[null,"INSUMO","ANP","EMULSÃO ASFÁLTICA CATIÔNICA RR-1C(MEMÓRIA EM ANEXO)","T",1,3480.7926129148304,{"$f":"ROUNDDOWN(F55*G55,2)","v":3480.79}]
[null,"PRODUÇÃO DA EQUIPE",null,null,1,"CUSTO ",null,{"$f":"SUM(H55:H55)","v":3480.79}]
[null,"TOTAL",{"$nulls":5},{"$f":"H56/E56","v":3480.79},"OK"]
[null,"BDI                %",{"$nulls":5},{"$f":"1+$M$2","v":1.1499999999999999}]
[null,"TOTAL DO SERVIÇO - R$",{"$nulls":5},{"$f":"ROUND(H57*H58,2)","v":4002.91}]
[]
["F4","CODEVASF",null,null," COMPOSIÇÃO DE PREÇO UNITÁRIO",null,null,null,{"$f":"H68","v":496.62},{"$f":"H70","v":571.11}]
[null,"OBRA:  "," PAVIMENTAÇÃO ASFÁLTICA EM CBUQ - ESTRADA PARA SANTANA DO MUNDO NOVO (JURAMENTO / MG)",null,null,null,"DATA: ",{"$f":"$H$2","v":" ABRIL / 2025 "}]
[null,"SERVIÇO:  ","TRANSPORTE DE EMULSÃO ASFÁLTICA CATIONICA RR-1C",null,"FONTE","CPU.10","UNIDADE: ",{"$f":"VLOOKUP(A61,ORÇAMENTO!$A$11:$L$66,7)","v":"T"}]
[]
[null,"TIPO ITEM","CODIGO ITEM","DESCRIÇÃO ITEM","UNIDADE ITEM","COEFICIENTE","PRECO UNITARIO","CUSTO TOTAL"]
[null,"INSUMO"," - ","TRANSPORTE DE EMULSÃO ASFÁLTICA CATIONICA TIPO RR-1C, INCLUINDO CUSTO TOTAL DO TRANSPORTE (COMBUSTÍVEL, PEDÁGIOS, ETC.) E ICMS - MEMÓRIA ANEXA","T",1,496.62045045045045,{"$f":"ROUNDDOWN(F66*G66,2)","v":496.62}]
[null,"PRODUÇÃO DA EQUIPE",null,null,1,"CUSTO ",null,{"$f":"SUM(H66:H66)","v":496.62}]
[null,"TOTAL",{"$nulls":5},{"$f":"H67/E67","v":496.62},"OK"]
[null,"BDI                %",{"$nulls":5},{"$f":"1+$M$2","v":1.1499999999999999}]
[null,"TOTAL DO SERVIÇO - R$",{"$nulls":5},{"$f":"ROUND(H68*H69,2)","v":571.11}]
[]
["F5","CODEVASF",null,null," COMPOSIÇÃO DE PREÇO UNITÁRIO",null,null,null,{"$f":"H79","v":4815.2},{"$f":"H81","v":5537.48}]
[null,"OBRA:  "," PAVIMENTAÇÃO ASFÁLTICA EM CBUQ - ESTRADA PARA SANTANA DO MUNDO NOVO (JURAMENTO / MG)",null,null,null,"DATA: ",{"$f":"$H$2","v":" ABRIL / 2025 "}]
[null,"SERVIÇO:  ","AQUISIÇÃO DE CONCRETO ASFÁLTICO DE PETRÓLEO - CAP 50/70 - EXCLUSIVE TRANSPORTE",null,"FONTE","CPU.11","UNIDADE: ",{"$f":"VLOOKUP(A72,ORÇAMENTO!$A$11:$L$66,7)","v":"T"}]
[]
[null,"TIPO ITEM","CODIGO ITEM","DESCRIÇÃO ITEM","UNIDADE ITEM","COEFICIENTE","PRECO UNITARIO","CUSTO TOTAL"]
[null,"INSUMO",1518,"CIMENTOS ASFÁLTICO DE PETRÓLEO TIPO CAP 50/70 (MEMÓRIA EM ANEXO)","T",1,4815.2051307564443,{"$f":"ROUNDDOWN(F77*G77,2)","v":4815.2}]
[null,"PRODUÇÃO DA EQUIPE",null,null,1,"CUSTO ",null,{"$f":"SUM(H77:H77)","v":4815.2}]
[null,"TOTAL",{"$nulls":5},{"$f":"H78/E78","v":4815.2}]
[null,"BDI                %",{"$nulls":5},{"$f":"1+$M$2","v":1.1499999999999999}]
[null,"TOTAL DO SERVIÇO - R$",{"$nulls":5},{"$f":"ROUND(H79*H80,2)","v":5537.48}]
[]
["F6","CODEVASF",null,null," COMPOSIÇÃO DE PREÇO UNITÁRIO",null,null,null,{"$f":"H90","v":388.69},{"$f":"H92","v":446.99}]
[null,"OBRA:  "," PAVIMENTAÇÃO ASFÁLTICA EM CBUQ - ESTRADA PARA SANTANA DO MUNDO NOVO (JURAMENTO / MG)",null,null,null,"DATA: ",{"$f":"$H$2","v":" ABRIL / 2025 "}]
[null,"SERVIÇO:  ","TRANSPORTE DE CONCRETO ASFÁLTICO DE PETRÓLEO - CAP 50/70",null,"FONTE","CPU.12","UNIDADE: ",{"$f":"VLOOKUP(A83,ORÇAMENTO!$A$11:$L$66,7)","v":"T"}]
[]
[null,"TIPO ITEM","CODIGO ITEM","DESCRIÇÃO ITEM","UNIDADE ITEM","COEFICIENTE","PRECO UNITARIO","CUSTO TOTAL"]
[null,"INSUMO"," - ","TRANSPORTE DE CIMENTO ASFÁLTICO DE PETRÓLEO TIPO CAP 50-70, INCLUINDO CUSTO TOTAL DO TRANSPORTE (COMBUSTÍVEL, PEDÁGIOS, ETC.) E ICMS - MEMÓRIA ANEXA","T",1,388.6957142857143,{"$f":"ROUNDDOWN(F88*G88,2)","v":388.69}]
[null,"PRODUÇÃO DA EQUIPE",null,null,1,"CUSTO ",null,{"$f":"SUM(H88:H88)","v":388.69}]
[null,"TOTAL",{"$nulls":5},{"$f":"H89/E89","v":388.69}]
[null,"BDI                %",{"$nulls":5},{"$f":"1+$M$2","v":1.1499999999999999}]
[null,"TOTAL DO SERVIÇO - R$",{"$nulls":5},{"$f":"ROUND(H90*H91,2)","v":446.99}]

{"sheet":"BDI SERV","index":3,"n_rows":60,"n_cols":5,"rows_kept":60,"cut":false,"hidden":false,"merged":[[38,1,38,4],[39,2,39,3],[36,0,36,5],[0,1,2,4],[25,1,25,3],[26,1,26,2],[26,3,26,4],[27,3,27,4],[35,0,35,5]]}
[null,"DETALHAMENTO DO BDI - SERVIÇOS"]
[]
[]
[null,"Item","Descrição dos Serviços","% - PV","% - CD"]
[]
[null,1,"ADMINISTRAÇÃO CENTRAL"," ",{"$f":"SUM(E7:E9)","v":4.01}]
[null,"1.1","ESCRITÓRIO CENTRAL",null,4.01]
[null,"1.2","VIAGENS"]
[null,"1.3","OUTROS"]
[null," "," "," "," "]
[null,2,"IMPOSTOS E TAXAS",{"$f":"SUM(D12:D15)","v":6.85},{"$f":"SUM(E12:E15)","v":0}]
[null,"2.1","ISS - Proposta",{"$f":"D34*100","v":3.2}]
[null,"2.2","PIS",0.65]
[null,"2.3","Cofins",3]
[null,"2.4","Contribuição Previdenciaria (CPRB)"]
[]
[null,3,"TAXA DE RISCO",null,{"$f":"SUM(E18:E20)","v":0.96}]
[null,"3.1","SEGURO",null,0.2]
[null,"3.2","RISCO",null,0.56000000000000005]
[null,"3.3","GARANTIA",null,0.2]
[]
[null,4,"DESPESAS FINANCEIRAS",null,1.1100000000000001]
[]
[null,5,"LUCRO",null,7.3]
[]
[null,"BDI APRESENTADO:",null,null,{"$f":"IF($D$41=$C$43,$D$43,IF($D$41=$C$44,$D$44,IF($D$41=$C$44,$D$44,IF($D$41=$C$45,$D$45,0))))","v":22.26}]
[]
[null,null,"Legislação Municipal:"," Lei Municipal nº 1.679/2023"]
[null,null,"Município:","Juramento"]
[null,null,"Alíquota ISSQN:",0.04,"Município"]
[null,null,"Base de Cálculo:",0.8]
[null,null,"Valor Serviço:",{"$f":"ORÇAMENTO!Q3","v":0}]
[null,null,"Dedução - Material:",0]
[null,null,"ISSQN BDI:",{"$f":"IF(D32=\"\",0,ROUND(IF(D31=D49,((1-(D33/D32))*D30),D30*D31),4))","v":3.2000000000000001E-2},"(*)"]
[]
["Acórdão nº 2.622/2013 - TCU Plenário"]
["BDI = ARRED((((((1+(AC+TR)/100)*(1+DF/100)*(1+L/100))/(1-IMP/100))-1)*100);2)"]
[]
[null,"(*) É obrigação da licitante a verificação da Legislação Tributária vigente no município, bem como o cálculo dos valores totais de serviços e materiais estimados, para apresentação de sua proposta."]
[]
[null,null,"Forma de Cálculo do BDI:","BDI - Acórdão nº 2.622/2013 - TCU"]
[]
[null,null,"BDI - Digitado",{"$f":"ROUND(E6+E11+E17+E22+E24,2)","v":13.38}]
[null,null,"BDI - Calculado",{"$f":"ROUND((((1+(E6/100+E22/100+E17/100))/(1-(D11/100+E24/100)))-1)*100,2)","v":23.56}]
[null,null,"BDI - Acórdão nº 2.622/2013 - TCU",{"$f":"ROUND((((((1+(E6+E17)/100)*(1+E22/100)*(1+E24/100))/(1-D11/100))-1)*100),2)","v":22.26}]
[]
[]
[]
[null,null,null,"Dedução - Material","Município"]
[null,null,null,0.1,"Simples Nacional"]
[null,null,null,0.2,"Municípios Indefinidos"]
[null,null,null,0.3]
[null,null,null,0.4]
[null,null,null,0.5]
[null,null,null,0.6]
[null,null,null,0.7]
[null,null,null,0.8]
[null,null,null,0.9]
[null,null,null,1]
[null,null,null,{"$f":"E31","v":0}]

{"sheet":"BDI FORN","index":4,"n_rows":37,"n_cols":5,"rows_kept":37,"cut":false,"hidden":false,"merged":[[31,1,31,2],[32,0,34,5],[36,0,36,5],[0,1,2,4],[3,1,4,1],[3,2,4,2],[28,0,28,5],[30,1,30,2]]}
[null,"DETALHAMENTO DO BDI - FORNECIMENTO \n(MATERIAL ASFÁLTICO)"]
[]
[]
[null,"Item","Descrição dos Serviços","%","%"]
[null,null,null,"PV","CD"]
[]
[null,1,"ADMINISTRAÇÃO CENTRAL"," ",3.45]
[null,"1.1","ESCRITÓRIO CENTRAL"," "," "]
[null,"1.2","VIAGENS"," "," "]
[null,"1.3","OUTROS"," "," "]
[null," "," "," "," "]
[null,2,"IMPOSTOS E TAXAS",{"$f":"SUM(D13:D16)","v":3.65},{"$f":"SUM(E13:E16)","v":4.5600000000000005}]
[null,"2.1","ISS (*)",null,{"$f":"ROUND(D13*1.2515,2)","v":0}]
[null,"2.2","PIS",0.65,{"$f":"ROUND(D14*1.2515,2)","v":0.81}]
[null,"2.3","Cofins",3,{"$f":"ROUND(D15*1.2515,2)","v":3.75}]
[null,"2.4","CONTRIBUIÇÃO PREVIDENCIÁRIA SOBRE A RENDA BRUTA",0,{"$f":"ROUND(D16*1.2515,2)","v":0}]
[]
[null,3,"TAXA DE RISCO"," ",{"$f":"SUM(E19:E22)","v":1.08}]
[null,"3.1","SEGURO",null,0.24]
[null,"3.2","RISCO",null,0.6]
[null,"3.3","GARANTIA",null,0.24]
[]
[null,4,"DESPESAS FINANCEIRAS"," ",0.85]
[]
[null,5,"LUCRO",null,5.1100000000000003]
[]
[null," ","BDI - CALCULADO"," ",{"$f":"ROUND((((1+(E7+E18)/100)*(1+E23/100)*(1+E25/100)/(1-D12/100)-1)*100),2)","v":15}]
[]
["BDI = ((1+((AC+S+R+G)/100))x(1+DF/100)x(1+L/100)/(1-I/100)-1)*100"]
[]
[null,"BDI (CALCULADO):",null,{"$f":"ROUND((((1+((E7+E18)/100))*(1+E23/100)*(1+E25/100))/(1-D12/100)-1)*100,2)","v":15},"%"]
[null," "]
[]
[]
[]
[]
["BDI EM CONFORMIDADE COM OS ACÓRDÃOS Nº 2369/2011 e ACÓRDÃO Nº 2.622/2013 - TCU - PLENÁRIO"]

{"sheet":"CRONOGRAMA","index":5,"n_rows":19,"n_cols":11,"rows_kept":19,"cut":false,"hidden":false,"merged":[[9,0,10,0],[9,1,10,1],[9,2,10,2],[15,1,16,2],[18,1,22,10],[11,0,12,0],[11,1,12,1],[11,2,12,2],[13,0,14,0],[13,1,14,1],[13,2,14,2],[3,1,3,9],[5,0,6,0],[5,1,6,1],[5,2,6,2],[7,0,8,0],[7,1,8,1],[7,2,8,2],[0,1,0,10],[1,1,2,1],[1,2,2,4],[1,6,1,10],[2,6,2,10]]}
[null,"CRONOGRAMA FÍSICO-FINANCEIRO"]
[null,"OBRA: ",{"$f":"ORÇAMENTO!C5","v":" PAVIMENTAÇÃO ASFÁLTICA EM CBUQ - ESTRADA PARA SANTANA DO MUNDO NOVO (JURAMENTO / MG)"},null,null,"VALOR:",{"$f":"ORÇAMENTO!L59","v":1999806.5}]
[{"$nulls":5},"PRAZO: ","150 DIAS "]
[]
[null,"ITEM","ETAPAS/DESCRIÇAO","FISICO/  FINANCEIRO","TOTAL    ETAPAS","MÊS 1","MÊS 2","MÊS 3","MÊS 4","MÊS 5","TOTAL"]
["A",{"$f":"VLOOKUP(A6,ORÇAMENTO!$A$10:$L$59,2)","v":1},{"$f":"VLOOKUP(A6,ORÇAMENTO!$A$10:$L$59,5)","v":"SERVIÇOS PRELIMINARES "},"FISICO ",{"$f":"ROUND(E7/$G$2,4)","v":8.0799999999999997E-2},0.25,0.2,0.2,0.2,0.15,{"$f":"SUM(F6:J6)","v":1}]
[null,null,null,"FINANCEIRO",{"$f":"ORÇAMENTO!L10","v":161676.57999999999},{"$f":"ROUND($E$7*F6,2)","v":40419.15},{"$f":"ROUND($E$7*G6,2)","v":32335.32},{"$f":"ROUND($E$7*H6,2)","v":32335.32},{"$f":"ROUND($E$7*I6,2)","v":32335.32},24251.49,{"$f":"SUM(F7:J7)","v":161676.6}]
["B",{"$f":"VLOOKUP(A8,ORÇAMENTO!$A$10:$L$59,2)","v":2},{"$f":"VLOOKUP(A8,ORÇAMENTO!$A$10:$L$59,5)","v":"TERRAPLANAGEM E PAVIMENTAÇÃO"},"FISICO ",{"$f":"ROUND(E9/$G$2,4)","v":0.34499999999999997},0.2,0.2,0.2,0.2,0.2,{"$f":"SUM(F8:J8)","v":1}]
[null,null,null,"FINANCEIRO",{"$f":"ORÇAMENTO!L17","v":689846.4},{"$f":"ROUND($E$9*F8,2)","v":137969.28},{"$f":"ROUND($E$9*G8,2)","v":137969.28},{"$f":"ROUND($E$9*H8,2)","v":137969.28},{"$f":"ROUND($E$9*I8,2)","v":137969.28},137969.28,{"$f":"SUM(F9:J9)","v":689846.4}]
["C",{"$f":"VLOOKUP(A10,ORÇAMENTO!$A$10:$L$59,2)","v":3},{"$f":"VLOOKUP(A10,ORÇAMENTO!$A$10:$L$59,5)","v":"TRANSPORTE DE MATERIAIS"},"FISICO ",{"$f":"ROUND(E11/$G$2,4)","v":7.4200000000000002E-2},0.25,0.25,0.25,0.25,null,{"$f":"SUM(F10:J10)","v":1}]
[null,null,null,"FINANCEIRO",{"$f":"ORÇAMENTO!L24","v":148374.39999999999},{"$f":"ROUND($E$11*F10,2)","v":37093.599999999999},{"$f":"ROUND($E$11*G10,2)","v":37093.599999999999},{"$f":"ROUND($E$11*H10,2)","v":37093.599999999999},{"$f":"ROUND($E$11*I10,2)","v":37093.599999999999},0,{"$f":"SUM(F11:J11)-0.04","v":148374.35999999999}]
["E",{"$f":"VLOOKUP(A12,ORÇAMENTO!$A$10:$L$59,2)","v":4},{"$f":"VLOOKUP(A12,ORÇAMENTO!$A$10:$L$59,5)","v":"DRENAGEM E OBRAS COMPLEMENTARES"},"FISICO ",{"$f":"ROUND(E13/$G$2,4)","v":0.2429},0.2,0.2,0.2,0.2,0.2,{"$f":"SUM(F12:J12)","v":1}]
[null,null,null,"FINANCEIRO",{"$f":"ORÇAMENTO!L29","v":485770.65},{"$f":"ROUND($E$13*F12,2)","v":97154.13},{"$f":"ROUND($E$13*G12,2)","v":97154.13},{"$f":"ROUND($E$13*H12,2)","v":97154.13},{"$f":"ROUND($E$13*I12,2)","v":97154.13},{"$f":"ROUND($E$13*J12,2)","v":97154.13},{"$f":"SUM(F13:J13)-0.02","v":485770.63}]
["F",{"$f":"VLOOKUP(A14,ORÇAMENTO!$A$10:$L$59,2)","v":5},{"$f":"VLOOKUP(A14,ORÇAMENTO!$A$10:$L$59,5)","v":"FORNECIMENTOS - MATERIAL ASFÁLTICO (BDI DIFERENCIADO)"},"FISICO ",{"$f":"ROUND(E15/$G$2,4)","v":0.2571},0.1,0.2,0.3,0.2,0.2,{"$f":"SUM(F14:J14)","v":1}]
[null,null,null,"FINANCEIRO",{"$f":"ORÇAMENTO!L52","v":514138.47},{"$f":"ROUND($E$15*F14,2)","v":51413.85},{"$f":"ROUND($E$15*G14,2)","v":102827.69},{"$f":"ROUND($E$15*H14,2)","v":154241.54},{"$f":"ROUND($E$15*I14,2)","v":102827.69},{"$f":"ROUND($E$15*J14,2)","v":102827.69},{"$f":"SUM(F15:J15)-0.02","v":514138.44}]
[null,"TOTAL",null,"FISICO ",{"$f":"SUM(F16:J16)","v":1.0000000050004838},{"$f":"F17/$E$17","v":0.18204261762325505},{"$f":"G17/$E$17","v":0.20370971891530507},{"$f":"H17/$E$17","v":0.22941913130095337},{"$f":"I17/$E$17","v":0.20370971891530507},{"$f":"J17/$E$17","v":0.18111881824566525},{"$f":"SUM(F16:J16)","v":1.0000000050004838}]
[null,null,null,"FINANCEIRO",{"$f":"E11+E9+E7+E15+E13","v":1999806.5},{"$f":"F11+F9+F7+F15+F13","v":364050.01},407380.02,458793.87,407380.02,362202.58999999997,{"$f":"SUM(F17:J17)-0.01","v":1999806.4999999998}]
[]
[null,"OBSERVAÇÕES:"]

{"sheet":"EAI","index":6,"n_rows":90,"n_cols":34,"rows_kept":90,"cut":false,"hidden":false,"merged":[[12,3,24,3],[1,2,3,26],[5,2,7,2],[5,12,7,12],[6,6,7,6],[6,19,6,20],[10,4,10,8],[10,9,10,10],[10,22,10,23],[5,6,5,7],[5,8,5,9],[6,21,6,24],[7,21,7,24]]}
[]
[null,null,"MEMÓRIA DE CÁLCULO"]
[]
[]
[]
[{"$nulls":6},"TIPOLOGIA DO MATERIAL",null,"EMULSÃO ASFÁLTICA PARA SERVIÇO DE IMPRIMAÇÃO",null,null,null,"IMPOSTOS","COFINS",6.4999999999999997E-3,6.4999999999999997E-3]
[{"$nulls":6},"ÍNDICE DE PAVIMENTAÇÃO DNIT","2014-07-01","ÍNDICE INICIAL",270.23700000000002,null,null,null,"PIS",0.03,0.03,null,null,null,"LEGENDA",{"$nulls":8},"As empresas tributadas pelo Lucro Presumido pagam 0,65% de PIS e 3% de COFINS"]
[{"$nulls":7},{"$f":"H9","v":"2025-02-01"},"ÍNDICE FINAL",587.95899999999995,null,null,null," ICMS",0.18,0.18,{"$f":"1-(O8/1)","v":0.82000000000000006},{"$f":"1-(P8/1)","v":0.82000000000000006},{"$f":"1-(Q8/1)","v":0.17999999999999994},"ENTRADA DE DADOS",null,"QUANT.ESTIMADA DE EMULSÃO ASFÁLTICA PARA IMPRIMAÇÃO (TON.):",null,null,null,{"$f":"ORÇAMENTO!H53","v":16},"TONELADAS",null,"As empresas tributadas pelo Lucro Real pagam 1,65% de PIS e 7,60% de COFINS"]
[{"$nulls":6},"Data ANP","2025-02-01"]
[]
[null,null,"DATA-BASE","PRODUTOS","LOCALIDADES",{"$nulls":4},"CUSTO ANP (R$/Kg)",null,"CUSTO ANP","IMPOSTOS DO PRODUTO","CUSTO DO PRODUTO COM IMPOSTOS","DMT's","DMT's FLUVIAL","CUSTO DO TRANSPORTE RODOVIA PAVIMENTADA","CUSTO DO TRANSPORTE FLUVIAL","CUSTO DO TRANSPORTE TOTAL","ICMS","ATUALIZAÇÃO DO CUSTO DE TRANSPORTE","CUSTO DO TRANSPORTE RODOVIA PAVIMENTADA COM IMPOSTOS E ATUALIZAÇÃO MONETÁRIA","PEDÁGIO ",null,"TOTAL TRANSPORTE","AQUISIÇÃO DO PRODUTO","TOTAL GERAL ( TRANSP + AQUISIÇÃO)",null,1,2,3]
[null,null,{"$f":"H8","v":"2025-02-01"},null,"REFINARIAS","ENDEREÇO","ESTADO","CIDADE","DESTINO","ESTADO","REGIÃO","R$/t","R$/t","R$/t","KM","KM","R$/t","R$/t","R$/t","R$/t","R$/t","R$/t","CUSTO ","R$/t","R$/t","R$/t","R$/t",null,"TOTAL GERAL ( TRANSP + AQUISIÇÃO)","TOTAL TRANSPORTE","AQUISIÇÃO DO PRODUTO"]
[null,{"$f":"AA13","v":4657.4817950292691},1,{"$f":"I6","v":"EMULSÃO ASFÁLTICA PARA SERVIÇO DE IMPRIMAÇÃO"},"Refinaria Abreu e Lima","Rodovia PE 60, Km 10 - Ipojuca - PE CEP:55590-000","Pernambuco","IPOJUCA - PE","Montes Claros - MG","-",2.7104017950292691,{"$f":"IF(AND(J13=\"-\",K13=\"-\"),\"\",IF(AND(J13<>0,K13=\"-\"),J13*1000,IF(AND(J13=\"-\",K13<>0),K13*1000,IF(AND(J13<>0,K13<>0),J13*1000,\"\"))))","v":2710.4017950292691},{"$f":"ROUND(((L13/(1-$O$6-$O$7-$O$8))-L13),2)","v":748.95},{"$f":"L13+M13","v":3459.3517950292689},1631,null,{"$f":"ROUND((26.939+0.253*O13),2)","v":439.58},null,{"$f":"Q13+R13","v":439.58},{"$f":"TRUNC(S13*($O$8/(1-$O$8)),2)","v":96.49},{"$f":"TRUNC(IF($J$7=\"\",\"\",(($J$8-$J$7)/$J$7)*(S13+T13)),2)","v":630.26},{"$f":"S13+T13+U13","v":1166.33},254.4,{"$f":"EVEN($Z$8*2/28)*W13/$Z$8","v":31.8},{"$f":"IF(AND(S13=\"\",T13=\"\"),\"\",V13+X13)","v":1198.1299999999999},{"$f":"IF(OR(L13=\"\",M13=\"\"),\"\",L13+M13)","v":3459.3517950292689},{"$f":"IF(OR(Y13=\"\",Z13=\"\"),\"\",Y13+Z13)","v":4657.4817950292691},null,{"$f":"AA13","v":4657.4817950292691},{"$f":"Y13","v":1198.1299999999999},{"$f":"Z13","v":3459.3517950292689},null,null,{"$f":"IF(OR(G13=$D$50,G13=$D$51,G13=$D$53,G13=$D$59,G13=$D$43,G13=$D$39,G13=$D$35,G13=$D$48,G13=$D$38),\"NORDESTE\",IF(OR(G13=$D$34,G13=$D$36,G13=$D$37,G13=$D$47,G13=$D$55,G13=$D$56,G13=$D$60),\"NORTE\",IF(OR(G13=$D$40,G13=$D$42,G13=$D$44,G13=$D$45),\"CENTRO-OESTE\",IF(OR(G13=$D$58,G13=$D$52,G13=$D$46,G13=$D$41),\"SUDESTE\",IF(OR(G13=$D$57,G13=$D$49,G13=$D$54),\"SUL\",\"\")))))","v":"NORDESTE"}]
[null,{"$f":"AA14","v":4844.5867950292686},2,null,"Refinaria Potiguar Clara Camarão","Rodovia RN 221, KM 25 - Guamaré - RN CEP:59598-000","Rio Grande do Norte","GUAMARÉ - RN",{"$f":"I13","v":"Montes Claros - MG"},"-",2.7104017950292691,{"$f":"IF(AND(J14=\"-\",K14=\"\"),\"\",IF(AND(J14<>0,K14=\"\"),J14*1000,IF(AND(J14=\"-\",K14<>0),K14*1000,IF(AND(J14<>0,K14<>0),J14*1000,\"\"))))","v":2710.4017950292691},{"$f":"ROUND(((L14/(1-$O$6-$O$7-$O$8))-L14),2)","v":748.95},{"$f":"L14+M14","v":3459.3517950292689},1923,null,{"$f":"ROUND((26.939+0.253*O14),2)","v":513.46},null,{"$f":"Q14+R14","v":513.46},{"$f":"TRUNC(S14*($O$8/(1-$O$8)),2)","v":112.71},{"$f":"TRUNC(IF($J$7=\"\",\"\",(($J$8-$J$7)/$J$7)*(S14+T14)),2)","v":736.19},{"$f":"S14+T14+U14","v":1362.3600000000001},183,{"$f":"EVEN($Z$8*2/28)*W14/$Z$8","v":22.875},{"$f":"IF(AND(S14=\"\",T14=\"\"),\"\",V14+X14)","v":1385.2350000000001},3459.3517950292689,{"$f":"IF(OR(Y14=\"\",Z14=\"\"),\"\",Y14+Z14)","v":4844.5867950292686},null,{"$f":"AA14","v":4844.5867950292686},{"$f":"Y14","v":1385.2350000000001},3459.3517950292689,null,null,"NORDESTE"]
[null,4194.6917950292691,3,null,"Refinaria Landulpho Alves (RLAM)","Rodovia BA 523, KM 4 – Mataripe São Francisco do Conde - BA CEP:43900-000","Bahia","SÃO FRANCISCO DO CONDE - BA",{"$f":"I14","v":"Montes Claros - MG"},"-",2.7104017950292691,2710.4017950292691,{"$f":"ROUND(((L15/(1-$O$6-$O$7-$O$8))-L15),2)","v":748.95},3459.3517950292689,951,null,{"$f":"ROUND((26.939+0.253*O15),2)","v":267.54000000000002},null,267.54000000000002,58.72,383.58,709.83999999999992,204,25.5,735.33999999999992,3459.3517950292689,4194.6917950292691,null,4194.6917950292691,735.33999999999992,3459.3517950292689,null,null,"NORDESTE"]
[2403,4606.1226526559158,4,null,"Refinaria Lubrificantes e Derivados do Nordeste (Lubnor)","Av. Leite Barbosa, s/nº - Mucuripe Fortaleza - Ceará CEP:60180-420","Ceará","FORTALEZA - CE","Montes Claros - MG",2.501487652655916,2.7104017950292691,{"$f":"IF(AND(J16=\"-\",K16=\"\"),\"\",IF(AND(J16<>0,K16=\"\"),J16*1000,IF(AND(J16=\"-\",K16<>0),K16*1000,IF(AND(J16<>0,K16<>0),J16*1000,\"\"))))","v":2501.487652655916},{"$f":"ROUND(((L16/(1-$O$6-$O$7-$O$8))-L16),2)","v":691.22},3192.7076526559158,1965,null,524.08000000000004,null,524.08000000000004,115.04,751.42,1390.54,183,22.875,1413.415,3192.7076526559158,4606.1226526559158,null,4606.1226526559158,1413.415,3192.7076526559158,null,null,"NORDESTE"]
[null,4285.7537745904656,5,null,"Refinaria Capuava (Recap)","Av. Alberto Soares Sampaio, 2122-A Capuava – Mauá - SP","São Paulo","MAUÁ - SP","Montes Claros - MG",2.7293387745904658,2.7609338335366278,2729.3387745904656,{"$f":"ROUND(((L17/(1-$O$6-$O$7-$O$8))-L17),2)","v":754.18},3483.5187745904655,1002,null,280.45,null,280.45,61.56,402.1,744.11,465,58.125,802.23500000000001,3483.5187745904655,4285.7537745904656,null,4285.7537745904656,802.23500000000001,3483.5187745904655,null,null,"SUDESTE"]
[null,4237.9888335366277,6,null,"Refinaria Duque de Caxias (Reduc)","Rodovia Washington Luiz, km 113,7 Campos Elíseos – Duque de Caxias - RJ CEP:25213-005","Rio de Janeiro","DUQUE DE CAXIAS - RJ","Montes Claros - MG","-",2.7609338335366278,2760.9338335366278,762.91,3523.8438335366277,827,null,236.17,null,236.17,51.84,338.61,626.62,700.2,87.525000000000006,714.14499999999998,3523.8438335366277,4237.9888335366277,null,4237.9888335366277,714.14499999999998,3523.8438335366277,null,null,"SUDESTE"]
[null,5296.5592218940365,7,null,"Refinaria Alberto Pasqualini (Refap)","Avenida Getúlio Vargas, 11001 - Bairro Brigadeira Canoas - RS - Brasil CEP:92420-221","Rio Grande do Sul","CANOAS - RS","Montes Claros - MG",2.868824221894037,2.8544355674732254,2868.8242218940368,792.73,3661.5542218940368,2134,null,566.84,null,566.84,124.42,812.72,1503.98,1048.2,131.02500000000001,1635.0050000000001,3661.5542218940368,5296.5592218940365,null,5296.5592218940365,1635.0050000000001,3661.5542218940368,null,null,"SUL"]
[null,4813.0345308848073,8,null,"Unidade de Industrialização do Xisto (SIX)","Rodovia do Xisto, BR 476, km 153 São Mateus do Sul – PR CEP 83900-000","Paraná","SÃO MATEUS DO SUL - PR","Montes Claros - MG",2.8435920308848077,2.8544355674732254,2843.5920308848076,785.75,3629.3420308848076,1539,null,416.31,null,416.31,91.38,596.89,1104.58,632.9,79.112499999999997,1183.6924999999999,3629.3420308848076,4813.0345308848073,null,4813.0345308848073,1183.6924999999999,3629.3420308848076,null,null,"SUL"]
[null,3933.6320595881234,9,null,"Refinaria Gabriel Passos (Regap)","Av. Refinaria Gabriel Passos, 690 Distrito Industrial Paulo Camilo Sul Betim - MG CEP:32669-205","Minas Gerais","BETIM - MG","Montes Claros - MG",2.7674270595881234,2.7609338335366278,2767.4270595881235,764.71,3532.1370595881235,431,null,135.97999999999999,null,135.97999999999999,29.84,194.95,360.77,325.8,40.725000000000001,401.495,3532.1370595881235,{"$f":"IF(OR(Y21=\"\",Z21=\"\"),\"\",Y21+Z21)","v":3933.6320595881234},null,3933.6320595881234,401.495,3532.1370595881235,null,null,"SUDESTE"]
[null,4760.2370308848076,10,null,"Refinaria Presidente Getúlio Vargas (Repar)","Rodovia do Xisto, BR 476, km 16 Araucária - PR CEP:83707-440","Paraná","ARAUCÁRIA - PR","Montes Claros - MG",2.8435920308848077,2.8544355674732254,2843.5920308848076,785.75,3629.3420308848076,1440,null,391.26,null,391.26,85.88,560.98,1038.1199999999999,742.2,92.775000000000006,1130.895,3629.3420308848076,4760.2370308848076,null,4760.2370308848076,1130.895,3629.3420308848076,null,null,"SUL"]
[null,4311.9037745904652,11,null,"Refinaria Presidente Bernardes (RPBC)","Av. 9 de abril, 777 - Jardim das Indústrias Cubatão - SP CEP:11505-000","São Paulo","CUBATÃO - SP","Montes Claros - MG",2.7293387745904658,2.7609338335366278,2729.3387745904656,754.18,3483.5187745904655,1041,null,290.31,null,290.31,63.72,416.23,770.26,465,58.125,828.38499999999999,3483.5187745904655,4311.9037745904652,null,4311.9037745904652,828.38499999999999,3483.5187745904655,null,null,"SUDESTE"]
[null,4300.0837745904655,12,null,"Refinaria de Paulínia (Replan)","Rodovia SP 332 - Km. 130 Bonfim - Paulínia – SP CEP:13140-000","São Paulo","PAULÍNIA - SP","Montes Claros - MG",2.7293387745904658,2.7609338335366278,2729.3387745904656,754.18,3483.5187745904655,1021,null,285.25,null,285.25,62.61,408.98,756.84,477.8,59.725000000000001,816.56500000000005,3483.5187745904655,4300.0837745904655,null,4300.0837745904655,816.56500000000005,3483.5187745904655,null,null,"SUDESTE"]
[null,4260.1287745904656,13,null,"Refinaria Henrique Lage (Revap)","Rodovia Presidente Dutra, KM 143, S/N Bairro Jardim Diamante - São José dos Campos – SP CEP:12223-900","São Paulo","SÃO JOSÉ DOS CAMPOS - SP","Montes Claros - MG",2.7293387745904658,2.7609338335366278,2729.3387745904656,754.18,3483.5187745904655,953,null,268.05,null,268.05,58.84,384.32,711.21,523.20000000000005,65.400000000000006,776.61,3483.5187745904655,4260.1287745904656,null,4260.1287745904656,776.61,3483.5187745904655,null,null,"SUDESTE"]
{"$rows_empty":8}
[null,null,null,"Acre"]
[null,null,null,"Alagoas"]
[null,null,null,"Amapá"]
[null,null,null,"Amazonas"]
[null,null,null,"Bahia"]
[null,null,null,"Ceará"]
[null,null,null,"Distrito Federal"]
[null,null,null,"Espírito Santo"]
[null,null,null,"Goiás"]
[null,null,null,"Maranhão"]
[null,null,null,"Mato Grosso"]
[null,null,null,"Mato Grosso do Sul"]
[null,null,null,"Minas Gerais"]
[null,null,null,"Pará"]
[null,null,null,"Paraíba"]
[null,null,null,"Paraná"]
[null,null,null,"Pernambuco"]
[null,null,null,"Piauí"]
[null,null,null,"Rio de Janeiro"]
[null,null,null,"Rio Grande do Norte"]
[null,null,null,"Rio Grande do Sul"]
[null,null,null,"Rondônia"]
[null,null,null,"Roraima"]
[null,null,null,"Santa Catarina"]
[null,null,null,"São Paulo"]
[null,null,null,"Sergipe"]
[null,null,null,"Tocantins"]
[]
[]
[]
[null,null,null,"ASFALTOS DILUÍDOS CM-30"]
[null,null,null,"ASFALTOS DILUÍDOS CM-70"]
[null,null,null,"ASFALTOS DILUÍDOS CR-250"]
[null,null,null,"ASFALTOS DILUÍDOS CR-70"]
[null,null,null,"CAP MODIFICADO POR BORRACHA DE PNEU AB22"]
[null,null,null,"CAP MODIFICADO POR BORRACHA DE PNEU AB8"]
[null,null,null,"CAP MODIFICADO POR POLÍMERO 55-75-E"]
[null,null,null,"CAP MODIFICADO POR POLÍMERO 60-85-E"]
[null,null,null,"CAP MODIFICADO POR POLÍMERO 65-90-E"]
[null,null,null,"CIMENTOS ASFÁLTICOS CAP-150-200"]
[null,null,null,"CIMENTOS ASFÁLTICOS CAP-30-45"]
[null,null,null,"CIMENTOS ASFÁLTICOS CAP-50-70"]
[null,null,null,"CIMENTOS ASFÁLTICOS CAP-85-100"]
[null,null,null,"EMULSÃO ASFÁLTICA CATIÔNICA DE RUPTURA CONTROLADA PARA SERVIÇO DE LAMA ASFÁLTICA"]
[null,null,null,"EMULSÃO ASFÁLTICA DE RUPTURA LENTA CATIÔNICA PARA SERVIÇO DE LAMA ASFÁLTICA"]
[null,null,null,"EMULSÃO ASFÁLTICA DE RUPTURA LENTA DE CARGA NEUTRA PARA SERVIÇO DE LAMA ASFÁLTICA"]
[null,null,null,"EMULSÃO ASFÁLTICA PARA SERVIÇO DE IMPRIMAÇÃO"]
[null,null,null,"EMULSÕES ASF. MOD. POR POLÍMEROS RC1C-E"]
[null,null,null,"EMULSÕES ASF. MOD. POR POLÍMEROS RL1C-E"]
[null,null,null,"EMULSÕES ASF. MOD. POR POLÍMEROS RM1C-E"]
[null,null,null,"EMULSÕES ASF. MOD. POR POLÍMEROS RR1C-E"]
[null,null,null,"EMULSÕES ASF. MOD. POR POLÍMEROS RR2C-E"]
[null,null,null,"EMULSÕES ASFÁLTICAS RL-1C"]
[null,null,null,"EMULSÕES ASFÁLTICAS RM-1C"]
[null,null,null,"EMULSÕES ASFÁLTICAS RM-2C"]
[null,null,null,"EMULSÕES ASFÁLTICAS RR-1C"]
[null,null,null,"EMULSÕES ASFÁLTICAS RR-2C"]

{"sheet":"RR-1C","index":7,"n_rows":92,"n_cols":34,"rows_kept":92,"cut":false,"hidden":false,"merged":[[1,2,3,26],[5,2,7,2],[10,4,10,8],[10,9,10,10],[10,22,10,23],[6,21,6,24],[7,21,7,24],[12,3,26,3],[6,19,6,20],[6,6,7,6],[5,12,7,12],[5,6,5,7],[5,8,5,9]]}
[]
[null,null,"MEMÓRIA DE CÁLCULO"]
[]
[]
[]
[{"$nulls":6},"TIPOLOGIA DO MATERIAL",null,"EMULSÕES ASFÁLTICAS RR-1C",null,null,null,"IMPOSTOS","COFINS",6.4999999999999997E-3,6.4999999999999997E-3]
[{"$nulls":6},"ÍNDICE DE PAVIMENTAÇÃO DNIT","2014-07-01","ÍNDICE INICIAL",270.23700000000002,null,null,null,"PIS",0.03,0.03,null,null,null,"LEGENDA",{"$nulls":8},"As empresas tributadas pelo Lucro Presumido pagam 0,65% de PIS e 3% de COFINS"]
[{"$nulls":7},"2023-10-01","ÍNDICE FINAL",587.95899999999995,null,null,null," ICMS",0.18,0.18,{"$f":"1-(O8/1)","v":0.82000000000000006},{"$f":"1-(P8/1)","v":0.82000000000000006},{"$f":"1-(Q8/1)","v":0.17999999999999994},"ENTRADA DE DADOS",null,"QUANT.ESTIMADA DE RR-1C (TON.):",null,null,null,{"$f":"ORÇAMENTO!H55","v":4.9949999999999992},"TONELADAS",null,"As empresas tributadas pelo Lucro Real pagam 1,65% de PIS e 7,60% de COFINS"]
[{"$nulls":6},"Data ANP",{"$f":"EAI!H9","v":"2025-02-01"}]
[]
[null,null,"DATA-BASE","PRODUTOS","LOCALIDADES",{"$nulls":4},"CUSTO ANP (R$/Kg)",null,"CUSTO ANP","IMPOSTOS DO PRODUTO","CUSTO DO PRODUTO COM IMPOSTOS","DMT's","DMT'S FLUVIAL","CUSTO DO TRANSPORTE RODOVIA PAVIMENTADA","CUSTO DO TRANSPORTE FLUVIAL","CUSTO DO TRANSPORTE TOTAL","ICMS","ATUALIZAÇÃO DO CUSTO DE TRANSPORTE","CUSTO DO TRANSPORTE RODOVIA PAVIMENTADA COM IMPOSTOS E ATUALIZAÇÃO MONETÁRIA","PEDÁGIO ",null,"TOTAL TRANSPORTE","AQUISIÇÃO DO PRODUTO","TOTAL GERAL ( TRANSP + AQUISIÇÃO)",null,1,2,3]
[null,null,{"$f":"H8","v":"2023-10-01"},null,"REFINARIAS","ENDEREÇO","ESTADO","CIDADE","DESTINO","ESTADO","REGIÃO","R$/t","R$/t","R$/t","KM","KM","R$/t","R$/t","R$/t","R$/t","R$/t","R$/t","CUSTO ","R$/t","R$/t","R$/t","R$/t",null,"TOTAL GERAL ( TRANSP + AQUISIÇÃO)","TOTAL TRANSPORTE","AQUISIÇÃO DO PRODUTO"]
[null,{"$f":"AA13","v":4518.336313821409},1,{"$f":"I6","v":"EMULSÕES ASFÁLTICAS RR-1C"},"'CENTRO OESTE ASFALTOS LTDA.","SETOR DE INFLAMÁVEIS, S/N TRECHO 02 - LOTE 1.100 - GUARÁ - CEP:71225-000","Distrito Federal","BRASÍLIA - DF",{"$f":"EAI!I13","v":"Montes Claros - MG"},"-",3.0695857732808691,{"$f":"IF(AND(J13=\"-\",K13=\"-\"),\"\",IF(AND(J13<>0,K13=\"-\"),J13*1000,IF(AND(J13=\"-\",K13<>0),K13*1000,IF(AND(J13<>0,K13<>0),J13*1000,\"\"))))","v":3069.585773280869},{"$f":"ROUND(((L13/(1-$O$6-$O$7-$O$8))-L13),2)","v":848.2},{"$f":"L13+M13","v":3917.7857732808689},698,null,{"$f":"ROUND((26.939+0.253*O13),2)","v":203.53},null,{"$f":"Q13+R13","v":203.53},{"$f":"TRUNC(S13*($O$8/(1-$O$8)),2)","v":44.67},{"$f":"TRUNC(IF($J$7=\"\",\"\",(($J$8-$J$7)/$J$7)*(S13+T13)),2)","v":291.81},{"$f":"S13+T13+U13","v":540.01},151.19999999999999,{"$f":"EVEN($Z$8*2/28)*W13/$Z$8","v":60.540540540540547},{"$f":"IF(AND(Q13=\"\",T13=\"\"),\"\",V13+X13)","v":600.55054054054051},{"$f":"IF(OR(L13=\"\",M13=\"\"),\"\",L13+M13)","v":3917.7857732808689},{"$f":"IF(OR(Y13=\"\",Z13=\"\"),\"\",Y13+Z13)","v":4518.336313821409},null,{"$f":"AA13","v":4518.336313821409},{"$f":"Y13","v":600.55054054054051},{"$f":"Z13","v":3917.7857732808689},null,null,{"$f":"IF(OR(G13=$D$52,G13=$D$53,G13=$D$55,G13=$D$61,G13=$D$45,G13=$D$41,G13=$D$37,G13=$D$50,G13=$D$40),\"NORDESTE\",IF(OR(G13=$D$36,G13=$D$38,G13=$D$39,G13=$D$49,G13=$D$57,G13=$D$58,G13=$D$62),\"NORTE\",IF(OR(G13=$D$42,G13=$D$44,G13=$D$46,G13=$D$47),\"CENTRO-OESTE\",IF(OR(G13=$D$60,G13=$D$54,G13=$D$48,G13=$D$43),\"SUDESTE\",IF(OR(G13=$D$59,G13=$D$51,G13=$D$56),\"SUL\",\"\")))))","v":"CENTRO-OESTE"}]
[null,{"$f":"AA14","v":4440.3602140335224},2,null,"STRATURA ASFALTOS S/A","AVENIDA PRESIDENTE WILSON, 08  - JUNDIAÍ - CEP:75115-100","Goiás","ANÁPOLIS - GO",{"$f":"I13","v":"Montes Claros - MG"},2.9430018957152044,3.0695857732808691,{"$f":"IF(AND(J14=\"-\",K14=\"-\"),\"\",IF(AND(J14<>0,K14=\"-\"),J14*1000,IF(AND(J14=\"-\",K14<>0),K14*1000,IF(AND(J14<>0,K14<>0),J14*1000,\"\"))))","v":2943.0018957152042},{"$f":"ROUND(((L14/(1-$O$6-$O$7-$O$8))-L14),2)","v":813.22},{"$f":"L14+M14","v":3756.2218957152045},796,null,{"$f":"ROUND((26.939+0.253*O14),2)","v":228.33},null,{"$f":"Q14+R14","v":228.33},{"$f":"TRUNC(S14*($O$8/(1-$O$8)),2)","v":50.12},{"$f":"TRUNC(IF($J$7=\"\",\"\",(($J$8-$J$7)/$J$7)*(S14+T14)),2)","v":327.37},{"$f":"S14+T14+U14","v":605.81999999999994},195.6,{"$f":"EVEN($Z$8*2/28)*W14/$Z$8","v":78.318318318318333},684.13831831831828,3756.2218957152045,{"$f":"IF(OR(Y14=\"\",Z14=\"\"),\"\",Y14+Z14)","v":4440.3602140335224},null,{"$f":"AA14","v":4440.3602140335224},{"$f":"Y14","v":684.13831831831828},3756.2218957152045,null,null,"CENTRO-OESTE"]
[null,4459.1774813007905,3,null,"DISTRIBUIDORA BRASILEIRA DE ASFALTO SA - DISBRAL","VIA PRIMARIA 8, S/N QD-18, MODS. 24/47 - DAIAG - CEP:74980-970","Goiás","APARECIDA DE GOIANIA - GO",{"$f":"I14","v":"Montes Claros - MG"},2.9430018957152044,3.0695857732808691,2943.0018957152042,813.22,3756.2218957152045,843,null,240.22,null,240.22,52.73,344.42,637.37,163.80000000000001,65.585585585585605,702.9555855855856,3756.2218957152045,4459.1774813007905,null,4459.1774813007905,702.9555855855856,3756.2218957152045,null,null,"CENTRO-OESTE"]
[2403,4488.7074813007903,4,null,"INDÚSTRIA NACIONAL DE ASFALTOS LTDA.","VIA PRIMEIRA E SEGUNDA 3, S/N.º LOTES 01 A 10 - DISTRITO AGROINDUSTRIAL - CEP:75370-000","Goiás","GOIANIRA - GO","Montes Claros - MG",2.9430018957152044,3.0695857732808691,2943.0018957152042,813.22,3756.2218957152045,887,null,251.35,null,251.35,55.17,360.38,666.9,163.80000000000001,65.585585585585605,732.48558558558557,3756.2218957152045,4488.7074813007903,null,4488.7074813007903,732.48558558558557,3756.2218957152045,null,null,"CENTRO-OESTE"]
[null,4038.1936339358517,5,null,"STRATURA ASFALTOS S/A","RUA VICTOR RODRIGUES RESENDE, 333  - DISTRITO IND. DE UBERLÂNDIA - CEP:38405-440","Minas Gerais","UBERLANDIA - MG","Montes Claros - MG",2.7272026129148301,2.7300013717296618,2727.2026129148303,753.59,3480.7926129148304,633,null,187.09,null,187.09,41.06,268.23,496.38,152.4,61.021021021021035,557.40102102102105,3480.7926129148304,4038.1936339358517,null,4038.1936339358517,557.40102102102105,3480.7926129148304,null,null,"SUDESTE"]
[null,5936.2873778453641,6,null,"ARAPETRO DISTRIBUIDORA DE PETRÓLEO LTDA.","RUA 04, S/N° LOTES 17 A 20. - DISTRITO INDUSTRIAL 1/8 - CEP:78600-000","Mato Grosso","BARRA DO GARCAS - MT",{"$f":"I17","v":"Montes Claros - MG"},3.9004890595270454,3.0695857732808691,{"$f":"IF(AND(J18=\"-\",K18=\"-\"),\"\",IF(AND(J18<>0,K18=\"-\"),J18*1000,IF(AND(J18=\"-\",K18<>0),K18*1000,IF(AND(J18<>0,K18<>0),J18*1000,\"\"))))","v":3900.4890595270454},{"$f":"ROUND(((L18/(1-$O$6-$O$7-$O$8))-L18),2)","v":1077.8},4978.2890595270455,1204,null,331.55,null,331.55,72.77,475.36,879.68000000000006,195.6,78.318318318318333,957.99831831831841,4978.2890595270455,5936.2873778453641,{"$nulls":6},"CENTRO-OESTE"]
[null,3977.4130633652808,7,null,"DISTRIBUIDORA BRASILEIRA DE ASFALTO SA - DISBRAL","SÃO JUDAS TADEU, 288  - DISTRITO INDUSTRIAL - CEP:32450-000","Minas Gerais","SARZEDO - MG","Montes Claros - MG",2.7272026129148301,2.7300013717296618,2727.2026129148303,753.59,3480.7926129148304,439,null,138.01,null,138.01,30.29,197.87,366.16999999999996,325.8,130.45045045045049,496.62045045045045,3480.7926129148304,3977.4130633652808,{"$nulls":6},"SUDESTE"]
[null,4676.3276632191337,8,null,"'INDÚSTRIA NACIONAL DE ASFALTOS LTDA.","INDÚSTRIA NACIONAL DE ASFALTOS LTDA - CEP:77053-080","Tocantins"," PALMAS - TO","Montes Claros - MG","-",2.9288976632191339,2928.8976632191338,809.33,3738.2276632191338,1291,null,353.56,null,353.56,77.61,506.93,938.1,0,0,938.1,3738.2276632191338,4676.3276632191337,{"$nulls":6},"NORTE"]
[null,4501.9816316642982,9,null,"'NTA - NOVAS TÉCNICAS DE ASFALTOS S/A","RUA SOFIA ATAURI FADIN, 150 SALA A - B. SANTA TEREZINHA - CEP:13140-000","São Paulo","PAULINIA - SP","Montes Claros - MG",2.7555854755081421,2.7300013717296618,2755.5854755081423,{"$f":"ROUND(((L21/(1-$O$6-$O$7-$O$8))-L21),2)","v":761.43},3517.0154755081421,1009,null,282.22000000000003,null,282.22000000000003,61.95,404.64,748.81,589.79999999999995,236.15615615615619,984.9661561561561,3517.0154755081421,4501.9816316642982,null,4501.9816316642982,984.9661561561561,3517.0154755081421,null,null,"SUDESTE"]
[null,4424.8946947273616,10,null,"COMPANHIA BRASILEIRA DE ASFALTOS DA AMAZÔNIA - IMPORTAÇÃO E EXPORTAÇÃO","Avenida Doutor Olindo Dártora 2451, Galpão 02, Morro Grande - CEP:07726-555","São Paulo","CAIEIRAS - SP","Montes Claros - MG",2.7555854755081421,2.7300013717296618,2755.5854755081423,{"$f":"ROUND(((L22/(1-$O$6-$O$7-$O$8))-L22),2)","v":761.43},3517.0154755081421,979,null,274.63,null,274.63,60.28,393.75,728.66,447.6,179.21921921921927,907.87921921921929,3517.0154755081421,4424.8946947273616,{"$nulls":6},"SUDESTE"]
[null,4986.7067943018901,11,null,"BETUNEL INDÚSTRIA E COMÉRCIO LTDA.","R 16 , 82, Vila Nova Campo Grande - CEP:79.103-834","Mato Grosso do Sul","CAMPO GRANDE - MS","Montes Claros - MG","-",3.0695857732808691,3069.585773280869,{"$f":"ROUND(((L23/(1-$O$6-$O$7-$O$8))-L23),2)","v":848.2},3917.7857732808689,1395,null,379.87,null,379.87,83.38,544.65,1007.9,152.4,61.021021021021035,1068.921021021021,3917.7857732808689,4986.7067943018901,{"$nulls":6},"CENTRO-OESTE"]
[null,6377.7306210886072,12,null,"BETUNEL INDÚSTRIA E COMÉRCIO LTDA.","RUA N ESQUINA COM RUA X, S/N QD. IND. 7 L 01/08 - DIST. IND. - CEP:78015-285","Mato Grosso","CUIABA - MT",{"$f":"I23","v":"Montes Claros - MG"},3.9004890595270454,3.0695857732808691,3900.4890595270454,1077.8,4978.2890595270455,1678,null,451.47,null,451.47,99.1,647.30999999999995,1197.8800000000001,503.4,201.56156156156158,1399.4415615615617,4978.2890595270455,6377.7306210886072,{"$nulls":6},"CENTRO-OESTE"]
[null,4424.9449649976314,13,null,"VIAPOL LTDA.","VITO ARDITO, 6401 KM 118,5 - JARDIM CAMPO GRANDE - CEP:12282-535","São Paulo","CACAPAVA - SP",{"$f":"I24","v":"Montes Claros - MG"},2.7555854755081421,2.7300013717296618,2755.5854755081423,761.43,3517.0154755081421,934,null,263.24,null,263.24,57.78,377.42,698.44,523.20000000000005,209.48948948948953,907.92948948948958,3517.0154755081421,4424.9449649976314,null,4424.9449649976314,907.92948948948958,3517.0154755081421,null,null,"SUDESTE"]
[null,4392.7017320900222,14,null,"STRATURA ASFALTOS S/A","RUA LUIS DE CAMÕES, 26  - CAMPOS ELÍSEOS - CEP:25225-030","Rio de Janeiro","DUQUE DE CAXIAS - RJ","Montes Claros - MG","-",2.7300013717296618,2730.001371729662,754.37,3484.3713717296619,829,null,236.68,null,236.68,51.95,339.34,627.97,700.2,280.3603603603604,908.33036036036037,3484.3713717296619,4392.7017320900222,null,4392.7017320900222,908.33036036036037,3484.3713717296619,null,null,"SUDESTE"]
[null,4777.6164068401176,15,null,"CASA DO ASFALTO DISTRIBUIDORA, INDÚSTRIA E COMÉRCIO DE ASFALTO LTDA.","BR 376, PARQUE INDUSTRIAL, S/N LOTE 6/7/7-A-3-1 - GL.PATR.MARIALVA - CEP:86990-000","Paraná","MARIALVA - PR",{"$f":"I26","v":"Montes Claros - MG"},2.795399700133411,2.8027898463728333,2795.399700133411,772.44,3567.839700133411,1358,null,370.51,null,370.51,81.33,531.23,983.06999999999994,566.20000000000005,226.70670670670677,1209.7767067067066,3567.839700133411,4777.6164068401176,null,4777.6164068401176,1209.7767067067066,3567.839700133411,null,null,"SUL"]
{"$rows_empty":8}
[null,null,null,"Acre"]
[null,null,null,"Alagoas"]
[null,null,null,"Amapá"]
[null,null,null,"Amazonas"]
[null,null,null,"Bahia"]
[null,null,null,"Ceará"]
[null,null,null,"Distrito Federal"]
[null,null,null,"Espírito Santo"]
[null,null,null,"Goiás"]
[null,null,null,"Maranhão"]
[null,null,null,"Mato Grosso"]
[null,null,null,"Mato Grosso do Sul"]
[null,null,null,"Minas Gerais"]
[null,null,null,"Pará"]
[null,null,null,"Paraíba"]
[null,null,null,"Paraná"]
[null,null,null,"Pernambuco"]
[null,null,null,"Piauí"]
[null,null,null,"Rio de Janeiro"]
[null,null,null,"Rio Grande do Norte"]
[null,null,null,"Rio Grande do Sul"]
[null,null,null,"Rondônia"]
[null,null,null,"Roraima"]
[null,null,null,"Santa Catarina"]
[null,null,null,"São Paulo"]
[null,null,null,"Sergipe"]
[null,null,null,"Tocantins"]
[]
[]
[]
[null,null,null,"ASFALTOS DILUÍDOS CM-30"]
[null,null,null,"ASFALTOS DILUÍDOS CM-70"]
[null,null,null,"ASFALTOS DILUÍDOS CR-250"]
[null,null,null,"ASFALTOS DILUÍDOS CR-70"]
[null,null,null,"CAP MODIFICADO POR BORRACHA DE PNEU AB22"]
[null,null,null,"CAP MODIFICADO POR BORRACHA DE PNEU AB8"]
[null,null,null,"CAP MODIFICADO POR POLÍMERO 55-75-E"]
[null,null,null,"CAP MODIFICADO POR POLÍMERO 60-85-E"]
[null,null,null,"CAP MODIFICADO POR POLÍMERO 65-90-E"]
[null,null,null,"CIMENTOS ASFÁLTICOS CAP-150-200"]
[null,null,null,"CIMENTOS ASFÁLTICOS CAP-30-45"]
[null,null,null,"CIMENTOS ASFÁLTICOS CAP-50-70"]
[null,null,null,"CIMENTOS ASFÁLTICOS CAP-85-100"]
[null,null,null,"EMULSÃO ASFÁLTICA CATIÔNICA DE RUPTURA CONTROLADA PARA SERVIÇO DE LAMA ASFÁLTICA"]
[null,null,null,"EMULSÃO ASFÁLTICA DE RUPTURA LENTA CATIÔNICA PARA SERVIÇO DE LAMA ASFÁLTICA"]
[null,null,null,"EMULSÃO ASFÁLTICA DE RUPTURA LENTA DE CARGA NEUTRA PARA SERVIÇO DE LAMA ASFÁLTICA"]
[null,null,null,"EMULSÃO ASFÁLTICA PARA SERVIÇO DE IMPRIMAÇÃO"]
[null,null,null,"EMULSÕES ASF. MOD. POR POLÍMEROS RC1C-E"]
[null,null,null,"EMULSÕES ASF. MOD. POR POLÍMEROS RL1C-E"]
[null,null,null,"EMULSÕES ASF. MOD. POR POLÍMEROS RM1C-E"]
[null,null,null,"EMULSÕES ASF. MOD. POR POLÍMEROS RR1C-E"]
[null,null,null,"EMULSÕES ASF. MOD. POR POLÍMEROS RR2C-E"]
[null,null,null,"EMULSÕES ASFÁLTICAS RL-1C"]
[null,null,null,"EMULSÕES ASFÁLTICAS RM-1C"]
[null,null,null,"EMULSÕES ASFÁLTICAS RM-2C"]
[null,null,null,"EMULSÕES ASFÁLTICAS RR-1C"]
[null,null,null,"EMULSÕES ASFÁLTICAS RR-2C"]

{"sheet":"CAP","index":8,"n_rows":91,"n_cols":34,"rows_kept":91,"cut":false,"hidden":false,"merged":[[10,4,10,8],[10,9,10,10],[10,22,10,23],[12,3,24,3],[1,2,3,26],[5,2,7,2],[5,12,7,12],[6,6,7,6],[6,19,6,20],[6,21,6,24],[7,21,7,24],[5,6,5,7],[5,8,5,9]]}
[]
[null,null,"MEMÓRIA DE CÁLCULO"]
[]
[]
[]
[{"$nulls":6},"TIPOLOGIA DO MATERIAL",null,"CIMENTOS ASFÁLTICOS CAP-50-70",null,null,null,"IMPOSTOS","COFINS",6.4999999999999997E-3,6.4999999999999997E-3]
[{"$nulls":6},"ÍNDICE DE PAVIMENTAÇÃO DNIT","2014-07-01","ÍNDICE INICIAL",270.23700000000002,null,null,null,"PIS",0.03,0.03,null,null,null,"LEGENDA",{"$nulls":8},"As empresas tributadas pelo Lucro Presumido pagam 0,65% de PIS e 3% de COFINS"]
[{"$nulls":7},"2023-10-01","ÍNDICE FINAL",587.95899999999995,null,null,null," ICMS",0.18,0.18,{"$f":"1-(O8/1)","v":0.82000000000000006},{"$f":"1-(P8/1)","v":0.82000000000000006},{"$f":"1-(Q8/1)","v":0.17999999999999994},"ENTRADA DE DADOS",null,"QUANT.ESTIMADA DE CAP 50/70 (TON.):",null,null,null,{"$f":"ORÇAMENTO!H57","v":69.999999999999986},"TONELADAS",null,"As empresas tributadas pelo Lucro Real pagam 1,65% de PIS e 7,60% de COFINS"]
[{"$nulls":6},"Data ANP",{"$f":"EAI!H9","v":"2025-02-01"}]
[]
[null,null,"DATA-BASE","PRODUTOS","LOCALIDADES",{"$nulls":4},"CUSTO ANP (R$/Kg)",null,"CUSTO ANP","IMPOSTOS DO PRODUTO","CUSTO DO PRODUTO COM IMPOSTOS","DMT's","DMT's FLUVIAL","CUSTO DO TRANSPORTE RODOVIA PAVIMENTADA","CUSTO DO TRANSPORTE FLUVIAL","CUSTO DO TRANSPORTE TOTAL","ICMS","ATUALIZAÇÃO DO CUSTO DE TRANSPORTE","CUSTO DO TRANSPORTE RODOVIA PAVIMENTADA COM IMPOSTOS E ATUALIZAÇÃO MONETÁRIA","PEDÁGIO ",null,"TOTAL TRANSPORTE","AQUISIÇÃO DO PRODUTO","TOTAL GERAL ( TRANSP + AQUISIÇÃO)",null,1,2,3]
[null,null,{"$f":"H8","v":"2023-10-01"},null,"REFINARIAS","ENDEREÇO","ESTADO","CIDADE","DESTINO","ESTADO","REGIÃO","R$/t","R$/t","R$/t","KM","KM","R$/t","R$/t","R$/t","R$/t","R$/t","R$/t","CUSTO ","R$/t","R$/t","R$/t","R$/t",null,"TOTAL GERAL ( TRANSP + AQUISIÇÃO)","TOTAL TRANSPORTE","AQUISIÇÃO DO PRODUTO"]
[null,{"$f":"AA13","v":6374.268315254847},1,{"$f":"I6","v":"CIMENTOS ASFÁLTICOS CAP-50-70"},"Refinaria Abreu e Lima","Rodovia PE 60, Km 10 - Ipojuca - PE CEP:55590-000","Pernambuco","IPOJUCA - PE",{"$f":"EAI!I13","v":"Montes Claros - MG"},"-",4.0633326009691331,{"$f":"IF(AND(J13=\"-\",K13=\"-\"),\"\",IF(AND(J13<>0,K13=\"-\"),J13*1000,IF(AND(J13=\"-\",K13<>0),K13*1000,IF(AND(J13<>0,K13<>0),J13*1000,\"\"))))","v":4063.3326009691332},{"$f":"ROUND(((L13/(1-$O$6-$O$7-$O$8))-L13),2)","v":1122.8},{"$f":"L13+M13","v":5186.1326009691329},{"$f":"EAI!O13","v":1631},null,{"$f":"ROUND((26.939+0.253*O13),2)","v":439.58},null,{"$f":"Q13+R13","v":439.58},{"$f":"TRUNC(S13*($O$8/(1-$O$8)),2)","v":96.49},{"$f":"TRUNC(IF($J$7=\"\",\"\",(($J$8-$J$7)/$J$7)*(S13+T13)),2)","v":630.26},{"$f":"S13+T13+U13","v":1166.33},{"$f":"EAI!W13","v":254.4},{"$f":"EVEN($Z$8*2/28)*W13/$Z$8","v":21.805714285714291},{"$f":"IF(AND(Q13=\"\",T13=\"\"),\"\",V13+X13)","v":1188.1357142857141},{"$f":"IF(OR(L13=\"\",M13=\"\"),\"\",L13+M13)","v":5186.1326009691329},{"$f":"IF(OR(Y13=\"\",Z13=\"\"),\"\",Y13+Z13)","v":6374.268315254847},null,{"$f":"AA13","v":6374.268315254847},{"$f":"Y13","v":1188.1357142857141},{"$f":"Z13","v":5186.1326009691329},null,null,{"$f":"IF(OR(G13=$D$51,G13=$D$52,G13=$D$54,G13=$D$60,G13=$D$44,G13=$D$40,G13=$D$36,G13=$D$49,G13=$D$39),\"NORDESTE\",IF(OR(G13=$D$35,G13=$D$37,G13=$D$38,G13=$D$48,G13=$D$56,G13=$D$57,G13=$D$61),\"NORTE\",IF(OR(G13=$D$41,G13=$D$43,G13=$D$45,G13=$D$46),\"CENTRO-OESTE\",IF(OR(G13=$D$59,G13=$D$53,G13=$D$47,G13=$D$42),\"SUDESTE\",IF(OR(G13=$D$58,G13=$D$50,G13=$D$55),\"SUL\",\"\")))))","v":"NORDESTE"}]
[null,{"$f":"AA14","v":6564.1783152548469},3,null,"Refinaria Potiguar Clara Camarão","Rodovia RN 221, KM 25 - Guamaré - RN CEP:59598-000","Rio Grande do Norte","GUAMARÉ - RN",{"$f":"I13","v":"Montes Claros - MG"},"-",4.0633326009691331,4063.3326009691332,{"$f":"ROUND(((L14/(1-$O$6-$O$7-$O$8))-L14),2)","v":1122.8},{"$f":"L14+M14","v":5186.1326009691329},{"$f":"EAI!O14","v":1923},null,{"$f":"ROUND((26.939+0.253*O14),2)","v":513.46},null,{"$f":"Q14+R14","v":513.46},{"$f":"TRUNC(S14*($O$8/(1-$O$8)),2)","v":112.71},{"$f":"TRUNC(IF($J$7=\"\",\"\",(($J$8-$J$7)/$J$7)*(S14+T14)),2)","v":736.19},{"$f":"S14+T14+U14","v":1362.3600000000001},{"$f":"EAI!W14","v":183},{"$f":"EVEN($Z$8*2/28)*W14/$Z$8","v":15.685714285714289},1378.0457142857144,5186.1326009691329,{"$f":"IF(OR(Y14=\"\",Z14=\"\"),\"\",Y14+Z14)","v":6564.1783152548469},null,{"$f":"AA14","v":6564.1783152548469},{"$f":"Y14","v":1378.0457142857144},5186.1326009691329,null,null,"NORDESTE"]
[null,5911.3861441812369,4,null,"Refinaria Landulpho Alves (RLAM)","Rodovia BA 523, KM 4 – Mataripe São Francisco do Conde - BA CEP:43900-000","Bahia","SÃO FRANCISCO DO CONDE - BA",{"$f":"I14","v":"Montes Claros - MG"},4.0617104298955224,4.0633326009691331,4061.7104298955223,{"$f":"ROUND(((L15/(1-$O$6-$O$7-$O$8))-L15),2)","v":1122.3499999999999},5184.0604298955222,{"$f":"EAI!O15","v":951},null,{"$f":"ROUND((26.939+0.253*O15),2)","v":267.54000000000002},null,267.54000000000002,58.72,383.58,709.83999999999992,{"$f":"EAI!W15","v":204},17.485714285714288,727.32571428571418,5184.0604298955222,5911.3861441812369,null,5911.3861441812369,727.32571428571418,5184.0604298955222,null,null,"NORDESTE"]
[2403,6571.3884943560552,5,null,"Refinaria Lubrificantes e Derivados do Nordeste (Lubnor)","Av. Leite Barbosa, s/nº - Mucuripe Fortaleza - Ceará CEP:60180-420","Ceará","FORTALEZA - CE","Montes Claros - MG",4.046902780070341,4.0633326009691331,4046.9027800703411,{"$f":"ROUND(((L16/(1-$O$6-$O$7-$O$8))-L16),2)","v":1118.26},5165.1627800703409,{"$f":"EAI!O16","v":1965},null,524.08000000000004,null,524.08000000000004,115.04,751.42,1390.54,{"$f":"EAI!W16","v":183},15.685714285714289,1406.2257142857143,5165.1627800703409,6571.3884943560552,null,6571.3884943560552,1406.2257142857143,5165.1627800703409,null,null,"NORDESTE"]
[null,5676.670827540861,6,null,"Refinaria Capuava (Recap)","Av. Alberto Soares Sampaio, 2122-A Capuava – Mauá - SP","São Paulo","MAUÁ - SP","Montes Claros - MG",3.833433684683718,3.814083778291931,3833.4336846837182,{"$f":"ROUND(((L17/(1-$O$6-$O$7-$O$8))-L17),2)","v":1059.27},4892.7036846837182,{"$f":"EAI!O17","v":1002},null,280.45,null,280.45,61.56,402.1,744.11,{"$f":"EAI!W17","v":465},39.857142857142868,783.9671428571429,4892.7036846837182,5676.670827540861,null,5676.670827540861,783.9671428571429,4892.7036846837182,null,null,"SUDESTE"]
[null,5571.9194036623894,7,null,"Refinaria Duque de Caxias (Reduc)","Rodovia Washington Luiz, km 113,7 Campos Elíseos – Duque de Caxias - RJ CEP:25213-005","Rio de Janeiro","DUQUE DE CAXIAS - RJ","Montes Claros - MG",3.8276222608052461,3.814083778291931,3827.6222608052462,1057.6600000000001,4885.2822608052466,{"$f":"EAI!O18","v":827},null,236.17,null,236.17,51.84,338.61,626.62,{"$f":"EAI!W18","v":700.2},60.017142857142879,686.63714285714286,4885.2822608052466,5571.9194036623894,null,5571.9194036623894,686.63714285714286,4885.2822608052466,null,null,"SUDESTE"]
[null,6579.5558875258048,8,null,"Refinaria Alberto Pasqualini (Refap)","Avenida Getúlio Vargas, 11001 - Bairro Brigadeira Canoas - RS - Brasil CEP:92420-221","Rio Grande do Sul","CANOAS - RS","Montes Claros - MG",3.9063201732400903,3.9040696863749358,3906.3201732400903,1079.4100000000001,4985.7301732400902,{"$f":"EAI!O19","v":2134},null,566.84,null,566.84,124.42,812.72,1503.98,{"$f":"EAI!W19","v":1048.2},89.845714285714308,1593.8257142857144,4985.7301732400902,6579.5558875258048,null,6579.5558875258048,1593.8257142857144,4985.7301732400902,null,null,"SUL"]
[null,6139.0614584706809,9,null,"Unidade de Industrialização do Xisto (SIX)","Rodovia do Xisto, BR 476, km 153 São Mateus do Sul – PR CEP 83900-000","Paraná","SÃO MATEUS DO SUL - PR","Montes Claros - MG",3.90201288704211,3.9040696863749358,3902.0128870421099,1078.22,4980.2328870421097,{"$f":"EAI!O20","v":1539},null,416.31,null,416.31,91.38,596.89,1104.58,{"$f":"EAI!W20","v":632.9},54.248571428571431,1158.8285714285714,4980.2328870421097,6139.0614584706809,null,6139.0614584706809,1158.8285714285714,4980.2328870421097,null,null,"SUL"]
[null,5203.9008450421588,10,null,"Refinaria Gabriel Passos (Regap)","Av. Refinaria Gabriel Passos, 690 Distrito Industrial Paulo Camilo Sul Betim - MG CEP:32669-205","Minas Gerais","BETIM - MG","Montes Claros - MG",3.7727151307564442,3.814083778291931,3772.7151307564441,1042.49,4815.2051307564443,{"$f":"EAI!O21","v":431},null,135.97999999999999,null,135.97999999999999,29.84,194.95,360.77,{"$f":"EAI!W21","v":325.8},27.925714285714292,388.6957142857143,4815.2051307564443,{"$f":"IF(OR(Y21=\"\",Z21=\"\"),\"\",Y21+Z21)","v":5203.9008450421588},null,5203.9008450421588,388.6957142857143,4815.2051307564443,null,null,"SUDESTE"]
[null,6081.970029899252,11,null,"Refinaria Presidente Getúlio Vargas (Repar)","Rodovia do Xisto, BR 476, km 16 Araucária - PR CEP:83707-440","Paraná","ARAUCÁRIA - PR","Montes Claros - MG",3.90201288704211,3.9040696863749358,3902.0128870421099,1078.22,4980.2328870421097,{"$f":"EAI!O22","v":1440},null,391.26,null,391.26,85.88,560.98,1038.1199999999999,{"$f":"EAI!W22","v":742.2},63.617142857142881,1101.7371428571428,4980.2328870421097,6081.970029899252,null,6081.970029899252,1101.7371428571428,4980.2328870421097,null,null,"SUL"]
[null,5702.8208275408615,12,null,"Refinaria Presidente Bernardes (RPBC)","Av. 9 de abril, 777 - Jardim das Indústrias Cubatão - SP CEP:11505-000","São Paulo","CUBATÃO - SP","Montes Claros - MG",3.833433684683718,3.814083778291931,3833.4336846837182,1059.27,4892.7036846837182,{"$f":"EAI!O23","v":1041},null,290.31,null,290.31,63.72,416.23,770.26,{"$f":"EAI!W23","v":465},39.857142857142868,810.11714285714288,4892.7036846837182,5702.8208275408615,null,5702.8208275408615,810.11714285714288,4892.7036846837182,null,null,"SUDESTE"]
[null,5690.4979703980043,13,null,"Refinaria de Paulínia (Replan)","Rodovia SP 332 - Km. 130 Bonfim - Paulínia – SP CEP:13140-000","São Paulo","PAULÍNIA - SP","Montes Claros - MG",3.833433684683718,3.814083778291931,3833.4336846837182,1059.27,4892.7036846837182,{"$f":"EAI!O24","v":1021},null,285.25,null,285.25,62.61,408.98,756.84,{"$f":"EAI!W24","v":477.8},40.954285714285724,797.79428571428571,4892.7036846837182,5690.4979703980043,null,5690.4979703980043,797.79428571428571,4892.7036846837182,null,null,"SUDESTE"]
[null,5648.7593989694324,14,null,"Refinaria Henrique Lage (Revap)","Rodovia Presidente Dutra, KM 143, S/N Bairro Jardim Diamante - São José dos Campos – SP CEP:12223-900","São Paulo","SÃO JOSÉ DOS CAMPOS - SP","Montes Claros - MG",3.833433684683718,3.814083778291931,3833.4336846837182,1059.27,4892.7036846837182,{"$f":"EAI!O25","v":953},null,268.05,null,268.05,58.84,384.32,711.21,{"$f":"EAI!W25","v":523.20000000000005},44.845714285714301,756.05571428571432,4892.7036846837182,5648.7593989694324,null,5648.7593989694324,756.05571428571432,4892.7036846837182,null,null,"SUDESTE"]
{"$rows_empty":9}
[null,null,null,"Acre"]
[null,null,null,"Alagoas"]
[null,null,null,"Amapá"]
[null,null,null,"Amazonas"]
[null,null,null,"Bahia"]
[null,null,null,"Ceará"]
[null,null,null,"Distrito Federal"]
[null,null,null,"Espírito Santo"]
[null,null,null,"Goiás"]
[null,null,null,"Maranhão"]
[null,null,null,"Mato Grosso"]
[null,null,null,"Mato Grosso do Sul"]
[null,null,null,"Minas Gerais"]
[null,null,null,"Pará"]
[null,null,null,"Paraíba"]
[null,null,null,"Paraná"]
[null,null,null,"Pernambuco"]
[null,null,null,"Piauí"]
[null,null,null,"Rio de Janeiro"]
[null,null,null,"Rio Grande do Norte"]
[null,null,null,"Rio Grande do Sul"]
[null,null,null,"Rondônia"]
[null,null,null,"Roraima"]
[null,null,null,"Santa Catarina"]
[null,null,null,"São Paulo"]
[null,null,null,"Sergipe"]
[null,null,null,"Tocantins"]
[]
[]
[]
[null,null,null,"ASFALTOS DILUÍDOS CM-30"]
[null,null,null,"ASFALTOS DILUÍDOS CM-70"]
[null,null,null,"ASFALTOS DILUÍDOS CR-250"]
[null,null,null,"ASFALTOS DILUÍDOS CR-70"]
[null,null,null,"CAP MODIFICADO POR BORRACHA DE PNEU AB22"]
[null,null,null,"CAP MODIFICADO POR BORRACHA DE PNEU AB8"]
[null,null,null,"CAP MODIFICADO POR POLÍMERO 55-75-E"]
[null,null,null,"CAP MODIFICADO POR POLÍMERO 60-85-E"]
[null,null,null,"CAP MODIFICADO POR POLÍMERO 65-90-E"]
[null,null,null,"CIMENTOS ASFÁLTICOS CAP-150-200"]
[null,null,null,"CIMENTOS ASFÁLTICOS CAP-30-45"]
[null,null,null,"CIMENTOS ASFÁLTICOS CAP-50-70"]
[null,null,null,"CIMENTOS ASFÁLTICOS CAP-85-100"]
[null,null,null,"EMULSÃO ASFÁLTICA CATIÔNICA DE RUPTURA CONTROLADA PARA SERVIÇO DE LAMA ASFÁLTICA"]
[null,null,null,"EMULSÃO ASFÁLTICA DE RUPTURA LENTA CATIÔNICA PARA SERVIÇO DE LAMA ASFÁLTICA"]
[null,null,null,"EMULSÃO ASFÁLTICA DE RUPTURA LENTA DE CARGA NEUTRA PARA SERVIÇO DE LAMA ASFÁLTICA"]
[null,null,null,"EMULSÃO ASFÁLTICA PARA SERVIÇO DE IMPRIMAÇÃO"]
[null,null,null,"EMULSÕES ASF. MOD. POR POLÍMEROS RC1C-E"]
[null,null,null,"EMULSÕES ASF. MOD. POR POLÍMEROS RL1C-E"]
[null,null,null,"EMULSÕES ASF. MOD. POR POLÍMEROS RM1C-E"]
[null,null,null,"EMULSÕES ASF. MOD. POR POLÍMEROS RR1C-E"]
[null,null,null,"EMULSÕES ASF. MOD. POR POLÍMEROS RR2C-E"]
[null,null,null,"EMULSÕES ASFÁLTICAS RL-1C"]
[null,null,null,"EMULSÕES ASFÁLTICAS RM-1C"]
[null,null,null,"EMULSÕES ASFÁLTICAS RM-2C"]
[null,null,null,"EMULSÕES ASFÁLTICAS RR-1C"]
[null,null,null,"EMULSÕES ASFÁLTICAS RR-2C"]

{"sheet":"MAT.ASF","index":9,"n_rows":33,"n_cols":23,"rows_kept":33,"cut":false,"hidden":false,"merged":[[7,1,7,19],[8,1,10,22],[2,1,2,8],[3,1,3,8],[4,1,4,8],[5,1,5,8],[6,1,6,22],[20,2,25,2],[27,2,32,2],[19,1,19,22],[26,1,26,22],[11,2,12,2],[11,3,11,6],[11,7,11,8],[11,18,11,19],[13,2,18,2]]}
{"$rows_empty":8}
[null,"PLANILHA RESUMO - MATERIAIS ASFÁLTICOS"]
[]
[]
[null,"DATA-BASE","PRODUTOS","LOCALIDADES",null,null,null,"CUSTO ANP (R$/Kg)",null,"CUSTO ANP","IMPOSTOS DO PRODUTO","CUSTO DO PRODUTO COM IMPOSTOS","DMT's","DMT's","CUSTO DO TRANSPORTE TOTAL","ICMS","ATUALIZAÇÃO DO CUSTO DE TRANSPORTE","CUSTO DO TRANSPORTE RODOVIA PAVIMENTADA COM IMPOSTOS E ATUALIZAÇÃO MONETÁRIA","PEDÁGIO ",null,"TOTAL TRANSPORTE","TOTAL PRODUTO","TOTAL GERAL"]
[null,{"$f":"CAP!H9","v":"2025-02-01"},null,"REFINARIAS","ENDEREÇO","ORIGEM - REFINARIAS / DISTRIBUIDORAS","DESTINO","ESTADO","REGIÃO","R$/t","R$/t","R$/t","KM","KM","R$/t","R$/t","R$/t","R$/t","CUSTO POR EIXO","R$/t","R$/t","R$/t","R$/t"]
[null,1,"CAP 50/70","Refinaria Abreu e Lima","Rodovia PE 60, Km 10 - Ipojuca - PE CEP:55590-000",{"$f":"VLOOKUP($W14,CAP!$B:$AA,7,FALSE)","v":"BETIM - MG"},{"$f":"VLOOKUP($W14,CAP!$B:$AA,8,FALSE)","v":"Montes Claros - MG"},{"$f":"VLOOKUP($W14,CAP!$B:$AA,9,FALSE)","v":3.7727151307564442},{"$f":"VLOOKUP($W14,CAP!$B:$AA,10,FALSE)","v":3.814083778291931},{"$f":"VLOOKUP($W14,CAP!$B:$AA,11,FALSE)","v":3772.7151307564441},{"$f":"VLOOKUP($W14,CAP!$B:$AA,12,FALSE)","v":1042.49},{"$f":"VLOOKUP($W14,CAP!$B:$AA,13,FALSE)","v":4815.2051307564443},{"$f":"VLOOKUP($W14,CAP!$B$13:$AA$25,14,FALSE)","v":431},{"$f":"VLOOKUP($W14,'[1]Transporte Cap 50-70'!$B:$AA,15,FALSE)","v":{"$error":"#N/A"}},{"$f":"VLOOKUP($W14,CAP!$B:$AA,18,FALSE)","v":135.97999999999999},{"$f":"VLOOKUP($W14,CAP!$B:$AA,19,FALSE)","v":29.84},{"$f":"VLOOKUP($W14,CAP!$B:$AA,20,FALSE)","v":194.95},{"$f":"VLOOKUP($W14,CAP!$B:$AA,21,FALSE)","v":360.77},{"$f":"VLOOKUP($W14,CAP!$B:$AA,22,FALSE)","v":325.8},{"$f":"VLOOKUP($W14,CAP!$B:$AA,23,FALSE)","v":27.925714285714292},{"$f":"VLOOKUP($W14,CAP!$B:$AA,24,FALSE)","v":388.6957142857143},{"$f":"VLOOKUP($W14,CAP!$B:$AA,25,FALSE)","v":4815.2051307564443},{"$f":"SMALL(CAP!$AA$13:$AA$25,1)","v":5203.9008450421588}]
[null,2,null,"Refinaria Potiguar Clara Camarão","Rodovia RN 221, KM 25 - Guamaré - RN CEP:59598-000",{"$f":"VLOOKUP($W15,CAP!$B:$AA,7,FALSE)","v":"DUQUE DE CAXIAS - RJ"},{"$f":"VLOOKUP($W15,CAP!$B:$AA,8,FALSE)","v":"Montes Claros - MG"},{"$f":"VLOOKUP($W15,CAP!$B:$AA,9,FALSE)","v":3.8276222608052461},{"$f":"VLOOKUP($W15,CAP!$B:$AA,10,FALSE)","v":3.814083778291931},{"$f":"VLOOKUP($W15,CAP!$B:$AA,11,FALSE)","v":3827.6222608052462},{"$f":"VLOOKUP($W15,CAP!$B:$AA,12,FALSE)","v":1057.6600000000001},{"$f":"VLOOKUP($W15,CAP!$B:$AA,13,FALSE)","v":4885.2822608052466},{"$f":"VLOOKUP($W15,CAP!$B$13:$AA$25,14,FALSE)","v":827},{"$f":"VLOOKUP($W15,'[1]Transporte Cap 50-70'!$B:$AA,15,FALSE)","v":{"$error":"#N/A"}},{"$f":"VLOOKUP($W15,CAP!$B:$AA,18,FALSE)","v":236.17},{"$f":"VLOOKUP($W15,CAP!$B:$AA,19,FALSE)","v":51.84},{"$f":"VLOOKUP($W15,CAP!$B:$AA,20,FALSE)","v":338.61},{"$f":"VLOOKUP($W15,CAP!$B:$AA,21,FALSE)","v":626.62},{"$f":"VLOOKUP($W15,CAP!$B:$AA,22,FALSE)","v":700.2},{"$f":"VLOOKUP($W15,CAP!$B:$AA,23,FALSE)","v":60.017142857142879},{"$f":"VLOOKUP($W15,CAP!$B:$AA,24,FALSE)","v":686.63714285714286},{"$f":"VLOOKUP($W15,CAP!$B:$AA,25,FALSE)","v":4885.2822608052466},{"$f":"SMALL(CAP!$AA$13:$AA$25,2)","v":5571.9194036623894}]
[null,3,null,"Complexo Petroquímico do Rio de Janeiro (Comperj)","Rodovia Estadual RJ-116 - Km 5,2 - Acesso A-1, s/n, Complemento Sambaetiba - Zona Urbana do 4º Distrito de Itaboraí - RJ CEP:24841-203",{"$f":"VLOOKUP($W16,CAP!$B:$AA,7,FALSE)","v":"SÃO JOSÉ DOS CAMPOS - SP"},{"$f":"VLOOKUP($W16,CAP!$B:$AA,8,FALSE)","v":"Montes Claros - MG"},{"$f":"VLOOKUP($W16,CAP!$B:$AA,9,FALSE)","v":3.833433684683718},{"$f":"VLOOKUP($W16,CAP!$B:$AA,10,FALSE)","v":3.814083778291931},{"$f":"VLOOKUP($W16,CAP!$B:$AA,11,FALSE)","v":3833.4336846837182},{"$f":"VLOOKUP($W16,CAP!$B:$AA,12,FALSE)","v":1059.27},{"$f":"VLOOKUP($W16,CAP!$B:$AA,13,FALSE)","v":4892.7036846837182},{"$f":"VLOOKUP($W16,CAP!$B$13:$AA$25,14,FALSE)","v":953},{"$f":"VLOOKUP($W16,'[1]Transporte Cap 50-70'!$B:$AA,15,FALSE)","v":{"$error":"#N/A"}},{"$f":"VLOOKUP($W16,CAP!$B:$AA,18,FALSE)","v":268.05},{"$f":"VLOOKUP($W16,CAP!$B:$AA,19,FALSE)","v":58.84},{"$f":"VLOOKUP($W16,CAP!$B:$AA,20,FALSE)","v":384.32},{"$f":"VLOOKUP($W16,CAP!$B:$AA,21,FALSE)","v":711.21},{"$f":"VLOOKUP($W16,CAP!$B:$AA,22,FALSE)","v":523.20000000000005},{"$f":"VLOOKUP($W16,CAP!$B:$AA,23,FALSE)","v":44.845714285714301},{"$f":"VLOOKUP($W16,CAP!$B:$AA,24,FALSE)","v":756.05571428571432},{"$f":"VLOOKUP($W16,CAP!$B:$AA,25,FALSE)","v":4892.7036846837182},{"$f":"SMALL(CAP!$AA$13:$AA$25,3)","v":5648.7593989694324}]
[null,4,null,null,null,{"$f":"VLOOKUP($W17,CAP!$B:$AA,7,FALSE)","v":"MAUÁ - SP"},{"$f":"VLOOKUP($W17,CAP!$B:$AA,8,FALSE)","v":"Montes Claros - MG"},{"$f":"VLOOKUP($W17,CAP!$B:$AA,9,FALSE)","v":3.833433684683718},{"$f":"VLOOKUP($W17,CAP!$B:$AA,10,FALSE)","v":3.814083778291931},{"$f":"VLOOKUP($W17,CAP!$B:$AA,11,FALSE)","v":3833.4336846837182},{"$f":"VLOOKUP($W17,CAP!$B:$AA,12,FALSE)","v":1059.27},{"$f":"VLOOKUP($W17,CAP!$B:$AA,13,FALSE)","v":4892.7036846837182},{"$f":"VLOOKUP($W17,CAP!$B$13:$AA$25,14,FALSE)","v":1002},{"$f":"VLOOKUP($W17,'[1]Transporte Cap 50-70'!$B:$AA,15,FALSE)","v":{"$error":"#N/A"}},{"$f":"VLOOKUP($W17,CAP!$B:$AA,18,FALSE)","v":280.45},{"$f":"VLOOKUP($W17,CAP!$B:$AA,19,FALSE)","v":61.56},{"$f":"VLOOKUP($W17,CAP!$B:$AA,20,FALSE)","v":402.1},{"$f":"VLOOKUP($W17,CAP!$B:$AA,21,FALSE)","v":744.11},{"$f":"VLOOKUP($W17,CAP!$B:$AA,22,FALSE)","v":465},{"$f":"VLOOKUP($W17,CAP!$B:$AA,23,FALSE)","v":39.857142857142868},{"$f":"VLOOKUP($W17,CAP!$B:$AA,24,FALSE)","v":783.9671428571429},{"$f":"VLOOKUP($W17,CAP!$B:$AA,25,FALSE)","v":4892.7036846837182},{"$f":"SMALL(CAP!$AA$13:$AA$25,4)","v":5676.670827540861}]
[null,5,null,null,null,{"$f":"VLOOKUP($W18,CAP!$B:$AA,7,FALSE)","v":"PAULÍNIA - SP"},{"$f":"VLOOKUP($W18,CAP!$B:$AA,8,FALSE)","v":"Montes Claros - MG"},{"$f":"VLOOKUP($W18,CAP!$B:$AA,9,FALSE)","v":3.833433684683718},{"$f":"VLOOKUP($W18,CAP!$B:$AA,10,FALSE)","v":3.814083778291931},{"$f":"VLOOKUP($W18,CAP!$B:$AA,11,FALSE)","v":3833.4336846837182},{"$f":"VLOOKUP($W18,CAP!$B:$AA,12,FALSE)","v":1059.27},{"$f":"VLOOKUP($W18,CAP!$B:$AA,13,FALSE)","v":4892.7036846837182},{"$f":"VLOOKUP($W18,CAP!$B$13:$AA$25,14,FALSE)","v":1021},{"$f":"VLOOKUP($W18,'[1]Transporte Cap 50-70'!$B:$AA,15,FALSE)","v":{"$error":"#N/A"}},{"$f":"VLOOKUP($W18,CAP!$B:$AA,18,FALSE)","v":285.25},{"$f":"VLOOKUP($W18,CAP!$B:$AA,19,FALSE)","v":62.61},{"$f":"VLOOKUP($W18,CAP!$B:$AA,20,FALSE)","v":408.98},{"$f":"VLOOKUP($W18,CAP!$B:$AA,21,FALSE)","v":756.84},{"$f":"VLOOKUP($W18,CAP!$B:$AA,22,FALSE)","v":477.8},{"$f":"VLOOKUP($W18,CAP!$B:$AA,23,FALSE)","v":40.954285714285724},{"$f":"VLOOKUP($W18,CAP!$B:$AA,24,FALSE)","v":797.79428571428571},{"$f":"VLOOKUP($W18,CAP!$B:$AA,25,FALSE)","v":4892.7036846837182},{"$f":"SMALL(CAP!$AA$13:$AA$25,5)","v":5690.4979703980043}]
[null,6,null,null,null,{"$f":"VLOOKUP($W19,CAP!$B:$AA,7,FALSE)","v":"CUBATÃO - SP"},{"$f":"VLOOKUP($W19,CAP!$B:$AA,8,FALSE)","v":"Montes Claros - MG"},{"$f":"VLOOKUP($W19,CAP!$B:$AA,9,FALSE)","v":3.833433684683718},{"$f":"VLOOKUP($W19,CAP!$B:$AA,10,FALSE)","v":3.814083778291931},{"$f":"VLOOKUP($W19,CAP!$B:$AA,11,FALSE)","v":3833.4336846837182},{"$f":"VLOOKUP($W19,CAP!$B:$AA,12,FALSE)","v":1059.27},{"$f":"VLOOKUP($W19,CAP!$B:$AA,13,FALSE)","v":4892.7036846837182},{"$f":"VLOOKUP($W19,CAP!$B$13:$AA$25,14,FALSE)","v":1041},{"$f":"VLOOKUP($W19,'[1]Transporte Cap 50-70'!$B:$AA,15,FALSE)","v":{"$error":"#N/A"}},{"$f":"VLOOKUP($W19,CAP!$B:$AA,18,FALSE)","v":290.31},{"$f":"VLOOKUP($W19,CAP!$B:$AA,19,FALSE)","v":63.72},{"$f":"VLOOKUP($W19,CAP!$B:$AA,20,FALSE)","v":416.23},{"$f":"VLOOKUP($W19,CAP!$B:$AA,21,FALSE)","v":770.26},{"$f":"VLOOKUP($W19,CAP!$B:$AA,22,FALSE)","v":465},{"$f":"VLOOKUP($W19,CAP!$B:$AA,23,FALSE)","v":39.857142857142868},{"$f":"VLOOKUP($W19,CAP!$B:$AA,24,FALSE)","v":810.11714285714288},{"$f":"VLOOKUP($W19,CAP!$B:$AA,25,FALSE)","v":4892.7036846837182},{"$f":"SMALL(CAP!$AA$13:$AA$25,6)","v":5702.8208275408615}]
[]
[null,1,"EMULSÃO ASFÁLTICA PARA IMPRIMAÇÃO (EAI)","Refinaria Abreu e Lima","Rodovia PE 60, Km 10 - Ipojuca - PE CEP:55590-000",{"$f":"VLOOKUP($W21,EAI!$B$13:$AA$24,7,FALSE)","v":"BETIM - MG"},{"$f":"VLOOKUP($W21,EAI!$B$13:$AA$24,8,FALSE)","v":"Montes Claros - MG"},{"$f":"VLOOKUP($W21,EAI!$B$13:$AA$24,9,FALSE)","v":2.7674270595881234},{"$f":"VLOOKUP($W21,EAI!$B$13:$AA$24,10,FALSE)","v":2.7609338335366278},{"$f":"VLOOKUP($W21,EAI!$B$13:$AA$24,11,FALSE)","v":2767.4270595881235},{"$f":"VLOOKUP($W21,EAI!$B$13:$AA$24,12,FALSE)","v":764.71},{"$f":"VLOOKUP($W21,EAI!$B$13:$AA$24,13,FALSE)","v":3532.1370595881235},{"$f":"VLOOKUP($W21,EAI!$B$13:$AA$24,14,FALSE)","v":431},{"$f":"VLOOKUP($W21,'[1]Transporte CM-30'!$B$13:$AA$25,15,FALSE)","v":{"$error":"#N/A"}},{"$f":"VLOOKUP($W21,EAI!$B$13:$AA$24,18,FALSE)","v":135.97999999999999},{"$f":"VLOOKUP($W21,EAI!$B$13:$AA$24,19,FALSE)","v":29.84},{"$f":"VLOOKUP($W21,EAI!$B$13:$AA$24,20,FALSE)","v":194.95},{"$f":"VLOOKUP($W21,EAI!$B$13:$AA$24,21,FALSE)","v":360.77},{"$f":"VLOOKUP($W21,EAI!$B$13:$AA$24,22,FALSE)","v":325.8},{"$f":"VLOOKUP($W21,EAI!$B$13:$AA$24,23,FALSE)","v":40.725000000000001},{"$f":"VLOOKUP($W21,EAI!$B$13:$AA$24,24,FALSE)","v":401.495},{"$f":"VLOOKUP($W21,EAI!$B:$AA,25,FALSE)","v":3532.1370595881235},{"$f":"SMALL(EAI!$AA$13:$AA$24,1)","v":3933.6320595881234}]
[null,2,null,"Refinaria Potiguar Clara Camarão","Rodovia RN 221, KM 25 - Guamaré - RN CEP:59598-000",{"$f":"VLOOKUP($W22,EAI!$B$13:$AA$24,7,FALSE)","v":"SÃO FRANCISCO DO CONDE - BA"},{"$f":"VLOOKUP($W22,EAI!$B$13:$AA$24,8,FALSE)","v":"Montes Claros - MG"},{"$f":"VLOOKUP($W22,EAI!$B$13:$AA$24,9,FALSE)","v":"-"},{"$f":"VLOOKUP($W22,EAI!$B$13:$AA$24,10,FALSE)","v":2.7104017950292691},{"$f":"VLOOKUP($W22,EAI!$B$13:$AA$24,11,FALSE)","v":2710.4017950292691},{"$f":"VLOOKUP($W22,EAI!$B$13:$AA$24,12,FALSE)","v":748.95},{"$f":"VLOOKUP($W22,EAI!$B$13:$AA$24,13,FALSE)","v":3459.3517950292689},{"$f":"VLOOKUP($W22,EAI!$B$13:$AA$24,14,FALSE)","v":951},{"$f":"VLOOKUP($W22,'[1]Transporte CM-30'!$B$13:$AA$25,15,FALSE)","v":{"$error":"#N/A"}},{"$f":"VLOOKUP($W22,EAI!$B$13:$AA$24,18,FALSE)","v":267.54000000000002},{"$f":"VLOOKUP($W22,EAI!$B$13:$AA$24,19,FALSE)","v":58.72},{"$f":"VLOOKUP($W22,EAI!$B$13:$AA$24,20,FALSE)","v":383.58},{"$f":"VLOOKUP($W22,EAI!$B$13:$AA$24,21,FALSE)","v":709.83999999999992},{"$f":"VLOOKUP($W22,EAI!$B$13:$AA$24,22,FALSE)","v":204},{"$f":"VLOOKUP($W22,EAI!$B$13:$AA$24,23,FALSE)","v":25.5},{"$f":"VLOOKUP($W22,EAI!$B$13:$AA$24,24,FALSE)","v":735.33999999999992},{"$f":"VLOOKUP($W22,EAI!$B:$AA,25,FALSE)","v":3459.3517950292689},{"$f":"SMALL(EAI!$AA$13:$AA$24,2)","v":4194.6917950292691}]
[null,3,null,"Complexo Petroquímico do Rio de Janeiro (Comperj)","Rodovia Estadual RJ-116 - Km 5,2 - Acesso A-1, s/n, Complemento Sambaetiba - Zona Urbana do 4º Distrito de Itaboraí - RJ CEP:24841-203",{"$f":"VLOOKUP($W23,EAI!$B$13:$AA$24,7,FALSE)","v":"DUQUE DE CAXIAS - RJ"},{"$f":"VLOOKUP($W23,EAI!$B$13:$AA$24,8,FALSE)","v":"Montes Claros - MG"},{"$f":"VLOOKUP($W23,EAI!$B$13:$AA$24,9,FALSE)","v":"-"},{"$f":"VLOOKUP($W23,EAI!$B$13:$AA$24,10,FALSE)","v":2.7609338335366278},{"$f":"VLOOKUP($W23,EAI!$B$13:$AA$24,11,FALSE)","v":2760.9338335366278},{"$f":"VLOOKUP($W23,EAI!$B$13:$AA$24,12,FALSE)","v":762.91},{"$f":"VLOOKUP($W23,EAI!$B$13:$AA$24,13,FALSE)","v":3523.8438335366277},{"$f":"VLOOKUP($W23,EAI!$B$13:$AA$24,14,FALSE)","v":827},{"$f":"VLOOKUP($W23,'[1]Transporte CM-30'!$B$13:$AA$25,15,FALSE)","v":{"$error":"#N/A"}},{"$f":"VLOOKUP($W23,EAI!$B$13:$AA$24,18,FALSE)","v":236.17},{"$f":"VLOOKUP($W23,EAI!$B$13:$AA$24,19,FALSE)","v":51.84},{"$f":"VLOOKUP($W23,EAI!$B$13:$AA$24,20,FALSE)","v":338.61},{"$f":"VLOOKUP($W23,EAI!$B$13:$AA$24,21,FALSE)","v":626.62},{"$f":"VLOOKUP($W23,EAI!$B$13:$AA$24,22,FALSE)","v":700.2},{"$f":"VLOOKUP($W23,EAI!$B$13:$AA$24,23,FALSE)","v":87.525000000000006},{"$f":"VLOOKUP($W23,EAI!$B$13:$AA$24,24,FALSE)","v":714.14499999999998},{"$f":"VLOOKUP($W23,EAI!$B:$AA,25,FALSE)","v":3523.8438335366277},{"$f":"SMALL(EAI!$AA$13:$AA$24,3)","v":4237.9888335366277}]
[null,4,null,null,null,{"$f":"VLOOKUP($W24,EAI!$B$13:$AA$24,7,FALSE)","v":"MAUÁ - SP"},{"$f":"VLOOKUP($W24,EAI!$B$13:$AA$24,8,FALSE)","v":"Montes Claros - MG"},{"$f":"VLOOKUP($W24,EAI!$B$13:$AA$24,9,FALSE)","v":2.7293387745904658},{"$f":"VLOOKUP($W24,EAI!$B$13:$AA$24,10,FALSE)","v":2.7609338335366278},{"$f":"VLOOKUP($W24,EAI!$B$13:$AA$24,11,FALSE)","v":2729.3387745904656},{"$f":"VLOOKUP($W24,EAI!$B$13:$AA$24,12,FALSE)","v":754.18},{"$f":"VLOOKUP($W24,EAI!$B$13:$AA$24,13,FALSE)","v":3483.5187745904655},{"$f":"VLOOKUP($W24,EAI!$B$13:$AA$24,14,FALSE)","v":1002},{"$f":"VLOOKUP($W24,'[1]Transporte CM-30'!$B$13:$AA$25,15,FALSE)","v":{"$error":"#N/A"}},{"$f":"VLOOKUP($W24,EAI!$B$13:$AA$24,18,FALSE)","v":280.45},{"$f":"VLOOKUP($W24,EAI!$B$13:$AA$24,19,FALSE)","v":61.56},{"$f":"VLOOKUP($W24,EAI!$B$13:$AA$24,20,FALSE)","v":402.1},{"$f":"VLOOKUP($W24,EAI!$B$13:$AA$24,21,FALSE)","v":744.11},{"$f":"VLOOKUP($W24,EAI!$B$13:$AA$24,22,FALSE)","v":465},{"$f":"VLOOKUP($W24,EAI!$B$13:$AA$24,23,FALSE)","v":58.125},{"$f":"VLOOKUP($W24,EAI!$B$13:$AA$24,24,FALSE)","v":802.23500000000001},{"$f":"VLOOKUP($W24,EAI!$B:$AA,25,FALSE)","v":3483.5187745904655},{"$f":"SMALL(EAI!$AA$13:$AA$24,4)","v":4285.7537745904656}]
[null,5,null,null,null,{"$f":"VLOOKUP($W25,EAI!$B$13:$AA$24,7,FALSE)","v":"PAULÍNIA - SP"},{"$f":"VLOOKUP($W25,EAI!$B$13:$AA$24,8,FALSE)","v":"Montes Claros - MG"},{"$f":"VLOOKUP($W25,EAI!$B$13:$AA$24,9,FALSE)","v":2.7293387745904658},{"$f":"VLOOKUP($W25,EAI!$B$13:$AA$24,10,FALSE)","v":2.7609338335366278},{"$f":"VLOOKUP($W25,EAI!$B$13:$AA$24,11,FALSE)","v":2729.3387745904656},{"$f":"VLOOKUP($W25,EAI!$B$13:$AA$24,12,FALSE)","v":754.18},{"$f":"VLOOKUP($W25,EAI!$B$13:$AA$24,13,FALSE)","v":3483.5187745904655},{"$f":"VLOOKUP($W25,EAI!$B$13:$AA$24,14,FALSE)","v":1021},{"$f":"VLOOKUP($W25,'[1]Transporte CM-30'!$B$13:$AA$25,15,FALSE)","v":{"$error":"#N/A"}},{"$f":"VLOOKUP($W25,EAI!$B$13:$AA$24,18,FALSE)","v":285.25},{"$f":"VLOOKUP($W25,EAI!$B$13:$AA$24,19,FALSE)","v":62.61},{"$f":"VLOOKUP($W25,EAI!$B$13:$AA$24,20,FALSE)","v":408.98},{"$f":"VLOOKUP($W25,EAI!$B$13:$AA$24,21,FALSE)","v":756.84},{"$f":"VLOOKUP($W25,EAI!$B$13:$AA$24,22,FALSE)","v":477.8},{"$f":"VLOOKUP($W25,EAI!$B$13:$AA$24,23,FALSE)","v":59.725000000000001},{"$f":"VLOOKUP($W25,EAI!$B$13:$AA$24,24,FALSE)","v":816.56500000000005},{"$f":"VLOOKUP($W25,EAI!$B:$AA,25,FALSE)","v":3483.5187745904655},{"$f":"SMALL(EAI!$AA$13:$AA$24,5)","v":4300.0837745904655}]
[null,6,null,null,null,{"$f":"VLOOKUP($W26,EAI!$B$13:$AA$24,7,FALSE)","v":"CUBATÃO - SP"},{"$f":"VLOOKUP($W26,EAI!$B$13:$AA$24,8,FALSE)","v":"Montes Claros - MG"},{"$f":"VLOOKUP($W26,EAI!$B$13:$AA$24,9,FALSE)","v":2.7293387745904658},{"$f":"VLOOKUP($W26,EAI!$B$13:$AA$24,10,FALSE)","v":2.7609338335366278},{"$f":"VLOOKUP($W26,EAI!$B$13:$AA$24,11,FALSE)","v":2729.3387745904656},{"$f":"VLOOKUP($W26,EAI!$B$13:$AA$24,12,FALSE)","v":754.18},{"$f":"VLOOKUP($W26,EAI!$B$13:$AA$24,13,FALSE)","v":3483.5187745904655},{"$f":"VLOOKUP($W26,EAI!$B$13:$AA$24,14,FALSE)","v":1041},{"$f":"VLOOKUP($W26,'[1]Transporte CM-30'!$B$13:$AA$25,15,FALSE)","v":{"$error":"#N/A"}},{"$f":"VLOOKUP($W26,EAI!$B$13:$AA$24,18,FALSE)","v":290.31},{"$f":"VLOOKUP($W26,EAI!$B$13:$AA$24,19,FALSE)","v":63.72},{"$f":"VLOOKUP($W26,EAI!$B$13:$AA$24,20,FALSE)","v":416.23},{"$f":"VLOOKUP($W26,EAI!$B$13:$AA$24,21,FALSE)","v":770.26},{"$f":"VLOOKUP($W26,EAI!$B$13:$AA$24,22,FALSE)","v":465},{"$f":"VLOOKUP($W26,EAI!$B$13:$AA$24,23,FALSE)","v":58.125},{"$f":"VLOOKUP($W26,EAI!$B$13:$AA$24,24,FALSE)","v":828.38499999999999},{"$f":"VLOOKUP($W26,EAI!$B:$AA,25,FALSE)","v":3483.5187745904655},{"$f":"SMALL(EAI!$AA$13:$AA$24,6)","v":4311.9037745904652}]
[]
[null,1,"RR1-C","Refinaria Abreu e Lima","Rodovia PE 60, Km 10 - Ipojuca - PE CEP:55590-000",{"$f":"VLOOKUP($W28,'RR-1C'!$B:$AA,7,FALSE)","v":"SARZEDO - MG"},{"$f":"VLOOKUP($W28,'RR-1C'!$B:$AA,8,FALSE)","v":"Montes Claros - MG"},{"$f":"VLOOKUP($W28,'RR-1C'!$B:$AA,9,FALSE)","v":2.7272026129148301},{"$f":"VLOOKUP($W28,'RR-1C'!$B:$AA,10,FALSE)","v":2.7300013717296618},{"$f":"VLOOKUP($W28,'RR-1C'!$B:$AA,11,FALSE)","v":2727.2026129148303},{"$f":"VLOOKUP($W28,'RR-1C'!$B:$AA,12,FALSE)","v":753.59},{"$f":"VLOOKUP($W28,'RR-1C'!$B:$AA,13,FALSE)","v":3480.7926129148304},{"$f":"VLOOKUP($W28,'RR-1C'!$B:$AA,14,FALSE)","v":439},{"$f":"VLOOKUP($W28,'[1]Transporte RR-1C'!$B:$AA,15,FALSE)","v":{"$error":"#N/A"}},{"$f":"VLOOKUP($W28,'RR-1C'!$B:$AA,18,FALSE)","v":138.01},{"$f":"VLOOKUP($W28,'RR-1C'!$B:$AA,19,FALSE)","v":30.29},{"$f":"VLOOKUP($W28,'RR-1C'!$B:$AA,20,FALSE)","v":197.87},{"$f":"VLOOKUP($W28,'RR-1C'!$B:$AA,21,FALSE)","v":366.16999999999996},{"$f":"VLOOKUP($W28,'RR-1C'!$B:$AA,22,FALSE)","v":325.8},{"$f":"VLOOKUP($W28,'RR-1C'!$B:$AA,23,FALSE)","v":130.45045045045049},{"$f":"VLOOKUP($W28,'RR-1C'!$B:$AA,24,FALSE)","v":496.62045045045045},{"$f":"VLOOKUP($W28,'RR-1C'!$B:$AA,25,FALSE)","v":3480.7926129148304},{"$f":"SMALL('RR-1C'!$AA$13:$AA$27,1)","v":3977.4130633652808}]
[null,2,null,"Refinaria Potiguar Clara Camarão","Rodovia RN 221, KM 25 - Guamaré - RN CEP:59598-000",{"$f":"VLOOKUP($W29,'RR-1C'!$B:$AA,7,FALSE)","v":"UBERLANDIA - MG"},{"$f":"VLOOKUP($W29,'RR-1C'!$B:$AA,8,FALSE)","v":"Montes Claros - MG"},{"$f":"VLOOKUP($W29,'RR-1C'!$B:$AA,9,FALSE)","v":2.7272026129148301},{"$f":"VLOOKUP($W29,'RR-1C'!$B:$AA,10,FALSE)","v":2.7300013717296618},{"$f":"VLOOKUP($W29,'RR-1C'!$B:$AA,11,FALSE)","v":2727.2026129148303},{"$f":"VLOOKUP($W29,'RR-1C'!$B:$AA,12,FALSE)","v":753.59},{"$f":"VLOOKUP($W29,'RR-1C'!$B:$AA,13,FALSE)","v":3480.7926129148304},{"$f":"VLOOKUP($W29,'RR-1C'!$B:$AA,14,FALSE)","v":633},{"$f":"VLOOKUP($W29,'[1]Transporte RR-1C'!$B:$AA,15,FALSE)","v":{"$error":"#N/A"}},{"$f":"VLOOKUP($W29,'RR-1C'!$B:$AA,18,FALSE)","v":187.09},{"$f":"VLOOKUP($W29,'RR-1C'!$B:$AA,19,FALSE)","v":41.06},{"$f":"VLOOKUP($W29,'RR-1C'!$B:$AA,20,FALSE)","v":268.23},{"$f":"VLOOKUP($W29,'RR-1C'!$B:$AA,21,FALSE)","v":496.38},{"$f":"VLOOKUP($W29,'RR-1C'!$B:$AA,22,FALSE)","v":152.4},{"$f":"VLOOKUP($W29,'RR-1C'!$B:$AA,23,FALSE)","v":61.021021021021035},{"$f":"VLOOKUP($W29,'RR-1C'!$B:$AA,24,FALSE)","v":557.40102102102105},{"$f":"VLOOKUP($W29,'RR-1C'!$B:$AA,25,FALSE)","v":3480.7926129148304},{"$f":"SMALL('RR-1C'!$AA$13:$AA$27,2)","v":4038.1936339358517}]
[null,3,null,"Complexo Petroquímico do Rio de Janeiro (Comperj)","Rodovia Estadual RJ-116 - Km 5,2 - Acesso A-1, s/n, Complemento Sambaetiba - Zona Urbana do 4º Distrito de Itaboraí - RJ CEP:24841-203",{"$f":"VLOOKUP($W30,'RR-1C'!$B:$AA,7,FALSE)","v":"DUQUE DE CAXIAS - RJ"},{"$f":"VLOOKUP($W30,'RR-1C'!$B:$AA,8,FALSE)","v":"Montes Claros - MG"},{"$f":"VLOOKUP($W30,'RR-1C'!$B:$AA,9,FALSE)","v":"-"},{"$f":"VLOOKUP($W30,'RR-1C'!$B:$AA,10,FALSE)","v":2.7300013717296618},{"$f":"VLOOKUP($W30,'RR-1C'!$B:$AA,11,FALSE)","v":2730.001371729662},{"$f":"VLOOKUP($W30,'RR-1C'!$B:$AA,12,FALSE)","v":754.37},{"$f":"VLOOKUP($W30,'RR-1C'!$B:$AA,13,FALSE)","v":3484.3713717296619},{"$f":"VLOOKUP($W30,'RR-1C'!$B:$AA,14,FALSE)","v":829},{"$f":"VLOOKUP($W30,'[1]Transporte RR-1C'!$B:$AA,15,FALSE)","v":{"$error":"#N/A"}},{"$f":"VLOOKUP($W30,'RR-1C'!$B:$AA,18,FALSE)","v":236.68},{"$f":"VLOOKUP($W30,'RR-1C'!$B:$AA,19,FALSE)","v":51.95},{"$f":"VLOOKUP($W30,'RR-1C'!$B:$AA,20,FALSE)","v":339.34},{"$f":"VLOOKUP($W30,'RR-1C'!$B:$AA,21,FALSE)","v":627.97},{"$f":"VLOOKUP($W30,'RR-1C'!$B:$AA,22,FALSE)","v":700.2},{"$f":"VLOOKUP($W30,'RR-1C'!$B:$AA,23,FALSE)","v":280.3603603603604},{"$f":"VLOOKUP($W30,'RR-1C'!$B:$AA,24,FALSE)","v":908.33036036036037},{"$f":"VLOOKUP($W30,'RR-1C'!$B:$AA,25,FALSE)","v":3484.3713717296619},{"$f":"SMALL('RR-1C'!$AA$13:$AA$27,3)","v":4392.7017320900222}]
[null,4,null,"Refinaria Abreu e Lima","Rodovia PE 60, Km 10 - Ipojuca - PE CEP:55590-000",{"$f":"VLOOKUP($W31,'RR-1C'!$B:$AA,7,FALSE)","v":"CAIEIRAS - SP"},{"$f":"VLOOKUP($W31,'RR-1C'!$B:$AA,8,FALSE)","v":"Montes Claros - MG"},{"$f":"VLOOKUP($W31,'RR-1C'!$B:$AA,9,FALSE)","v":2.7555854755081421},{"$f":"VLOOKUP($W31,'RR-1C'!$B:$AA,10,FALSE)","v":2.7300013717296618},{"$f":"VLOOKUP($W31,'RR-1C'!$B:$AA,11,FALSE)","v":2755.5854755081423},{"$f":"VLOOKUP($W31,'RR-1C'!$B:$AA,12,FALSE)","v":761.43},{"$f":"VLOOKUP($W31,'RR-1C'!$B:$AA,13,FALSE)","v":3517.0154755081421},{"$f":"VLOOKUP($W31,'RR-1C'!$B:$AA,14,FALSE)","v":979},{"$f":"VLOOKUP($W31,'[1]Transporte RR-1C'!$B:$AA,15,FALSE)","v":{"$error":"#N/A"}},{"$f":"VLOOKUP($W31,'RR-1C'!$B:$AA,18,FALSE)","v":274.63},{"$f":"VLOOKUP($W31,'RR-1C'!$B:$AA,19,FALSE)","v":60.28},{"$f":"VLOOKUP($W31,'RR-1C'!$B:$AA,20,FALSE)","v":393.75},{"$f":"VLOOKUP($W31,'RR-1C'!$B:$AA,21,FALSE)","v":728.66},{"$f":"VLOOKUP($W31,'RR-1C'!$B:$AA,22,FALSE)","v":447.6},{"$f":"VLOOKUP($W31,'RR-1C'!$B:$AA,23,FALSE)","v":179.21921921921927},{"$f":"VLOOKUP($W31,'RR-1C'!$B:$AA,24,FALSE)","v":907.87921921921929},{"$f":"VLOOKUP($W31,'RR-1C'!$B:$AA,25,FALSE)","v":3517.0154755081421},{"$f":"SMALL('RR-1C'!$AA$13:$AA$27,4)","v":4424.8946947273616}]
[null,5,null,"Refinaria Potiguar Clara Camarão","Rodovia RN 221, KM 25 - Guamaré - RN CEP:59598-000",{"$f":"VLOOKUP($W32,'RR-1C'!$B:$AA,7,FALSE)","v":"CACAPAVA - SP"},{"$f":"VLOOKUP($W32,'RR-1C'!$B:$AA,8,FALSE)","v":"Montes Claros - MG"},{"$f":"VLOOKUP($W32,'RR-1C'!$B:$AA,9,FALSE)","v":2.7555854755081421},{"$f":"VLOOKUP($W32,'RR-1C'!$B:$AA,10,FALSE)","v":2.7300013717296618},{"$f":"VLOOKUP($W32,'RR-1C'!$B:$AA,11,FALSE)","v":2755.5854755081423},{"$f":"VLOOKUP($W32,'RR-1C'!$B:$AA,12,FALSE)","v":761.43},{"$f":"VLOOKUP($W32,'RR-1C'!$B:$AA,13,FALSE)","v":3517.0154755081421},{"$f":"VLOOKUP($W32,'RR-1C'!$B:$AA,14,FALSE)","v":934},{"$f":"VLOOKUP($W32,'[1]Transporte RR-1C'!$B:$AA,15,FALSE)","v":{"$error":"#N/A"}},{"$f":"VLOOKUP($W32,'RR-1C'!$B:$AA,18,FALSE)","v":263.24},{"$f":"VLOOKUP($W32,'RR-1C'!$B:$AA,19,FALSE)","v":57.78},{"$f":"VLOOKUP($W32,'RR-1C'!$B:$AA,20,FALSE)","v":377.42},{"$f":"VLOOKUP($W32,'RR-1C'!$B:$AA,21,FALSE)","v":698.44},{"$f":"VLOOKUP($W32,'RR-1C'!$B:$AA,22,FALSE)","v":523.20000000000005},{"$f":"VLOOKUP($W32,'RR-1C'!$B:$AA,23,FALSE)","v":209.48948948948953},{"$f":"VLOOKUP($W32,'RR-1C'!$B:$AA,24,FALSE)","v":907.92948948948958},{"$f":"VLOOKUP($W32,'RR-1C'!$B:$AA,25,FALSE)","v":3517.0154755081421},{"$f":"SMALL('RR-1C'!$AA$13:$AA$27,5)","v":4424.9449649976314}]
[null,6,null,"Complexo Petroquímico do Rio de Janeiro (Comperj)","Rodovia Estadual RJ-116 - Km 5,2 - Acesso A-1, s/n, Complemento Sambaetiba - Zona Urbana do 4º Distrito de Itaboraí - RJ CEP:24841-203",{"$f":"VLOOKUP($W33,'RR-1C'!$B:$AA,7,FALSE)","v":"ANÁPOLIS - GO"},{"$f":"VLOOKUP($W33,'RR-1C'!$B:$AA,8,FALSE)","v":"Montes Claros - MG"},{"$f":"VLOOKUP($W33,'RR-1C'!$B:$AA,9,FALSE)","v":2.9430018957152044},{"$f":"VLOOKUP($W33,'RR-1C'!$B:$AA,10,FALSE)","v":3.0695857732808691},{"$f":"VLOOKUP($W33,'RR-1C'!$B:$AA,11,FALSE)","v":2943.0018957152042},{"$f":"VLOOKUP($W33,'RR-1C'!$B:$AA,12,FALSE)","v":813.22},{"$f":"VLOOKUP($W33,'RR-1C'!$B:$AA,13,FALSE)","v":3756.2218957152045},{"$f":"VLOOKUP($W33,'RR-1C'!$B:$AA,14,FALSE)","v":796},{"$f":"VLOOKUP($W33,'[1]Transporte RR-1C'!$B:$AA,15,FALSE)","v":{"$error":"#N/A"}},{"$f":"VLOOKUP($W33,'RR-1C'!$B:$AA,18,FALSE)","v":228.33},{"$f":"VLOOKUP($W33,'RR-1C'!$B:$AA,19,FALSE)","v":50.12},{"$f":"VLOOKUP($W33,'RR-1C'!$B:$AA,20,FALSE)","v":327.37},{"$f":"VLOOKUP($W33,'RR-1C'!$B:$AA,21,FALSE)","v":605.81999999999994},{"$f":"VLOOKUP($W33,'RR-1C'!$B:$AA,22,FALSE)","v":195.6},{"$f":"VLOOKUP($W33,'RR-1C'!$B:$AA,23,FALSE)","v":78.318318318318333},{"$f":"VLOOKUP($W33,'RR-1C'!$B:$AA,24,FALSE)","v":684.13831831831828},{"$f":"VLOOKUP($W33,'RR-1C'!$B:$AA,25,FALSE)","v":3756.2218957152045},{"$f":"SMALL('RR-1C'!$AA$13:$AA$27,6)","v":4440.3602140335224}]