{"text_format":"2","workbook":"xlsx","n_sheets":10,"sheets":["ORÇAMENTO","CPU-SERV","CPU-FORNEC","BDI SERV","BDI FORN","CRONOGRAMA","EAI","RR-1C","CAP","MAT.ASF"],"not_rendered":{"charts":0,"images":1,"macros":0,"external_links":1,"defined_names":11,"comments":5,"pivot_tables":0},"unopened":[],"bounds":{"document_bytes":16777216,"sheet_cells":100000,"run_cost":"one","rows_first":2000,"rows_last":500,"rows_between":2000,"halvings":0,"cell_chars":16384,"cell_head_chars":4096},"cells_cut":0,"cells_raw":0,"read":"whole","date_system":"1900"}

{"sheet":"ORÇAMENTO","index":0,"n_rows":59,"n_cols":12,"rows_kept":59,"cut":false,"hidden":false,"merged":[[9,16,9,17],[9,18,9,20],[6,8,6,10],[58,1,58,4],[0,0,8,0],[0,4,0,11],[1,4,1,11],[2,4,2,11],[6,1,6,4],[7,1,7,11],[4,2,4,8],[5,2,5,7],[4,9,4,10],[5,8,5,10]]}
["<---- NUMERAR SERVIÇOS PARA CPU",null,null,null,"Ministério do Desenvolvimento Regional"]
[{"$nulls":4},"Companhia de Desenvolvimento dos Vales do São Francisco e do Parnaíba"]
[{"$nulls":4},"1ª Superintendência Regional"]
[]
[null,"OBRA: "," PAVIMENTAÇÃO ASFÁLTICA EM CBUQ - ESTRADA PARA SANTANA DO MUNDO NOVO (JURAMENTO / MG)",{"$nulls":6},"BDI Serviços (%):",null,{"$f":"'BDI SERV'!E26","v":22.26}]
[null,"DATA:"," ABRIL / 2025 ",{"$nulls":5},"BDI Diferenciado Serviços (%):",null,null,{"$f":"'BDI FORN'!D31","v":15}]
{"$rows_left_out":54}
{"sheet":"CPU-SERV","index":1,"n_rows":1598,"n_cols":11,"rows_kept":1598,"cut":false,"hidden":false,"merged":[[22,7,22,9],[25,3,25,7],[27,8,27,9],[21,3,21,7],[4,2,4,7],[4,8,4,9],[5,1,6,2],[5,3,6,3],[5,4,5,5],[5,6,5,7],[484,0,536,0],[485,2,485,9],[486,1,487,3],[486,4,486,5],[487,4,487,5],[488,2,488,7],[488,8,488,9],[489,1,490,2],[489,3,490,3],[489,4,489,5],[489,6,489,7],[497,7,497,9],[499,3,499,7],[500,3,500,7],[501,3,501,7],[504,7,504,9],[513,3,513,7],[39,0,81,0],[40,2,40,9],[44,3,45,3],[44,4,44,5],[44,6,44,7],[49,7,49,9],[55,3,55,7],[56,3,56,7],[41,1,42,3],[41,4,41,5],[42,4,42,5],[43,2,43,7],[43,8,43,9],[44,1,45,2],[0,0,37,0],[3,4,3,5],[2,4,2,5],[1,2,1,9],[2,1,3,3],[31,3,32,3],[31,4,32,4],[31,5,31,7],[31,9,32,9],[35,3,35,7],[36,5,36,7],[10,7,10,9],[13,3,13,7],[14,3,14,7],[15,3,15,7],[18,7,18,9],[30,3,30,7],[31,1,32,2],[97,3,97,7],[88,3,89,3],[88,4,88,5],[88,6,88,7],[79,3,79,7],[80,5,80,7],[85,4,85,5],[74,3,74,7],[75,1,76,2],[75,3,76,3],[75,4,76,4],[75,5,75,7],[75,9,76,9],[57,3,57,7],[60,7,60,9],[63,3,63,7],[64,7,64,9],[69,3,69,7],[71,8,71,9],[119,5,119,7],[122,0,161,0],[123,2,123,9],[124,1,125,3],[124,4,124,5],[125,4,125,5],[126,2,126,7],[126,8,126,9],[159,3,159,7],[160,5,160,7],[114,1,115,2],[114,3,115,3],[114,4,115,4],[114,5,114,7],[114,9,115,9],[118,3,118,7],[93,7,93,9],[98,3,98,7],[101,7,101,9],[104,3,104,7],[105,7,105,9],[108,3,108,7],[83,0,120,0],[84,2,84,9],[85,1,86,3],[86,4,86,5],[87,2,87,7],[87,8,87,9],[88,1,89,2],[110,8,110,9],[113,3,113,7],[96,3,96,7],[167,8,167,9],[168,1,169,2],[168,3,169,3],[168,4,168,5],[168,6,168,7],[136,3,136,7],[137,3,137,7],[140,7,140,9],[145,3,145,7],[146,7,146,9],[149,3,149,7],[127,1,128,2],[127,3,128,3],[127,4,127,5],[127,6,127,7],[132,7,132,9],[135,3,135,7],[202,0,241,0],[203,2,203,9],[204,1,205,3],[204,4,204,5],[205,4,205,5],[206,2,206,7],[239,3,239,7],[240,5,240,7],[163,0,200,0],[164,2,164,9],[165,1,166,3],[165,4,165,5],[166,4,166,5],[167,2,167,7],[151,8,151,9],[154,3,154,7],[155,1,156,2],[155,3,156,3],[155,4,156,4],[155,5,155,7],[155,9,156,9],[188,3,188,7],[190,8,190,9],[193,3,193,7],[194,1,195,2],[194,3,195,3],[194,4,195,4],[194,5,194,7],[194,9,195,9],[176,3,176,7],[177,3,177,7],[178,3,178,7],[247,8,247,9],[248,1,249,2],[248,3,249,3],[248,4,248,5],[173,7,173,9],[217,3,217,7],[218,3,218,7],[219,3,219,7],[222,7,222,9],[225,3,225,7],[226,7,226,9],[206,8,206,9],[207,1,208,2],[207,3,208,3],[207,4,207,5],[207,6,207,7],[212,7,212,9],[198,3,198,7],[199,5,199,7],[181,7,181,9],[184,3,184,7],[185,7,185,9],[243,0,280,0],[244,2,244,9],[245,1,246,3],[245,4,245,5],[246,4,246,5],[247,2,247,7],[229,3,229,7],[231,8,231,9],[234,3,234,7],[235,1,236,2],[235,3,236,3],[235,4,236,4],[235,5,235,7],[235,9,236,9],[268,3,268,7],[270,8,270,9],[273,3,273,7],[274,1,275,2],[274,3,275,3],[274,4,275,4],[274,5,274,7],[274,9,275,9],[256,3,256,7],[257,3,257,7],[248,6,248,7],[253,7,253,9],[278,3,278,7],[279,5,279,7],[258,3,258,7],[261,7,261,9],[264,3,264,7],[265,7,265,9],[282,0,323,0],[283,2,283,9],[284,1,285,3],[284,4,284,5],[285,4,285,5],[286,2,286,7],[321,3,321,7],[322,5,322,7],[329,8,329,9],[330,1,331,2],[330,3,331,3],[330,4,330,5],[299,3,299,7],[300,3,300,7],[301,3,301,7],[304,7,304,9],[307,3,307,7],[308,7,308,9],[286,8,286,9],[287,1,288,2],[287,3,288,3],[287,4,287,5],[287,6,287,7],[296,7,296,9],[366,0,403,0],[367,2,367,9],[368,1,369,3],[368,4,368,5],[369,4,369,5],[370,2,370,7],[401,3,401,7],[402,5,402,7],[385,7,385,8],[325,0,364,0],[326,2,326,9],[327,1,328,3],[327,4,327,5],[328,4,328,5],[329,2,329,7],[311,3,311,7],[313,8,313,9],[316,3,316,7],[317,1,318,2],[317,3,318,3],[317,4,318,4],[317,5,317,7],[317,9,318,9],[352,3,352,7],[354,8,354,9],[357,3,357,7],[358,1,359,2],[358,3,359,3],[358,4,359,4],[358,5,358,7],[358,9,359,9],[340,3,340,7],[418,3,418,7],[409,8,409,9],[410,1,411,2],[410,3,411,3],[410,4,410,5],[330,6,330,7],[337,7,337,9],[379,3,379,7],[380,3,380,7],[381,3,381,7],[384,7,384,9],[387,3,387,7],[388,7,388,9],[370,8,370,9],[371,1,372,2],[371,3,372,3],[371,4,371,5],[371,6,371,7],[376,7,376,9],[362,3,362,7],[363,5,363,7],[341,3,341,7],[342,3,342,7],[345,7,345,9],[348,3,348,7],[349,7,349,9],[470,3,470,7],[444,0,482,0],[445,2,445,9],[446,1,447,3],[446,4,446,5],[447,4,447,5],[448,2,448,7],[480,3,480,7],[481,5,481,7],[424,7,424,8],[405,0,442,0],[406,2,406,9],[407,1,408,3],[407,4,407,5],[408,4,408,5],[409,2,409,7],[391,3,391,7],[393,8,393,9],[396,3,396,7],[397,1,398,2],[397,3,398,3],[397,4,398,4],[397,5,397,7],[397,9,398,9],[430,3,430,7],[432,8,432,9],[435,3,435,7],[436,1,437,2],[436,3,437,3],[436,4,437,4],[436,5,436,7],[436,9,437,9],[509,7,509,8],[535,5,535,7],[563,3,563,7],[565,8,565,9],[568,3,568,7],[569,1,570,2],[569,3,570,3],[569,4,570,4],[569,5,569,7],[569,9,570,9],[410,6,410,7],[415,7,415,9],[458,3,458,7],[459,3,459,7],[460,3,460,7],[463,7,463,9],[466,3,466,7],[467,7,467,9],[448,8,448,9],[449,1,450,2],[449,3,450,3],[449,4,449,5],[449,6,449,7],[455,7,455,9],[440,3,440,7],[441,5,441,7],[419,3,419,7],[420,3,420,7],[423,7,423,9],[426,3,426,7],[427,7,427,9],[514,7,514,9],[556,7,556,9],[559,3,559,7],[560,7,560,9],[542,8,542,9],[543,1,544,2],[543,3,544,3],[543,4,543,5],[543,6,543,7],[548,7,548,9],[590,3,590,7],[591,3,591,7],[592,3,592,7],[595,7,595,9],[598,3,598,7],[542,2,542,7],[472,8,472,9],[475,3,475,7],[476,1,477,2],[476,3,477,3],[476,4,477,4],[476,5,476,7],[476,9,477,9],[526,1,527,2],[526,3,527,3],[526,4,527,4],[526,5,526,7],[526,9,527,9],[534,3,534,7],[516,3,516,7],[518,8,518,9],[525,3,525,7],[551,3,551,7],[599,7,599,9],[581,8,581,9],[582,1,583,2],[582,3,583,3],[582,4,582,5],[582,6,582,7],[587,7,587,9],[573,3,573,7],[574,5,574,7],[577,0,614,0],[578,2,578,9],[579,1,580,3],[579,4,579,5],[580,4,580,5],[581,2,581,7],[612,3,612,7],[613,5,613,7],[538,0,575,0],[539,2,539,9],[540,1,541,3],[540,4,540,5],[541,4,541,5],[602,3,602,7],[604,8,604,9],[607,3,607,7],[608,1,609,2],[608,3,609,3],[608,4,609,4],[608,5,608,7],[608,9,609,9],[552,3,552,7],[553,3,553,7],[641,3,641,7],[643,8,643,9],[646,3,646,7],[647,1,648,2],[647,3,648,3],[647,4,648,4],[647,5,647,7],[647,9,648,9],[629,3,629,7],[630,3,630,7],[631,3,631,7],[634,7,634,9],[637,3,637,7],[638,7,638,9],[620,8,620,9],[621,1,622,2],[621,3,622,3],[621,4,621,5],[621,6,621,7],[626,7,626,9],[668,3,668,7],[669,3,669,7],[670,3,670,7],[673,7,673,9],[676,3,676,7],[677,7,677,9],[659,8,659,9],[660,1,661,2],[660,3,661,3],[660,4,660,5],[660,6,660,7],[665,7,665,9],[651,3,651,7],[652,5,652,7],[655,0,692,0],[656,2,656,9],[657,1,658,3],[657,4,657,5],[658,4,658,5],[659,2,659,7],[690,3,690,7],[691,5,691,7],[616,0,653,0],[617,2,617,9],[618,1,619,3],[618,4,618,5],[619,4,619,5],[620,2,620,7],[680,3,680,7],[682,8,682,9],[685,3,685,7],[686,1,687,2],[686,3,687,3],[686,4,687,4],[686,5,686,7],[686,9,687,9],[719,3,719,7],[721,8,721,9],[724,3,724,7],[725,1,726,2],[725,3,726,3],[725,4,726,4],[725,5,725,7],[725,9,726,9],[707,3,707,7],[708,3,708,7],[709,3,709,7],[712,7,712,9],[715,3,715,7],[716,7,716,9],[698,8,698,9],[699,1,700,2],[699,3,700,3],[699,4,699,5],[699,6,699,7],[704,7,704,9],[746,3,746,7],[747,3,747,7],[748,3,748,7],[751,7,751,9],[756,3,756,7],[757,7,757,9],[737,8,737,9],[738,1,739,2],[738,3,739,3],[738,4,738,5],[738,6,738,7],[743,7,743,9],[729,3,729,7],[730,5,730,7],[733,0,772,0],[734,2,734,9],[735,1,736,3],[735,4,735,5],[736,4,736,5],[737,2,737,7],[770,3,770,7],[771,5,771,7],[694,0,731,0],[695,2,695,9],[696,1,697,3],[696,4,696,5],[697,4,697,5],[698,2,698,7],[760,3,760,7],[762,8,762,9],[765,3,765,7],[766,1,767,2],[766,3,767,3],[766,4,767,4],[766,5,766,7],[766,9,767,9],[801,3,801,7],[803,8,803,9],[806,3,806,7],[807,1,808,2],[807,3,808,3],[807,4,808,4],[807,5,807,7],[807,9,808,9],[788,3,788,7],[789,3,789,7],[790,3,790,7],[793,7,793,9],[797,3,797,7],[798,7,798,9],[778,8,778,9],[779,1,780,2],[779,3,780,3],[779,4,779,5],[779,6,779,7],[785,7,785,9],[828,3,828,7],[829,3,829,7],[830,3,830,7],[833,7,833,9],[836,3,836,7],[837,7,837,9],[819,8,819,9],[820,1,821,2],[820,3,821,3],[820,4,820,5],[820,6,820,7],[825,7,825,9],[811,3,811,7],[812,5,812,7],[815,0,854,0],[816,2,816,9],[817,1,818,3],[817,4,817,5],[818,4,818,5],[819,2,819,7],[852,3,852,7],[853,5,853,7],[774,0,813,0],[775,2,775,9],[776,1,777,3],[776,4,776,5],[777,4,777,5],[778,2,778,7],[842,3,842,7],[844,8,844,9],[847,3,847,7],[848,1,849,2],[848,3,849,3],[848,4,849,4],[848,5,848,7],[848,9,849,9],[883,3,883,7],[885,8,885,9],[888,3,888,7],[889,1,890,2],[889,3,890,3],[889,4,890,4],[889,5,889,7],[889,9,890,9],[869,3,869,7],[870,3,870,7],[871,3,871,7],[874,7,874,9],[876,3,876,7],[877,7,877,9],[860,8,860,9],[861,1,862,2],[861,3,862,3],[861,4,861,5],[861,6,861,7],[866,7,866,9],[910,3,910,7],[911,3,911,7],[912,3,912,7],[915,7,915,9],[918,3,918,7],[919,7,919,9],[901,8,901,9],[902,1,903,2],[902,3,903,3],[902,4,902,5],[902,6,902,7],[907,7,907,9],[893,3,893,7],[894,5,894,7],[897,0,936,0],[898,2,898,9],[899,1,900,3],[899,4,899,5],[900,4,900,5],[901,2,901,7],[934,3,934,7],[935,5,935,7],[856,0,895,0],[857,2,857,9],[858,1,859,3],[858,4,858,5],[859,4,859,5],[860,2,860,7],[924,3,924,7],[926,8,926,9],[929,3,929,7],[930,1,931,2],[930,3,931,3],[930,4,931,4],[930,5,930,7],[930,9,931,9],[967,3,967,7],[969,8,969,9],[972,3,972,7],[973,1,974,2],[973,3,974,3],[973,4,974,4],[973,5,973,7],[973,9,974,9],[951,3,951,7],[952,3,952,7],[953,3,953,7],[956,7,956,9],[959,3,959,7],[960,7,960,9],[942,8,942,9],[943,1,944,2],[943,3,944,3],[943,4,943,5],[943,6,943,7],[948,7,948,9],[994,3,994,7],[995,3,995,7],[996,3,996,7],[999,7,999,9],[1002,3,1002,7],[1003,7,1003,9],[985,8,985,9],[986,1,987,2],[986,3,987,3],[986,4,986,5],[986,6,986,7],[991,7,991,9],[977,3,977,7],[978,5,978,7],[981,0,1022,0],[982,2,982,9],[983,1,984,3],[983,4,983,5],[984,4,984,5],[985,2,985,7],[1020,3,1020,7],[1021,5,1021,7],[938,0,979,0],[939,2,939,9],[940,1,941,3],[940,4,940,5],[941,4,941,5],[942,2,942,7],[1010,3,1010,7],[1012,8,1012,9],[1015,3,1015,7],[1016,1,1017,2],[1016,3,1017,3],[1016,4,1017,4],[1016,5,1016,7],[1016,9,1017,9],[1050,3,1050,7],[1052,8,1052,9],[1055,3,1055,7],[1056,1,1057,2],[1056,3,1057,3],[1056,4,1057,4],[1056,5,1056,7],[1056,9,1057,9],[1037,3,1037,7],[1038,3,1038,7],[1039,3,1039,7],[1042,7,1042,9],[1045,3,1045,7],[1046,7,1046,9],[1028,8,1028,9],[1029,1,1030,2],[1029,3,1030,3],[1029,4,1029,5],[1029,6,1029,7],[1034,7,1034,9],[1117,3,1117,7],[1118,3,1118,7],[1119,3,1119,7],[1122,7,1122,9],[1125,3,1125,7],[1126,7,1126,9],[1108,8,1108,9],[1109,1,1110,2],[1109,3,1110,3],[1109,4,1109,5],[1109,6,1109,7],[1114,7,1114,9],[1060,3,1060,7],[1061,5,1061,7],[1104,0,1145,0],[1105,2,1105,9],[1106,1,1107,3],[1106,4,1106,5],[1107,4,1107,5],[1108,2,1108,7],[1143,3,1143,7],[1144,5,1144,7],[1024,0,1062,0],[1025,2,1025,9],[1026,1,1027,3],[1026,4,1026,5],[1027,4,1027,5],[1028,2,1028,7],[1133,3,1133,7],[1135,8,1135,9],[1138,3,1138,7],[1139,1,1140,2],[1139,3,1140,3],[1139,4,1140,4],[1139,5,1139,7],[1139,9,1140,9],[1160,3,1160,7],[1161,3,1161,7],[1162,3,1162,7],[1165,7,1165,9],[1168,3,1168,7],[1169,7,1169,9],[1151,8,1151,9],[1152,1,1153,2],[1152,3,1153,3],[1152,4,1152,5],[1152,6,1152,7],[1157,7,1157,9],[1147,0,1184,0],[1148,2,1148,9],[1149,1,1150,3],[1149,4,1149,5],[1150,4,1150,5],[1151,2,1151,7],[1182,3,1182,7],[1183,5,1183,7],[1172,3,1172,7],[1174,8,1174,9],[1177,3,1177,7],[1178,1,1179,2],[1178,3,1179,3],[1178,4,1179,4],[1178,5,1178,7],[1178,9,1179,9],[1211,3,1211,7],[1213,8,1213,9],[1216,3,1216,7],[1217,1,1218,2],[1217,3,1218,3],[1217,4,1218,4],[1217,5,1217,7],[1217,9,1218,9],[1199,3,1199,7],[1200,3,1200,7],[1201,3,1201,7],[1204,7,1204,9],[1207,3,1207,7],[1208,7,1208,9],[1190,8,1190,9],[1191,1,1192,2],[1191,3,1192,3],[1191,4,1191,5],[1191,6,1191,7],[1196,7,1196,9],[1238,3,1238,7],[1239,3,1239,7],[1240,3,1240,7],[1243,7,1243,9],[1247,3,1247,7],[1248,7,1248,9],[1229,8,1229,9],[1230,1,1231,2],[1230,3,1231,3],[1230,4,1230,5],[1230,6,1230,7],[1235,7,1235,9],[1221,3,1221,7],[1222,5,1222,7],[1225,0,1265,0],[1226,2,1226,9],[1227,1,1228,3],[1227,4,1227,5],[1228,4,1228,5],[1229,2,1229,7],[1263,3,1263,7],[1264,5,1264,7],[1186,0,1223,0],[1187,2,1187,9],[1188,1,1189,3],[1188,4,1188,5],[1189,4,1189,5],[1190,2,1190,7],[1251,3,1251,7],[1253,8,1253,9],[1257,3,1257,7],[1258,1,1259,2],[1258,3,1259,3],[1258,4,1259,4],[1258,5,1258,7],[1258,9,1259,9],[1292,3,1292,7],[1294,8,1294,9],[1297,3,1297,7],[1298,1,1299,2],[1298,3,1299,3],[1298,4,1299,4],[1298,5,1298,7],[1298,9,1299,9],[1280,3,1280,7],[1281,3,1281,7],[1282,3,1282,7],[1285,7,1285,9],[1288,3,1288,7],[1289,7,1289,9],[1271,8,1271,9],[1272,1,1273,2],[1272,3,1273,3],[1272,4,1272,5],[1272,6,1272,7],[1277,7,1277,9],[1320,3,1320,7],[1321,3,1321,7],[1322,3,1322,7],[1325,7,1325,9],[1331,3,1331,7],[1332,7,1332,9],[1310,8,1310,9],[1311,1,1312,2],[1311,3,1312,3],[1311,4,1311,5],[1311,6,1311,7],[1316,7,1316,9],[1302,3,1302,7],[1303,5,1303,7],[1306,0,1347,0],[1307,2,1307,9],[1308,1,1309,3],[1308,4,1308,5],[1309,4,1309,5],[1310,2,1310,7],[1345,3,1345,7],[1346,5,1346,7],[1267,0,1304,0],[1268,2,1268,9],[1269,1,1270,3],[1269,4,1269,5],[1270,4,1270,5],[1271,2,1271,7],[1335,3,1335,7],[1337,8,1337,9],[1340,3,1340,7],[1341,1,1342,2],[1341,3,1342,3],[1341,4,1342,4],[1341,5,1341,7],[1341,9,1342,9],[1374,3,1374,7],[1376,8,1376,9],[1379,3,1379,7],[1380,1,1381,2],[1380,3,1381,3],[1380,4,1381,4],[1380,5,1380,7],[1380,9,1381,9],[1362,3,1362,7],[1363,3,1363,7],[1364,3,1364,7],[1367,7,1367,9],[1370,3,1370,7],[1371,7,1371,9],[1353,8,1353,9],[1354,1,1355,2],[1354,3,1355,3],[1354,4,1354,5],[1354,6,1354,7],[1359,7,1359,9],[1401,3,1401,7],[1402,3,1402,7],[1403,3,1403,7],[1406,7,1406,9],[1409,3,1409,7],[1410,7,1410,9],[1392,8,1392,9],[1393,1,1394,2],[1393,3,1394,3],[1393,4,1393,5],[1393,6,1393,7],[1398,7,1398,9],[1384,3,1384,7],[1385,5,1385,7],[1388,0,1425,0],[1389,2,1389,9],[1390,1,1391,3],[1390,4,1390,5],[1391,4,1391,5],[1392,2,1392,7],[1423,3,1423,7],[1424,5,1424,7],[1349,0,1386,0],[1350,2,1350,9],[1351,1,1352,3],[1351,4,1351,5],[1352,4,1352,5],[1353,2,1353,7],[1413,3,1413,7],[1415,8,1415,9],[1418,3,1418,7],[1419,1,1420,2],[1469,4,1469,5],[1470,2,1470,7],[1508,3,1508,7],[1509,5,1509,7],[1494,3,1494,7],[1496,8,1496,9],[1501,3,1501,7],[1502,1,1503,2],[1419,3,1420,3],[1419,4,1420,4],[1419,5,1419,7],[1419,9,1420,9],[1452,3,1452,7],[1454,8,1454,9],[1457,3,1457,7],[1458,1,1459,2],[1458,3,1459,3],[1458,4,1459,4],[1458,5,1458,7],[1458,9,1459,9],[1440,3,1440,7],[1441,3,1441,7],[1442,3,1442,7],[1445,7,1445,9],[1448,3,1448,7],[1449,7,1449,9],[1431,8,1431,9],[1432,1,1433,2],[1432,3,1433,3],[1432,4,1432,5],[1432,6,1432,7],[1437,7,1437,9],[1535,3,1535,7],[1536,7,1536,9],[1516,8,1516,9],[1517,1,1518,2],[1517,3,1518,3],[1517,4,1517,5],[1517,6,1517,7],[1523,7,1523,9],[1462,3,1462,7],[1463,5,1463,7],[1427,0,1464,0],[1428,2,1428,9],[1429,1,1430,3],[1429,4,1429,5],[1430,4,1430,5],[1431,2,1431,7],[1479,3,1479,7]],"merged_total":1095,"flags":["merged_cut"]}
[1,"1ª/GRD",{"$nulls":8},{"$f":"J37","v":6943.14}]
[null,"OBRA:"," PAVIMENTAÇÃO ASFÁLTICA EM CBUQ - ESTRADA PARA SANTANA DO MUNDO NOVO (JURAMENTO / MG)"]
[null,"Custo Unitário de Referência",null,null,"Minas Gerais"]
[{"$nulls":4}," Janeiro/2025",null,null,"Produção da equipe ",0.5,{"$f":"VLOOKUP(A1,ORÇAMENTO!$A$10:$L$59,7,1)","v":"GL"}]
[null,"CPU.1","MOBILIZAÇÃO E DESMOBILIZAÇÃO",{"$nulls":5},"Valores em reais (R$)"]
[null,"A - EQUIPAMENTOS",null,"Quantidade","Utilização",null,"Custo Horário",null,null,"Custo"]
{"$rows_left_out":1593}
{"sheet":"CPU-FORNEC","index":2,"n_rows":92,"n_cols":14,"rows_kept":92,"cut":false,"hidden":false,"merged":[[71,0,80,0],[71,1,71,3],[71,4,71,7],[72,2,72,5],[73,2,73,3],[74,1,74,7],[77,1,77,3],[77,5,77,6],[78,1,78,6],[79,1,79,6],[80,1,80,6],[0,0,26,0],[0,1,0,3],[0,4,0,7],[22,1,22,3],[49,0,58,0],[49,1,49,3],[49,4,49,7],[50,2,50,5],[51,2,51,3],[52,1,52,7],[55,1,55,3],[55,5,55,6],[56,1,56,6],[57,1,57,6],[58,1,58,6],[27,1,27,3],[27,4,27,7],[28,2,28,5],[27,0,36,0],[29,2,29,3],[30,1,30,7],[33,1,33,3],[33,5,33,6],[34,1,34,6],[35,1,35,6],[36,1,36,6],[0,10,0,11],[1,2,1,5],[1,10,1,11],[2,2,2,3],[3,1,3,7],[22,5,22,6],[23,1,23,6],[24,1,24,6],[25,1,25,6],[5,1,5,7],[9,1,9,7],[13,1,13,7],[17,1,17,7],[38,0,47,0],[38,1,38,3],[38,4,38,7],[39,2,39,5],[40,2,40,3],[41,1,41,7],[44,1,44,3],[44,5,44,6],[45,1,45,6],[46,1,46,6],[47,1,47,6],[60,0,69,0],[60,1,60,3],[60,4,60,7],[61,2,61,5],[62,2,62,3],[63,1,63,7],[66,1,66,3],[66,5,66,6],[67,1,67,6],[68,1,68,6],[69,1,69,6],[81,1,81,7],[82,0,91,0],[82,1,82,3],[82,4,82,7],[83,2,83,5],[84,2,84,3],[85,1,85,7],[88,1,88,3],[88,5,88,6],[89,1,89,6],[90,1,90,6],[91,1,91,6]]}
[1,"CODEVASF",null,null," COMPOSIÇÃO DE PREÇO UNITÁRIO",null,null,null,{"$f":"H24","v":0},{"$f":"H26","v":0},"BDI CALCULADO:",null,{"$f":"ORÇAMENTO!L5","v":22.26}]
[null,"OBRA:  "," PAVIMENTAÇÃO ASFÁLTICA EM CBUQ - ESTRADA PARA SANTANA DO MUNDO NOVO (JURAMENTO / MG)",null,null,null,"DATA: ",{"$f":"ORÇAMENTO!C6","v":" ABRIL / 2025 "},null,null,"BDI DIFERENCIADO:",null,{"$f":"'BDI FORN'!D31/100","v":0.15}]
[null,"SERVIÇO:  ","CPU.1",null,"Referência:","CODEVASF","UNIDADE: ",{"$f":"VLOOKUP(A1,ORÇAMENTO!A11:L30,5)","v":"MOBILIZAÇÃO E DESMOBILIZAÇÃO"}]
[]
[null,"TIPO ITEM","CODIGO ITEM","DESCRIÇÃO ITEM","UNIDADE ITEM","COEFICIENTE","PRECO UNITARIO","CUSTO TOTAL",null,"distancia =",90,"B.DESPACHO"]
[null,"EQUIPAMENTOS",{"$nulls":7},"Pá carregadeira ",null,null,10.1," ton"]
{"$rows_left_out":87}
{"sheet":"BDI SERV","index":3,"n_rows":60,"n_cols":5,"rows_kept":60,"cut":false,"hidden":false,"merged":[[38,1,38,4],[39,2,39,3],[36,0,36,5],[0,1,2,4],[25,1,25,3],[26,1,26,2],[26,3,26,4],[27,3,27,4],[35,0,35,5]]}
[null,"DETALHAMENTO DO BDI - SERVIÇOS"]
[]
[]
[null,"Item","Descrição dos Serviços","% - PV","% - CD"]
[]
[null,1,"ADMINISTRAÇÃO CENTRAL"," ",{"$f":"SUM(E7:E9)","v":4.01}]
{"$rows_left_out":55}
{"sheet":"BDI FORN","index":4,"n_rows":37,"n_cols":5,"rows_kept":37,"cut":false,"hidden":false,"merged":[[31,1,31,2],[32,0,34,5],[36,0,36,5],[0,1,2,4],[3,1,4,1],[3,2,4,2],[28,0,28,5],[30,1,30,2]]}
[null,"DETALHAMENTO DO BDI - FORNECIMENTO \n(MATERIAL ASFÁLTICO)"]
[]
[]
[null,"Item","Descrição dos Serviços","%","%"]
[null,null,null,"PV","CD"]
[]
{"$rows_left_out":32}
{"sheet":"CRONOGRAMA","index":5,"n_rows":19,"n_cols":11,"rows_kept":19,"cut":false,"hidden":false,"merged":[[9,0,10,0],[9,1,10,1],[9,2,10,2],[15,1,16,2],[18,1,22,10],[11,0,12,0],[11,1,12,1],[11,2,12,2],[13,0,14,0],[13,1,14,1],[13,2,14,2],[3,1,3,9],[5,0,6,0],[5,1,6,1],[5,2,6,2],[7,0,8,0],[7,1,8,1],[7,2,8,2],[0,1,0,10],[1,1,2,1],[1,2,2,4],[1,6,1,10],[2,6,2,10]]}
[null,"CRONOGRAMA FÍSICO-FINANCEIRO"]
[null,"OBRA: ",{"$f":"ORÇAMENTO!C5","v":" PAVIMENTAÇÃO ASFÁLTICA EM CBUQ - ESTRADA PARA SANTANA DO MUNDO NOVO (JURAMENTO / MG)"},null,null,"VALOR:",{"$f":"ORÇAMENTO!L59","v":1999806.5}]
[{"$nulls":5},"PRAZO: ","150 DIAS "]
[]
[null,"ITEM","ETAPAS/DESCRIÇAO","FISICO/  FINANCEIRO","TOTAL    ETAPAS","MÊS 1","MÊS 2","MÊS 3","MÊS 4","MÊS 5","TOTAL"]
["A",{"$f":"VLOOKUP(A6,ORÇAMENTO!$A$10:$L$59,2)","v":1},{"$f":"VLOOKUP(A6,ORÇAMENTO!$A$10:$L$59,5)","v":"SERVIÇOS PRELIMINARES "},"FISICO ",{"$f":"ROUND(E7/$G$2,4)","v":8.0799999999999997E-2},0.25,0.2,0.2,0.2,0.15,{"$f":"SUM(F6:J6)","v":1}]
{"$rows_left_out":14}
{"sheet":"EAI","index":6,"n_rows":90,"n_cols":34,"rows_kept":90,"cut":false,"hidden":false,"merged":[[12,3,24,3],[1,2,3,26],[5,2,7,2],[5,12,7,12],[6,6,7,6],[6,19,6,20],[10,4,10,8],[10,9,10,10],[10,22,10,23],[5,6,5,7],[5,8,5,9],[6,21,6,24],[7,21,7,24]]}
[]
[null,null,"MEMÓRIA DE CÁLCULO"]
[]
[]
[]
[{"$nulls":6},"TIPOLOGIA DO MATERIAL",null,"EMULSÃO ASFÁLTICA PARA SERVIÇO DE IMPRIMAÇÃO",null,null,null,"IMPOSTOS","COFINS",6.4999999999999997E-3,6.4999999999999997E-3]
{"$rows_left_out":78}
{"sheet":"RR-1C","index":7,"n_rows":92,"n_cols":34,"rows_kept":92,"cut":false,"hidden":false,"merged":[[1,2,3,26],[5,2,7,2],[10,4,10,8],[10,9,10,10],[10,22,10,23],[6,21,6,24],[7,21,7,24],[12,3,26,3],[6,19,6,20],[6,6,7,6],[5,12,7,12],[5,6,5,7],[5,8,5,9]]}
[]
[null,null,"MEMÓRIA DE CÁLCULO"]
[]
[]
[]
[{"$nulls":6},"TIPOLOGIA DO MATERIAL",null,"EMULSÕES ASFÁLTICAS RR-1C",null,null,null,"IMPOSTOS","COFINS",6.4999999999999997E-3,6.4999999999999997E-3]
{"$rows_left_out":80}
{"sheet":"CAP","index":8,"n_rows":91,"n_cols":34,"rows_kept":91,"cut":false,"hidden":false,"merged":[[10,4,10,8],[10,9,10,10],[10,22,10,23],[12,3,24,3],[1,2,3,26],[5,2,7,2],[5,12,7,12],[6,6,7,6],[6,19,6,20],[6,21,6,24],[7,21,7,24],[5,6,5,7],[5,8,5,9]]}
[]
[null,null,"MEMÓRIA DE CÁLCULO"]
[]
[]
[]
[{"$nulls":6},"TIPOLOGIA DO MATERIAL",null,"CIMENTOS ASFÁLTICOS CAP-50-70",null,null,null,"IMPOSTOS","COFINS",6.4999999999999997E-3,6.4999999999999997E-3]
{"$rows_left_out":78}
{"sheet":"MAT.ASF","index":9,"n_rows":33,"n_cols":23,"rows_kept":33,"cut":false,"hidden":false,"merged":[[7,1,7,19],[8,1,10,22],[2,1,2,8],[3,1,3,8],[4,1,4,8],[5,1,5,8],[6,1,6,22],[20,2,25,2],[27,2,32,2],[19,1,19,22],[26,1,26,22],[11,2,12,2],[11,3,11,6],[11,7,11,8],[11,18,11,19],[13,2,18,2]]}
{"$rows_empty":8}
[null,"PLANILHA RESUMO - MATERIAIS ASFÁLTICOS"]
[]
[]
[null,"DATA-BASE","PRODUTOS","LOCALIDADES",null,null,null,"CUSTO ANP (R$/Kg)",null,"CUSTO ANP","IMPOSTOS DO PRODUTO","CUSTO DO PRODUTO COM IMPOSTOS","DMT's","DMT's","CUSTO DO TRANSPORTE TOTAL","ICMS","ATUALIZAÇÃO DO CUSTO DE TRANSPORTE","CUSTO DO TRANSPORTE RODOVIA PAVIMENTADA COM IMPOSTOS E ATUALIZAÇÃO MONETÁRIA","PEDÁGIO ",null,"TOTAL TRANSPORTE","TOTAL PRODUTO","TOTAL GERAL"]
[null,{"$f":"CAP!H9","v":"2025-02-01"},null,"REFINARIAS","ENDEREÇO","ORIGEM - REFINARIAS / DISTRIBUIDORAS","DESTINO","ESTADO","REGIÃO","R$/t","R$/t","R$/t","KM","KM","R$/t","R$/t","R$/t","R$/t","CUSTO POR EIXO","R$/t","R$/t","R$/t","R$/t"]
{"$rows_left_out":20}