{"text_format":"2","workbook":"xlsx","n_sheets":10,"sheets":["ORÇAMENTO","CPU-SERV","CPU-FORNEC","BDI SERV","BDI FORN","CRONOGRAMA","EAI","RR-1C","CAP","MAT.ASF"],"not_rendered":{"charts":0,"images":1,"macros":0,"external_links":2,"defined_names":12,"comments":5,"pivot_tables":0},"unopened":[],"bounds":{"document_bytes":16777216,"sheet_cells":100000,"run_cost":"one","rows_first":2000,"rows_last":500,"rows_between":2000,"halvings":0,"cell_chars":16384,"cell_head_chars":4096},"cells_cut":0,"cells_raw":0,"read":"whole","date_system":"1900"}

{"sheet":"ORÇAMENTO","index":0,"n_rows":69,"n_cols":12,"rows_kept":69,"cut":false,"hidden":false,"merged":[[0,0,8,0],[0,4,0,11],[1,4,1,11],[2,4,2,11],[6,1,6,4],[4,2,4,8],[4,9,4,10],[5,2,5,4],[6,8,6,10],[7,1,7,11],[5,8,5,10]]}
["<---- NUMERAR SERVIÇOS PARA CPU",null,null,null,"Ministério do Desenvolvimento Regional"]
[{"$nulls":4},"Companhia de Desenvolvimento dos Vales do São Francisco e do Parnaíba"]
[{"$nulls":4},"1ª Superintendência Regional"]
[]
[null,"OBRA: "," DRENAGEM E PAVIMENTAÇÃO - VIAS INTERNAS DO PARQUE DE EXPOSIÇÕES E RUA BOM JARDIM (BAIRRO SANTO ANTÔNIO) - SERRO-MG",{"$nulls":6},"BDI Serviços (%):",null,{"$f":"'BDI SERV'!E26","v":23.32}]
[null,"DATA:"," JANEIRO / 2025",{"$nulls":5},"BDI Diferenciado Serviços (%):",null,null,{"$f":"'BDI FORN'!D31","v":15}]
[null,"PRAZO DE EXECUÇÃO:     270 DIAS",{"$nulls":6},"BDI Fornecimentos (%):",null,null,{"$f":"'BDI FORN'!D31","v":15}]
[null,"PLANILHA DE ORÇAMENTAÇÃO"]
[null,"ITEM","CÓDIGO","FONTE","DISCRIMINAÇÃO","TIPO","UNID.","QUANT.","VR.UNIT.S/BDI","PR. UNIT.C/BDI","C. TOT.S/BDI","P. TOT.C/BDI"]
["A",1,null,null,"SERVIÇOS PRELIMINARES ",{"$nulls":5},{"$f":"SUM(K11:K15)","v":259690.46000000002},{"$f":"SUM(L11:L15)","v":320197.95}]
[1,"1.1","CPU.1","CODEVASF","MOBILIZAÇÃO E DESMOBILIZAÇÃO","SERV","GL",1,{"$f":"VLOOKUP(A11,'CPU-SERV'!A:K,11,0)","v":24209.41},{"$f":"TRUNC(_xlfn.IFS(F11=\"SERV\",I11*(1+$L$5/100),F11=\"SERV DIF\",I11*(1+$L$6/100),F11=\"FORN\",I11*(1+$L$7/100)),2)","v":29855.040000000001},{"$f":"TRUNC(H11*I11,2)","v":24209.41},{"$f":"TRUNC(H11*J11,2)","v":29855.040000000001}]
[2,"1.2","CPU.2","CODEVASF","ADMINISTRAÇÃO LOCAL ","SERV","GL",1,{"$f":"VLOOKUP(A12,'CPU-SERV'!A:K,11,0)","v":199922.17},{"$f":"TRUNC(_xlfn.IFS(F12=\"SERV\",I12*(1+$L$5/100),F12=\"SERV DIF\",I12*(1+$L$6/100),F12=\"FORN\",I12*(1+$L$7/100)),2)","v":246544.02},{"$f":"TRUNC(H12*I12,2)","v":199922.17},{"$f":"TRUNC(H12*J12,2)","v":246544.02}]
[3,"1.3","CPU.3","CODEVASF","CANTEIRO DE OBRAS ","SERV","GL",1,{"$f":"VLOOKUP(A13,'CPU-SERV'!A:K,11,0)","v":20500.740000000002},{"$f":"TRUNC(_xlfn.IFS(F13=\"SERV\",I13*(1+$L$5/100),F13=\"SERV DIF\",I13*(1+$L$6/100),F13=\"FORN\",I13*(1+$L$7/100)),2)","v":25281.51},{"$f":"TRUNC(H13*I13,2)","v":20500.740000000002},{"$f":"TRUNC(H13*J13,2)","v":25281.51}]
[4,"1.4",103689,"SINAPI","PLACA DE OBRA EM CHAPA DE AÇO GALVANIZADO","SERV","M2",6,{"$f":"VLOOKUP(A14,'CPU-SERV'!A:K,11,0)","v":349.69},{"$f":"TRUNC(_xlfn.IFS(F14=\"SERV\",I14*(1+$L$5/100),F14=\"SERV DIF\",I14*(1+$L$6/100),F14=\"FORN\",I14*(1+$L$7/100)),2)","v":431.23},{"$f":"TRUNC(H14*I14,2)","v":2098.14},{"$f":"TRUNC(H14*J14,2)","v":2587.38}]
[6,"1.5",78472,"SINAPI","SERVIÇOS TOPOGRÁFICOS PARA PAVIMENTAÇÃO, INCLUSIVE LEVANTAMENTO PLANIALTIMÉTRICO CADASTRAL, GERAÇÃO DE NOTAS DE SERVIÇO, SEÇÕES TRANSVERSAIS E GREIDE, ESTAQUEAMENTO E ACOMPANHAMENTO EXECUTIVO","SERV","M2",27000.000000000004,{"$f":"VLOOKUP(A15,'CPU-SERV'!A:K,11,0)","v":0.48},{"$f":"TRUNC(_xlfn.IFS(F15=\"SERV\",I15*(1+$L$5/100),F15=\"SERV DIF\",I15*(1+$L$6/100),F15=\"FORN\",I15*(1+$L$7/100)),2)","v":0.59},{"$f":"TRUNC(H15*I15,2)","v":12960},{"$f":"TRUNC(H15*J15,2)","v":15930}]
["B",2,null,null,"TERRAPLANAGEM E PAVIMENTAÇÃO",{"$nulls":5},{"$f":"SUM(K17:K24)","v":1596734.7199999997},{"$f":"SUM(L17:L24)","v":1968813.3499999999}]
[7,"2.1",5502140,"SICRO","ESCAVAÇÃO, CARGA E TRANSPORTE DE MATERIAL DE 1ª CATEGORIA - DMT 1.000 A 1.200M, CAMINHO DE SERVIÇO EM REVESTIMENTO PRIMÁRIO","SERV","M3",7200.0000000000009,{"$f":"VLOOKUP(A17,'CPU-SERV'!A:K,11,0)","v":6.59},{"$f":"TRUNC(_xlfn.IFS(F17=\"SERV\",I17*(1+$L$5/100),F17=\"SERV DIF\",I17*(1+$L$6/100),F17=\"FORN\",I17*(1+$L$7/100)),2)","v":8.1199999999999992},{"$f":"TRUNC(H17*I17,2)","v":47448},{"$f":"TRUNC(H17*J17,2)","v":58464}]
[8,"2.2",5502978,"SICRO","COMPACTAÇÃO DE ATERRO A 100% DO PROCTOR NORMAL","SERV","M3",2700.0000000000005,{"$f":"VLOOKUP(A18,'CPU-SERV'!A:K,11,0)","v":4.96},{"$f":"TRUNC(_xlfn.IFS(F18=\"SERV\",I18*(1+$L$5/100),F18=\"SERV DIF\",I18*(1+$L$6/100),F18=\"FORN\",I18*(1+$L$7/100)),2)","v":6.11},13392,16497]
[9,"2.3",4011209,"SICRO","REGULARIZAÇÃO E COMPACTAÇÃO DO SUBLEITO ","SERV","M2",26300,{"$f":"VLOOKUP(A19,'CPU-SERV'!A:K,11,0)","v":1.1399999999999999},{"$f":"TRUNC(_xlfn.IFS(F19=\"SERV\",I19*(1+$L$5/100),F19=\"SERV DIF\",I19*(1+$L$6/100),F19=\"FORN\",I19*(1+$L$7/100)),2)","v":1.4},29982,36820]
[10,"2.4",4011219,"SICRO","EXECUÇÃO E COMPACTAÇÃO DE BASE ESTABILIZADA GRANULOMETRICAMENTE SEM MISTURA COM MATERIAL DE JAZIDA","SERV","M3",4849.9999999999991,{"$f":"VLOOKUP(A20,'CPU-SERV'!A:K,11,0)","v":12.27},{"$f":"TRUNC(_xlfn.IFS(F20=\"SERV\",I20*(1+$L$5/100),F20=\"SERV DIF\",I20*(1+$L$6/100),F20=\"FORN\",I20*(1+$L$7/100)),2)","v":15.13},59509.5,73380.5]
[11,"2.5",92394,"SINAPI","EXECUÇÃO DE PAVIMENTO EM PISO INTERTRAVADO, COM BLOCO DE CONCRETO DO TIPO SEXTAVADO DE 25 X 25CM, ESPESSURA 8 CM","SERV","M2",15800.001666666671,{"$f":"VLOOKUP(A21,'CPU-SERV'!A:K,11,0)","v":81.48},{"$f":"TRUNC(_xlfn.IFS(F21=\"SERV\",I21*(1+$L$5/100),F21=\"SERV DIF\",I21*(1+$L$6/100),F21=\"FORN\",I21*(1+$L$7/100)),2)","v":100.48},1287384.1299999999,1587584.16]
[12,"2.6",4011352,"SICRO","IMPRIMAÇÃO COM EMULSÃO ASFÁLTICA (EAI)","SERV","M2",7680,{"$f":"VLOOKUP(A22,'CPU-SERV'!A:K,11,0)","v":0.39},{"$f":"TRUNC(_xlfn.IFS(F22=\"SERV\",I22*(1+$L$5/100),F22=\"SERV DIF\",I22*(1+$L$6/100),F22=\"FORN\",I22*(1+$L$7/100)),2)","v":0.48},2995.2,3686.4]
[13,"2.7",4011353,"SICRO","PINTURA DE LIGAÇÃO COM EMULSÃO ASFÁLTICA RR-1C","SERV","M2",7199.9957142857147,{"$f":"VLOOKUP(A23,'CPU-SERV'!A:K,11,0)","v":0.27},{"$f":"TRUNC(_xlfn.IFS(F23=\"SERV\",I23*(1+$L$5/100),F23=\"SERV DIF\",I23*(1+$L$6/100),F23=\"FORN\",I23*(1+$L$7/100)),2)","v":0.33},1943.99,2375.9899999999998]
[14,"2.8",4011463,"SICRO","EXECUÇÃO DE PAVIMENTO COM APLICAÇÃO DE CONCRETO ASFÁLTICO USINADO A QUENTE (CBUQ), CAMADA DE ROLAMENTO - EXCLUSIVE TRANSPORTE","SERV","T",670.00000000000011,{"$f":"VLOOKUP(A24,'CPU-SERV'!A:K,11,0)","v":229.97},{"$f":"TRUNC(_xlfn.IFS(F24=\"SERV\",I24*(1+$L$5/100),F24=\"SERV DIF\",I24*(1+$L$6/100),F24=\"FORN\",I24*(1+$L$7/100)),2)","v":283.58999999999997},154079.9,190005.3]
["C",3,null,null,"TRANSPORTE DE MATERIAIS",{"$nulls":5},{"$f":"SUM(K26:K30)","v":128906.79},{"$f":"SUM(L26:L30)","v":158227.99}]
[15,"3.1",5915321,"SICRO","TRANSPORTE COM CAMINHÃO BASCULANTE, EM RODOVIA PAVIMENTADA","SERV","TXKM",70000.003899999982,{"$f":"VLOOKUP(A26,'CPU-SERV'!A:K,11,0)","v":0.64},{"$f":"TRUNC(_xlfn.IFS(F26=\"SERV\",I26*(1+$L$5/100),F26=\"SERV DIF\",I26*(1+$L$6/100),F26=\"FORN\",I26*(1+$L$7/100)),2)","v":0.78},{"$f":"TRUNC(H26*I26,2)","v":44800},{"$f":"TRUNC(H26*J26,2)","v":54600}]
[16,"3.2",5915320,"SICRO","TRANSPORTE COM CAMINHÃO BASCULANTE, RODOVIA EM REVESTIMENTO PRIMÁRIO","SERV","TXKM",20000.003899999996,{"$f":"VLOOKUP(A27,'CPU-SERV'!A:K,11,0)","v":0.7},{"$f":"TRUNC(_xlfn.IFS(F27=\"SERV\",I27*(1+$L$5/100),F27=\"SERV DIF\",I27*(1+$L$6/100),F27=\"FORN\",I27*(1+$L$7/100)),2)","v":0.86},{"$f":"TRUNC(H27*I27,2)","v":14000},{"$f":"TRUNC(H27*J27,2)","v":17200}]
[17,"3.3",5914434,"SICRO","TRANSPORTE COM CAMINHÃO CARROCERIA 9T, EM VIA URBANA PREDOMINANTEMENTE PAVIMENTADA","SERV","TXKM",44999.997464533335,{"$f":"VLOOKUP(A28,'CPU-SERV'!A:K,11,0)","v":0.73},{"$f":"TRUNC(_xlfn.IFS(F28=\"SERV\",I28*(1+$L$5/100),F28=\"SERV DIF\",I28*(1+$L$6/100),F28=\"FORN\",I28*(1+$L$7/100)),2)","v":0.9},{"$f":"TRUNC(H28*I28,2)","v":32849.99},{"$f":"TRUNC(H28*J28,2)","v":40499.99}]
[18,"3.4",5914612,"SICRO","TRANSPORTE DE MASSA ASFÁLTICA COM CAMINHÃO BASCULANTE, EM VIA URBANA PREDOMINANTEMENTE PAVIMENTADA","SERV","TXKM",32000,{"$f":"VLOOKUP(A29,'CPU-SERV'!A:K,11,0)","v":1.1599999999999999},{"$f":"TRUNC(_xlfn.IFS(F29=\"SERV\",I29*(1+$L$5/100),F29=\"SERV DIF\",I29*(1+$L$6/100),F29=\"FORN\",I29*(1+$L$7/100)),2)","v":1.43},{"$f":"TRUNC(H29*I29,2)","v":37120},{"$f":"TRUNC(H29*J29,2)","v":45760}]
[19,"3.5",5914622,"SICRO","TRANSPORTE COM CAMINHÃO TANQUE DE TRANSPORTE DE MATERIAL ASFÁLTICO DE 30000 L, EM VIA URBANA PREDOMINANTEMENTE PAVIMENTADA","SERV","TXKM",80,{"$f":"VLOOKUP(A30,'CPU-SERV'!A:K,11,0)","v":1.71},{"$f":"TRUNC(_xlfn.IFS(F30=\"SERV\",I30*(1+$L$5/100),F30=\"SERV DIF\",I30*(1+$L$6/100),F30=\"FORN\",I30*(1+$L$7/100)),2)","v":2.1},{"$f":"TRUNC(H30*I30,2)","v":136.80000000000001},{"$f":"TRUNC(H30*J30,2)","v":168}]
["E",4,null,null,"DRENAGEM E OBRAS COMPLEMENTARES",{"$nulls":5},{"$f":"SUM(K32:K61)","v":1525146.93},{"$f":"SUM(L32:L61)","v":1880746.9}]
[20,"4.1",94267,"SINAPI","GUIA (MEIO-FIO) E SARJETA CONJUGADOS DE CONCRETO, MOLDADA IN LOCO COM EXTRUSORA, 45 CM BASE (15 CM BASE DA GUIA + 30 CM BASE DA SARJETA) X 22 CM ALTURA","SERV","M",3000,{"$f":"VLOOKUP(A32,'CPU-SERV'!A:K,11,0)","v":48.29},{"$f":"TRUNC(_xlfn.IFS(F32=\"SERV\",I32*(1+$L$5/100),F32=\"SERV DIF\",I32*(1+$L$6/100),F32=\"FORN\",I32*(1+$L$7/100)),2)","v":59.55},{"$f":"TRUNC(H32*I32,2)","v":144870},{"$f":"TRUNC(H32*J32,2)","v":178650}]
[23,"4.2",94263,"SINAPI","GUIA (MEIO FIO) EM CONCRETO, MOLDADO IN LOCO COM EXTRUSORA - 13CM DE BASE X 22CM DE ALTURA - PARA TRAVAMENTO","SERV","M",2200,{"$f":"VLOOKUP(A33,'CPU-SERV'!A:K,11,0)","v":24.06},{"$f":"TRUNC(_xlfn.IFS(F33=\"SERV\",I33*(1+$L$5/100),F33=\"SERV DIF\",I33*(1+$L$6/100),F33=\"FORN\",I33*(1+$L$7/100)),2)","v":29.67},{"$f":"TRUNC(H33*I33,2)","v":52932},{"$f":"TRUNC(H33*J33,2)","v":65274}]
[24,"4.3",94990,"SICRO","EXECUÇÃO DE PASSEIO (CALÇADA) OU PISO DE CONCRETO COM CONCRETO MOLDADO IN LOCO, FEITO EM OBRA, ACABAMENTO CONVENCIONAL, NÃO ARMADO.","SERV","M3",130,{"$f":"VLOOKUP(A34,'CPU-SERV'!A:K,11,0)","v":746.26},{"$f":"TRUNC(_xlfn.IFS(F34=\"SERV\",I34*(1+$L$5/100),F34=\"SERV DIF\",I34*(1+$L$6/100),F34=\"FORN\",I34*(1+$L$7/100)),2)","v":920.28},{"$f":"TRUNC(H34*I34,2)","v":97013.8},{"$f":"TRUNC(H34*J34,2)","v":119636.4}]
[25,"4.4",99063,"SICRO","LOCAÇÃO DE REDE DE ÁGUA OU ESGOTO","SERV","M",1420,{"$f":"VLOOKUP(A35,'CPU-SERV'!A:K,11,0)","v":9.65},{"$f":"TRUNC(_xlfn.IFS(F35=\"SERV\",I35*(1+$L$5/100),F35=\"SERV DIF\",I35*(1+$L$6/100),F35=\"FORN\",I35*(1+$L$7/100)),2)","v":11.9},13703,16898]
[26,"4.5",4805757,"SICRO","ESCAVAÇÃO MECÂNICA DE VALA EM MATERIAL DE 1ª CATEGORIA","SERV","M3",3100,{"$f":"VLOOKUP(A36,'CPU-SERV'!A:K,11,0)","v":6.53},{"$f":"TRUNC(_xlfn.IFS(F36=\"SERV\",I36*(1+$L$5/100),F36=\"SERV DIF\",I36*(1+$L$6/100),F36=\"FORN\",I36*(1+$L$7/100)),2)","v":8.0500000000000007},20243,24955]
[27,"4.6",4805756,"SICRO","APILOAMENTO MANUAL DE FUNDO DE VALA","SERV","M2",1650,{"$f":"VLOOKUP(A37,'CPU-SERV'!A:K,11,0)","v":4.6399999999999997},{"$f":"TRUNC(_xlfn.IFS(F37=\"SERV\",I37*(1+$L$5/100),F37=\"SERV DIF\",I37*(1+$L$6/100),F37=\"FORN\",I37*(1+$L$7/100)),2)","v":5.72},7656,9438]
[28,"4.7",1106057,"SICRO","EXECUÇÃO DE BERÇO EM CONCRETO MAGRO, PREPARO EM BETONEIRA","SERV","M3",360.00199999999995,{"$f":"VLOOKUP(A38,'CPU-SERV'!A:K,11,0)","v":469.56},{"$f":"TRUNC(_xlfn.IFS(F38=\"SERV\",I38*(1+$L$5/100),F38=\"SERV DIF\",I38*(1+$L$6/100),F38=\"FORN\",I38*(1+$L$7/100)),2)","v":579.05999999999995},169042.53,208462.75]
[29,"4.8",2108167,"SICRO","ESCORAMENTO DE VALA TIPO PONTALETEAMENTO","SERV","M3",2800,{"$f":"VLOOKUP(A39,'CPU-SERV'!A:K,11,0)","v":21.68},{"$f":"TRUNC(_xlfn.IFS(F39=\"SERV\",I39*(1+$L$5/100),F39=\"SERV DIF\",I39*(1+$L$6/100),F39=\"FORN\",I39*(1+$L$7/100)),2)","v":26.73},60704,74844]
[30,"4.9","2003869a","SICRO","TUBO DE CONCRETO PA-1 PARA REDES COLETORAS DE ÁGUAS PLUVIAIS, DIÂMETRO = 400MM - FORNECIMENTO E ASSENTAMENTO","SERV","M",540,{"$f":"VLOOKUP(A40,'CPU-SERV'!A:K,11,0)","v":170.28},{"$f":"TRUNC(_xlfn.IFS(F40=\"SERV\",I40*(1+$L$5/100),F40=\"SERV DIF\",I40*(1+$L$6/100),F40=\"FORN\",I40*(1+$L$7/100)),2)","v":209.98},91951.2,113389.2]
[31,"4.10",2003822,"SICRO","TUBO DE CONCRETO PA-1 PARA REDES COLETORAS DE ÁGUAS PLUVIAIS, DIÂMETRO = 600MM - FORNECIMENTO E ASSENTAMENTO","SERV","M",580,{"$f":"VLOOKUP(A41,'CPU-SERV'!A:K,11,0)","v":266.02},{"$f":"TRUNC(_xlfn.IFS(F41=\"SERV\",I41*(1+$L$5/100),F41=\"SERV DIF\",I41*(1+$L$6/100),F41=\"FORN\",I41*(1+$L$7/100)),2)","v":328.05},154291.6,190269]
[32,"4.11",2003826,"SICRO","TUBO DE CONCRETO PA-1 PARA REDES COLETORAS DE ÁGUAS PLUVIAIS, DIÂMETRO = 800MM - FORNECIMENTO E ASSENTAMENTO","SERV","M",300,{"$f":"VLOOKUP(A42,'CPU-SERV'!A:K,11,0)","v":443.94},{"$f":"TRUNC(_xlfn.IFS(F42=\"SERV\",I42*(1+$L$5/100),F42=\"SERV DIF\",I42*(1+$L$6/100),F42=\"FORN\",I42*(1+$L$7/100)),2)","v":547.46},133182,164238]
[33,"4.12",2003634,"SICRO","BOCA DE LOBO DUPLA COM GRELHA DE CONCRETO - BLDG 01","SERV","UN.",66,{"$f":"VLOOKUP(A43,'CPU-SERV'!A:K,11,0)","v":1728.59},{"$f":"TRUNC(_xlfn.IFS(F43=\"SERV\",I43*(1+$L$5/100),F43=\"SERV DIF\",I43*(1+$L$6/100),F43=\"FORN\",I43*(1+$L$7/100)),2)","v":2131.69},114086.94,140691.54]
[34,"4.13",2003685,"SICRO","POÇO DE VISITA - PVI 05","SERV","UN.",27,{"$f":"VLOOKUP(A44,'CPU-SERV'!A:K,11,0)","v":2890.3},{"$f":"TRUNC(_xlfn.IFS(F44=\"SERV\",I44*(1+$L$5/100),F44=\"SERV DIF\",I44*(1+$L$6/100),F44=\"FORN\",I44*(1+$L$7/100)),2)","v":3564.31},78038.100000000006,96236.37]
[35,"4.14",2003411,"SICRO","DESCIDA D'ÁGUA EM DEGRAUS PARA BSTC Ø600MM (DAD 110-26)","SERV","M",20,{"$f":"VLOOKUP(A45,'CPU-SERV'!A:K,11,0)","v":746.69},{"$f":"TRUNC(_xlfn.IFS(F45=\"SERV\",I45*(1+$L$5/100),F45=\"SERV DIF\",I45*(1+$L$6/100),F45=\"FORN\",I45*(1+$L$7/100)),2)","v":920.81},14933.8,18416.2]
[36,"4.15",2003415,"SICRO","DESCIDA D'ÁGUA EM DEGRAUS PARA BSTC Ø800MM (DAD 125-30)","SERV","M",40,{"$f":"VLOOKUP(A46,'CPU-SERV'!A:K,11,0)","v":821.03},{"$f":"TRUNC(_xlfn.IFS(F46=\"SERV\",I46*(1+$L$5/100),F46=\"SERV DIF\",I46*(1+$L$6/100),F46=\"FORN\",I46*(1+$L$7/100)),2)","v":1012.49},32841.199999999997,40499.599999999999]
[37,"4.16",2003181,"SICRO","BACIA DE DISSIPAÇÃO COM PEDRA DE MÃO IRREGULAR FIXADA EM CONCRETO PARA BSTC Ø600MM (DED 04A)","SERV","UN.",3,{"$f":"VLOOKUP(A47,'CPU-SERV'!A:K,11,0)","v":842.48},{"$f":"TRUNC(_xlfn.IFS(F47=\"SERV\",I47*(1+$L$5/100),F47=\"SERV DIF\",I47*(1+$L$6/100),F47=\"FORN\",I47*(1+$L$7/100)),2)","v":1038.94},2527.44,3116.82]
[38,"4.17",2003183,"SICRO","BACIA DE DISSIPAÇÃO COM PEDRA DE MÃO IRREGULAR FIXADA EM CONCRETO PARA BSTC Ø800MM (DED 05A)","SERV","UN.",7,{"$f":"VLOOKUP(A48,'CPU-SERV'!A:K,11,0)","v":1112.02},{"$f":"TRUNC(_xlfn.IFS(F48=\"SERV\",I48*(1+$L$5/100),F48=\"SERV DIF\",I48*(1+$L$6/100),F48=\"FORN\",I48*(1+$L$7/100)),2)","v":1371.34},7784.14,9599.3799999999992]
[39,"4.18",4815671,"SICRO","REATERRO COMPACTADO DE VALAS COM SOQUETE VIBRATÓRIO","SERV","M3",2299.9960000000005,{"$f":"VLOOKUP(A49,'CPU-SERV'!A:K,11,0)","v":16.260000000000002},{"$f":"TRUNC(_xlfn.IFS(F49=\"SERV\",I49*(1+$L$5/100),F49=\"SERV DIF\",I49*(1+$L$6/100),F49=\"FORN\",I49*(1+$L$7/100)),2)","v":20.05},37397.93,46114.91]
[40,"4.19","CPU.4","CODEVASF","FAIXA ELEVADA PARA TRAVESSIA DE PEDESTRES - CONF. PROJETO, INCLUSIVE PINTURA DE SINALIZAÇÃO","SERV","UN.",7,{"$f":"VLOOKUP(A50,'CPU-SERV'!A:K,11,0)","v":6306.15},{"$f":"TRUNC(_xlfn.IFS(F50=\"SERV\",I50*(1+$L$5/100),F50=\"SERV DIF\",I50*(1+$L$6/100),F50=\"FORN\",I50*(1+$L$7/100)),2)","v":7776.74},44143.05,54437.18]
[41,"4.20",4805751,"SICRO","ESCAVAÇÃO MANUAL DE VALAS EM MATERIAL DE 1ª CATEGORIA","SERV","M3",79.999000000000009,{"$f":"VLOOKUP(A51,'CPU-SERV'!A:K,11,0)","v":52.63},{"$f":"TRUNC(_xlfn.IFS(F51=\"SERV\",I51*(1+$L$5/100),F51=\"SERV DIF\",I51*(1+$L$6/100),F51=\"FORN\",I51*(1+$L$7/100)),2)","v":64.900000000000006},4210.34,5191.93]
[42,"4.21",1107892,"SICRO","CONCRETO FCK = 20MPA, CONFECÇÃO EM BETONEIRA E LANÇAMENTO MANUAL - AREIA E BRITA COMERCIAIS","SERV","M3",79.99499999999999,{"$f":"VLOOKUP(A52,'CPU-SERV'!A:K,11,0)","v":483.33},{"$f":"TRUNC(_xlfn.IFS(F52=\"SERV\",I52*(1+$L$5/100),F52=\"SERV DIF\",I52*(1+$L$6/100),F52=\"FORN\",I52*(1+$L$7/100)),2)","v":596.04},38663.980000000003,47680.21]
[43,"4.22",3107997,"SICRO","FÔRMA EM COMPENSADO DE MADEIRA, USO GERAL - CONFECÇÃO, INSTALAÇÃO E RETIRADA","SERV","M2",500.00000000000006,{"$f":"VLOOKUP(A53,'CPU-SERV'!A:K,11,0)","v":69.430000000000007},{"$f":"TRUNC(_xlfn.IFS(F53=\"SERV\",I53*(1+$L$5/100),F53=\"SERV DIF\",I53*(1+$L$6/100),F53=\"FORN\",I53*(1+$L$7/100)),2)","v":85.62},34715,42810]
[44,"4.23",407819,"SICRO","ARMAÇÃO EM AÇO CA-50 - FORNECIMENTO, PREPARO E COLOCAÇÃO","SERV","KG",5199.9953999999998,{"$f":"VLOOKUP(A54,'CPU-SERV'!A:K,11,0)","v":11.84},{"$f":"TRUNC(_xlfn.IFS(F54=\"SERV\",I54*(1+$L$5/100),F54=\"SERV DIF\",I54*(1+$L$6/100),F54=\"FORN\",I54*(1+$L$7/100)),2)","v":14.6},61567.94,75919.929999999993]
[45,"4.24",909620,"SICRO","ALVENARIA COM BLOCOS DE CONCRETO 19X19X39, COM ESPESSURA DE 20CM","SERV","M2",299.99999999999994,{"$f":"VLOOKUP(A55,'CPU-SERV'!A:K,11,0)","v":117.51},{"$f":"TRUNC(_xlfn.IFS(F55=\"SERV\",I55*(1+$L$5/100),F55=\"SERV DIF\",I55*(1+$L$6/100),F55=\"FORN\",I55*(1+$L$7/100)),2)","v":144.91},35253,43473]
[46,"4.25","909620a","SICRO","ALVENARIA COM BLOCOS DE CONCRETO 19X19X39, COM ESPESSURA DE 20CM, INCLUSIVE ENCHIMENTO DE CONCRETO","SERV","M2",200,{"$f":"VLOOKUP(A56,'CPU-SERV'!A:K,11,0)","v":165.66},{"$f":"TRUNC(_xlfn.IFS(F56=\"SERV\",I56*(1+$L$5/100),F56=\"SERV DIF\",I56*(1+$L$6/100),F56=\"FORN\",I56*(1+$L$7/100)),2)","v":204.29},33132,40858]
[47,"4.26","2003821a","SICRO","DRENO TIPO BARBACÃ - D = 50MM, EM ESTRUTURA DE CONTENÇÃO DE ENCOSTAS (DRB 02) - INCLUSIVE TUBO DE DRENAGEM","SERV","UN.",120,{"$f":"VLOOKUP(A57,'CPU-SERV'!A:K,11,0)","v":21.53},{"$f":"TRUNC(_xlfn.IFS(F57=\"SERV\",I57*(1+$L$5/100),F57=\"SERV DIF\",I57*(1+$L$6/100),F57=\"FORN\",I57*(1+$L$7/100)),2)","v":26.55},{"$f":"TRUNC(H57*I57,2)","v":2583.6},{"$f":"TRUNC(H57*J57,2)","v":3186}]
[48,"4.27",903789,"SICRO","EMBOÇO COM ARGAMASSA TRAÇO 1:2:8, APLICADO MANUALMENTE","SERV","M2",499.99999999999994,{"$f":"VLOOKUP(A58,'CPU-SERV'!A:K,11,0)","v":31.09},{"$f":"TRUNC(_xlfn.IFS(F58=\"SERV\",I58*(1+$L$5/100),F58=\"SERV DIF\",I58*(1+$L$6/100),F58=\"FORN\",I58*(1+$L$7/100)),2)","v":38.340000000000003},{"$f":"TRUNC(H58*I58,2)","v":15545},{"$f":"TRUNC(H58*J58,2)","v":19170}]
[49,"4.28",5213440,"SICRO","PLACA DE REGULAMENTAÇÃO EM AÇO, D=60CM - PELÍCULA RETRORREFLETIVA - FORNECIMENTO E INSTALAÇÃO, INCLUSIVE  SUPORTE","SERV","UN.",15,{"$f":"VLOOKUP(A59,'CPU-SERV'!A:K,11,0)","v":256.2},{"$f":"TRUNC(_xlfn.IFS(F59=\"SERV\",I59*(1+$L$5/100),F59=\"SERV DIF\",I59*(1+$L$6/100),F59=\"FORN\",I59*(1+$L$7/100)),2)","v":315.94},{"$f":"TRUNC(H59*I59,2)","v":3843},{"$f":"TRUNC(H59*J59,2)","v":4739.1000000000004}]
[50,"4.29",5213401,"SICRO","PINTURA DE EIXO VIÁRIO SOBRE ASFALTO COM TINTA RETRORREFLETIVA A BASE DE RESINA ACRÍLICA COM MICROESFERAS DE VIDRO, APLICAÇÃO MECÂNICA COM DEMARCADORA AUTOPROPELIDA","SERV","M2",320.00455205811141,{"$f":"VLOOKUP(A60,'CPU-SERV'!A:K,11,0)","v":32.409999999999997},{"$f":"TRUNC(_xlfn.IFS(F60=\"SERV\",I60*(1+$L$5/100),F60=\"SERV DIF\",I60*(1+$L$6/100),F60=\"FORN\",I60*(1+$L$7/100)),2)","v":39.96},{"$f":"TRUNC(H60*I60,2)","v":10371.34},{"$f":"TRUNC(H60*J60,2)","v":12787.38}]
[51,"4.30",903818,"SICRO","PINTURA COM TINTA LATEX A BASE DE RESINA ACRÍLICA, DUAS CAMADAS COM APLICAÇÃO MANUAL","SERV","M2",499.99999999999994,{"$f":"VLOOKUP(A61,'CPU-SERV'!A:K,11,0)","v":15.84},{"$f":"TRUNC(_xlfn.IFS(F61=\"SERV\",I61*(1+$L$5/100),F61=\"SERV DIF\",I61*(1+$L$6/100),F61=\"FORN\",I61*(1+$L$7/100)),2)","v":19.53},{"$f":"TRUNC(H61*I61,2)","v":7920},{"$f":"TRUNC(H61*J61,2)","v":9765}]
["F",5,null,null,"FORNECIMENTOS - MATERIAL ASFÁLTICO (BDI DIFERENCIADO)",{"$nulls":5},{"$f":"SUM(K63:K68)","v":235567.51},{"$f":"SUM(L63:L68)","v":270901.84000000003}]
["F1","5.1","CPU.7","ANP","AQUISIÇÃO DE EMULSÃO ASFÁLTICA PARA IMPRIMAÇÃO (EAI) - EXCLUSIVE TRANSPORTE","FORN","T",10.004,{"$f":"VLOOKUP(A63,'CPU-FORNEC'!A:J,9,0)","v":3275.67},{"$f":"TRUNC(_xlfn.IFS(F63=\"SERV\",I63*(1+$L$5/100),F63=\"SERV DIF\",I63*(1+$L$6/100),F63=\"FORN\",I63*(1+$L$7/100)),2)","v":3767.02},{"$f":"TRUNC(H63*I63,2)","v":32769.800000000003},{"$f":"TRUNC(H63*J63,2)","v":37685.26}]
["F2","5.2","CPU.8","CODEVASF","TRANSPORTE DE EMULSÃO ASFÁLTICA PARA IMPRIMAÇÃO (EAI)","SERV DIF","T",10.004,{"$f":"VLOOKUP(A64,'CPU-FORNEC'!A:J,9,0)","v":192.78},{"$f":"TRUNC(_xlfn.IFS(F64=\"SERV\",I64*(1+$L$5/100),F64=\"SERV DIF\",I64*(1+$L$6/100),F64=\"FORN\",I64*(1+$L$7/100)),2)","v":221.69},1928.57,2217.7800000000002]
["F3","5.3","CPU.9","ANP","AQUISIÇÃO DE EMULSAO ASFALTICA CATIONICA RR-1C - EXCLUSIVE TRANSPORTE","FORN","T",3.4999980714285721,{"$f":"VLOOKUP(A65,'CPU-FORNEC'!A:J,9,0)","v":3478},{"$f":"TRUNC(_xlfn.IFS(F65=\"SERV\",I65*(1+$L$5/100),F65=\"SERV DIF\",I65*(1+$L$6/100),F65=\"FORN\",I65*(1+$L$7/100)),2)","v":3999.7},12172.99,13998.94]
["F4","5.4","CPU.10","CODEVASF","TRANSPORTE DE EMULSÃO ASFÁLTICA CATIONICA RR-1C","SERV DIF","T",3.4999980714285721,{"$f":"VLOOKUP(A66,'CPU-FORNEC'!A:J,9,0)","v":241.41},{"$f":"TRUNC(_xlfn.IFS(F66=\"SERV\",I66*(1+$L$5/100),F66=\"SERV DIF\",I66*(1+$L$6/100),F66=\"FORN\",I66*(1+$L$7/100)),2)","v":277.62},844.93,971.66]
["F5","5.5","CPU.11","ANP","AQUISIÇÃO DE CONCRETO ASFÁLTICO DE PETRÓLEO - CAP 50/70 - EXCLUSIVE TRANSPORTE","FORN","T",37.000000000000007,{"$f":"VLOOKUP(A67,'CPU-FORNEC'!A:J,9,0)","v":4719.13},{"$f":"TRUNC(_xlfn.IFS(F67=\"SERV\",I67*(1+$L$5/100),F67=\"SERV DIF\",I67*(1+$L$6/100),F67=\"FORN\",I67*(1+$L$7/100)),2)","v":5426.99},174607.81,200798.63]
["F6","5.6","CPU.12","CODEVASF","TRANSPORTE DE CONCRETO ASFÁLTICO DE PETRÓLEO - CAP 50/70","SERV DIF","T",37.000000000000007,{"$f":"VLOOKUP(A68,'CPU-FORNEC'!A:J,9,0)","v":357.93},{"$f":"TRUNC(_xlfn.IFS(F68=\"SERV\",I68*(1+$L$5/100),F68=\"SERV DIF\",I68*(1+$L$6/100),F68=\"FORN\",I68*(1+$L$7/100)),2)","v":411.61},13243.41,15229.57]
[{"$nulls":4},"TOTAL GERAL DA OBRA COM BDI ",{"$nulls":5},{"$f":"SUM(K10,K16,K25,K31,K62)","v":3746046.4099999992},{"$f":"SUM(L10,L16,L25,L31,L62)","v":4598888.0299999993}]

{"sheet":"CPU-SERV","index":1,"n_rows":2019,"n_cols":11,"rows_kept":2019,"cut":false,"hidden":false,"merged":[[1855,0,1892,0],[1856,2,1856,9],[1857,1,1858,3],[1857,4,1857,5],[1858,4,1858,5],[1859,2,1859,7],[1859,8,1859,9],[1860,1,1861,2],[1860,3,1861,3],[1860,4,1860,5],[1860,6,1860,7],[1865,7,1865,9],[1868,3,1868,7],[1869,3,1869,7],[1870,3,1870,7],[1873,7,1873,9],[1876,3,1876,7],[1877,7,1877,9],[1880,3,1880,7],[1882,8,1882,9],[1885,3,1885,7],[1886,1,1887,2],[1886,3,1887,3],[1886,4,1887,4],[1886,5,1886,7],[1886,9,1887,9],[1890,3,1890,7],[1891,5,1891,7],[1813,0,1853,0],[1814,2,1814,9],[1815,1,1816,3],[1815,4,1815,5],[1816,4,1816,5],[1817,2,1817,7],[1817,8,1817,9],[1818,1,1819,2],[1818,3,1819,3],[1818,4,1818,5],[1818,6,1818,7],[1823,7,1823,9],[1826,3,1826,7],[1827,3,1827,7],[1828,3,1828,7],[1831,7,1831,9],[1837,3,1837,7],[1838,7,1838,9],[1841,3,1841,7],[1843,8,1843,9],[1846,3,1846,7],[1847,1,1848,2],[1847,3,1848,3],[1847,4,1848,4],[1847,5,1847,7],[1847,9,1848,9],[1851,3,1851,7],[1852,5,1852,7],[1774,0,1811,0],[1775,2,1775,9],[1776,1,1777,3],[1776,4,1776,5],[1777,4,1777,5],[1778,2,1778,7],[1778,8,1778,9],[1779,1,1780,2],[1779,3,1780,3],[1779,4,1779,5],[1779,6,1779,7],[1784,7,1784,9],[1787,3,1787,7],[1788,3,1788,7],[1789,3,1789,7],[1792,7,1792,9],[1795,3,1795,7],[1796,7,1796,9],[1799,3,1799,7],[1801,8,1801,9],[1804,3,1804,7],[1805,1,1806,2],[1805,3,1806,3],[1805,4,1806,4],[1805,5,1805,7],[1805,9,1806,9],[1809,3,1809,7],[1810,5,1810,7],[1735,0,1772,0],[1736,2,1736,9],[1737,1,1738,3],[1737,4,1737,5],[1738,4,1738,5],[1739,2,1739,7],[1739,8,1739,9],[1740,1,1741,2],[1740,3,1741,3],[1740,4,1740,5],[1740,6,1740,7],[1745,7,1745,9],[1748,3,1748,7],[1749,3,1749,7],[1750,3,1750,7],[1753,7,1753,9],[1756,3,1756,7],[1757,7,1757,9],[1760,3,1760,7],[1762,8,1762,9],[1765,3,1765,7],[1766,1,1767,2],[1766,3,1767,3],[1766,4,1767,4],[1766,5,1766,7],[1766,9,1767,9],[1770,3,1770,7],[1771,5,1771,7],[1696,0,1733,0],[1697,2,1697,9],[1698,1,1699,3],[1698,4,1698,5],[1699,4,1699,5],[1700,2,1700,7],[1700,8,1700,9],[1701,1,1702,2],[1701,3,1702,3],[1701,4,1701,5],[1701,6,1701,7],[1706,7,1706,9],[1709,3,1709,7],[1710,3,1710,7],[1711,3,1711,7],[1714,7,1714,9],[1717,3,1717,7],[1718,7,1718,9],[1721,3,1721,7],[1723,8,1723,9],[1726,3,1726,7],[1727,1,1728,2],[1727,3,1728,3],[1727,4,1728,4],[1727,5,1727,7],[1727,9,1728,9],[1731,3,1731,7],[1732,5,1732,7],[1642,0,1694,0],[1643,2,1643,9],[1644,1,1645,3],[1644,4,1644,5],[1645,4,1645,5],[1646,2,1646,7],[1646,8,1646,9],[1647,1,1648,2],[1647,3,1648,3],[1647,4,1647,5],[1647,6,1647,7],[1652,7,1652,9],[1655,3,1655,7],[1656,3,1656,7],[1657,3,1657,7],[1660,7,1660,9],[1668,3,1668,7],[1669,7,1669,9],[1672,3,1672,7],[1674,8,1674,9],[1682,3,1682,7],[1683,1,1684,2],[1683,3,1684,3],[1683,4,1684,4],[1683,5,1683,7],[1683,9,1684,9],[1692,3,1692,7],[1693,5,1693,7],[1592,0,1640,0],[1593,2,1593,9],[1594,1,1595,3],[1594,4,1594,5],[1595,4,1595,5],[1596,2,1596,7],[1596,8,1596,9],[1597,1,1598,2],[1597,3,1598,3],[1597,4,1597,5],[1597,6,1597,7],[1604,7,1604,9],[1607,3,1607,7],[1608,3,1608,7],[1609,3,1609,7],[1612,7,1612,9],[1618,3,1618,7],[1619,7,1619,9],[1622,3,1622,7],[1624,8,1624,9],[1630,3,1630,7],[1631,1,1632,2],[1631,3,1632,3],[1631,4,1632,4],[1631,5,1631,7],[1631,9,1632,9],[1638,3,1638,7],[1639,5,1639,7],[1553,0,1590,0],[1554,2,1554,9],[1555,1,1556,3],[1555,4,1555,5],[1556,4,1556,5],[1557,2,1557,7],[1557,8,1557,9],[1558,1,1559,2],[1558,3,1559,3],[1558,4,1558,5],[1558,6,1558,7],[1563,7,1563,9],[1566,3,1566,7],[1567,3,1567,7],[1568,3,1568,7],[1571,7,1571,9],[1574,3,1574,7],[1575,7,1575,9],[1578,3,1578,7],[1580,8,1580,9],[1583,3,1583,7],[1584,1,1585,2],[1584,3,1585,3],[1584,4,1585,4],[1584,5,1584,7],[1584,9,1585,9],[1588,3,1588,7],[1589,5,1589,7],[1511,0,1551,0],[1512,2,1512,9],[1513,1,1514,3],[1513,4,1513,5],[1514,4,1514,5],[1515,2,1515,7],[1515,8,1515,9],[1516,1,1517,2],[1516,3,1517,3],[1516,4,1516,5],[1516,6,1516,7],[1521,7,1521,9],[1525,3,1525,7],[1526,3,1526,7],[1527,3,1527,7],[1530,7,1530,9],[1534,3,1534,7],[1535,7,1535,9],[1539,3,1539,7],[1541,8,1541,9],[1544,3,1544,7],[1545,1,1546,2],[1545,3,1546,3],[1545,4,1546,4],[1545,5,1545,7],[1545,9,1546,9],[1549,3,1549,7],[1550,5,1550,7],[1472,0,1509,0],[1473,2,1473,9],[1474,1,1475,3],[1474,4,1474,5],[1475,4,1475,5],[1476,2,1476,7],[1476,8,1476,9],[1477,1,1478,2],[1477,3,1478,3],[1477,4,1477,5],[1477,6,1477,7],[1482,7,1482,9],[1485,3,1485,7],[1486,3,1486,7],[1487,3,1487,7],[1490,7,1490,9],[1493,3,1493,7],[1494,7,1494,9],[1497,3,1497,7],[1499,8,1499,9],[1502,3,1502,7],[1503,1,1504,2],[1503,3,1504,3],[1503,4,1504,4],[1503,5,1503,7],[1503,9,1504,9],[1507,3,1507,7],[1508,5,1508,7],[1431,0,1470,0],[1432,2,1432,9],[1433,1,1434,3],[1433,4,1433,5],[1434,4,1434,5],[1435,2,1435,7],[1435,8,1435,9],[1436,1,1437,2],[1436,3,1437,3],[1436,4,1436,5],[1436,6,1436,7],[1441,7,1441,9],[1444,3,1444,7],[1445,3,1445,7],[1446,3,1446,7],[1449,7,1449,9],[1452,3,1452,7],[1453,7,1453,9],[1458,3,1458,7],[1460,8,1460,9],[1463,3,1463,7],[1464,1,1465,2],[1464,3,1465,3],[1464,4,1465,4],[1464,5,1464,7],[1464,9,1465,9],[1468,3,1468,7],[1469,5,1469,7],[1390,0,1429,0],[1391,2,1391,9],[1392,1,1393,3],[1392,4,1392,5],[1393,4,1393,5],[1394,2,1394,7],[1394,8,1394,9],[1395,1,1396,2],[1395,3,1396,3],[1395,4,1395,5],[1395,6,1395,7],[1400,7,1400,9],[1403,3,1403,7],[1404,3,1404,7],[1405,3,1405,7],[1408,7,1408,9],[1411,3,1411,7],[1412,7,1412,9],[1417,3,1417,7],[1419,8,1419,9],[1422,3,1422,7],[1423,1,1424,2],[1423,3,1424,3],[1423,4,1424,4],[1423,5,1423,7],[1423,9,1424,9],[1427,3,1427,7],[1428,5,1428,7],[1347,0,1388,0],[1348,2,1348,9],[1349,1,1350,3],[1349,4,1349,5],[1350,4,1350,5],[1351,2,1351,7],[1351,8,1351,9],[1352,1,1353,2],[1352,3,1353,3],[1352,4,1352,5],[1352,6,1352,7],[1357,7,1357,9],[1360,3,1360,7],[1361,3,1361,7],[1362,3,1362,7],[1365,7,1365,9],[1368,3,1368,7],[1369,7,1369,9],[1376,3,1376,7],[1378,8,1378,9],[1381,3,1381,7],[1382,1,1383,2],[1382,3,1383,3],[1382,4,1383,4],[1382,5,1382,7],[1382,9,1383,9],[1386,3,1386,7],[1387,5,1387,7],[1304,0,1345,0],[1305,2,1305,9],[1306,1,1307,3],[1306,4,1306,5],[1307,4,1307,5],[1308,2,1308,7],[1308,8,1308,9],[1309,1,1310,2],[1309,3,1310,3],[1309,4,1309,5],[1309,6,1309,7],[1314,7,1314,9],[1317,3,1317,7],[1318,3,1318,7],[1319,3,1319,7],[1322,7,1322,9],[1325,3,1325,7],[1326,7,1326,9],[1333,3,1333,7],[1335,8,1335,9],[1338,3,1338,7],[1339,1,1340,2],[1339,3,1340,3],[1339,4,1340,4],[1339,5,1339,7],[1339,9,1340,9],[1343,3,1343,7],[1344,5,1344,7],[1264,0,1302,0],[1265,2,1265,9],[1266,1,1267,3],[1266,4,1266,5],[1267,4,1267,5],[1268,2,1268,7],[1268,8,1268,9],[1269,1,1270,2],[1269,3,1270,3],[1269,4,1269,5],[1269,6,1269,7],[1274,7,1274,9],[1277,3,1277,7],[1278,3,1278,7],[1279,3,1279,7],[1282,7,1282,9],[1285,3,1285,7],[1286,7,1286,9],[1290,3,1290,7],[1292,8,1292,9],[1295,3,1295,7],[1296,1,1297,2],[1296,3,1297,3],[1296,4,1297,4],[1296,5,1296,7],[1296,9,1297,9],[1300,3,1300,7],[1301,5,1301,7],[1221,0,1262,0],[1222,2,1222,9],[1223,1,1224,3],[1223,4,1223,5],[1224,4,1224,5],[1225,2,1225,7],[1225,8,1225,9],[1226,1,1227,2],[1226,3,1227,3],[1226,4,1226,5],[1226,6,1226,7],[1231,7,1231,9],[1234,3,1234,7],[1235,3,1235,7],[1236,3,1236,7],[1239,7,1239,9],[1242,3,1242,7],[1243,7,1243,9],[1250,3,1250,7],[1252,8,1252,9],[1255,3,1255,7],[1256,1,1257,2],[1256,3,1257,3],[1256,4,1257,4],[1256,5,1256,7],[1256,9,1257,9],[1260,3,1260,7],[1261,5,1261,7],[1182,0,1219,0],[1183,2,1183,9],[1184,1,1185,3],[1184,4,1184,5],[1185,4,1185,5],[1186,2,1186,7],[1186,8,1186,9],[1187,1,1188,2],[1187,3,1188,3],[1187,4,1187,5],[1187,6,1187,7],[1192,7,1192,9],[1195,3,1195,7],[1196,3,1196,7],[1197,3,1197,7],[1200,7,1200,9],[1203,3,1203,7],[1204,7,1204,9],[1207,3,1207,7],[1209,8,1209,9],[1212,3,1212,7],[1213,1,1214,2],[1213,3,1214,3],[1213,4,1214,4],[1213,5,1213,7],[1213,9,1214,9],[1217,3,1217,7],[1218,5,1218,7],[1143,0,1180,0],[1144,2,1144,9],[1145,1,1146,3],[1145,4,1145,5],[1146,4,1146,5],[1147,2,1147,7],[1147,8,1147,9],[1148,1,1149,2],[1148,3,1149,3],[1148,4,1148,5],[1148,6,1148,7],[1153,7,1153,9],[1156,3,1156,7],[1157,3,1157,7],[1158,3,1158,7],[1161,7,1161,9],[1164,3,1164,7],[1165,7,1165,9],[1168,3,1168,7],[1170,8,1170,9],[1173,3,1173,7],[1174,1,1175,2],[1174,3,1175,3],[1174,4,1175,4],[1174,5,1174,7],[1174,9,1175,9],[1178,3,1178,7],[1179,5,1179,7],[1104,0,1141,0],[1105,2,1105,9],[1106,1,1107,3],[1106,4,1106,5],[1107,4,1107,5],[1108,2,1108,7],[1108,8,1108,9],[1109,1,1110,2],[1109,3,1110,3],[1109,4,1109,5],[1109,6,1109,7],[1114,7,1114,9],[1117,3,1117,7],[1118,3,1118,7],[1119,3,1119,7],[1122,7,1122,9],[1125,3,1125,7],[1126,7,1126,9],[1129,3,1129,7],[1131,8,1131,9],[1134,3,1134,7],[1135,1,1136,2],[1135,3,1136,3],[1135,4,1136,4],[1135,5,1135,7],[1135,9,1136,9],[1139,3,1139,7],[1140,5,1140,7],[1056,0,1102,0],[1057,2,1057,9],[1058,1,1059,3],[1058,4,1058,5],[1059,4,1059,5],[1060,2,1060,7],[1060,8,1060,9],[1061,1,1062,2],[1061,3,1062,3],[1061,4,1061,5],[1061,6,1061,7],[1066,7,1066,9],[1069,3,1069,7],[1070,3,1070,7],[1071,3,1071,7],[1074,7,1074,9],[1080,3,1080,7],[1081,7,1081,9],[1084,3,1084,7],[1086,8,1086,9],[1092,3,1092,7],[1093,1,1094,2],[1093,3,1094,3],[1093,4,1094,4],[1093,5,1093,7],[1093,9,1094,9],[1100,3,1100,7],[1101,5,1101,7],[1014,0,1054,0],[1015,2,1015,9],[1016,1,1017,3],[1016,4,1016,5],[1017,4,1017,5],[1018,2,1018,7],[1018,8,1018,9],[1019,1,1020,2],[1019,3,1020,3],[1019,4,1019,5],[1019,6,1019,7],[1025,7,1025,9],[1028,3,1028,7],[1029,3,1029,7],[1030,3,1030,7],[1033,7,1033,9],[1037,3,1037,7],[1038,7,1038,9],[1041,3,1041,7],[1043,8,1043,9],[1047,3,1047,7],[1048,1,1049,2],[1048,3,1049,3],[1048,4,1049,4],[1048,5,1048,7],[1048,9,1049,9],[1052,3,1052,7],[1053,5,1053,7],[975,0,1012,0],[976,2,976,9],[977,1,978,3],[977,4,977,5],[978,4,978,5],[979,2,979,7],[979,8,979,9],[980,1,981,2],[980,3,981,3],[980,4,980,5],[980,6,980,7],[985,7,985,9],[988,3,988,7],[989,3,989,7],[990,3,990,7],[993,7,993,9],[996,3,996,7],[997,7,997,9],[1000,3,1000,7],[1002,8,1002,9],[1005,3,1005,7],[1006,1,1007,2],[1006,3,1007,3],[1006,4,1007,4],[1006,5,1006,7],[1006,9,1007,9],[1010,3,1010,7],[1011,5,1011,7],[936,0,973,0],[937,2,937,9],[938,1,939,3],[938,4,938,5],[939,4,939,5],[940,2,940,7],[940,8,940,9],[941,1,942,2],[941,3,942,3],[941,4,941,5],[941,6,941,7],[946,7,946,9],[949,3,949,7],[950,3,950,7],[951,3,951,7],[954,7,954,9],[957,3,957,7],[958,7,958,9],[961,3,961,7],[963,8,963,9],[966,3,966,7],[967,1,968,2],[967,3,968,3],[967,4,968,4],[967,5,967,7],[967,9,968,9],[971,3,971,7],[972,5,972,7],[892,3,892,7],[893,5,893,7],[896,0,934,0],[897,2,897,9],[898,1,899,3],[898,4,898,5],[899,4,899,5],[900,2,900,7],[900,8,900,9],[901,1,902,2],[901,3,902,3],[901,4,901,5],[901,6,901,7],[906,7,906,9],[909,3,909,7],[910,3,910,7],[911,3,911,7],[914,7,914,9],[918,3,918,7],[919,7,919,9],[922,3,922,7],[924,8,924,9],[927,3,927,7],[928,1,929,2],[928,3,929,3],[928,4,929,4],[928,5,928,7],[928,9,929,9],[932,3,932,7],[933,5,933,7],[389,7,389,9],[393,3,393,7],[394,7,394,9],[397,3,397,7],[399,8,399,9],[402,3,402,7],[403,1,404,2],[403,3,404,3],[403,4,404,4],[403,5,403,7],[403,9,404,9],[407,3,407,7],[408,5,408,7],[855,0,894,0],[856,2,856,9],[857,1,858,3],[857,4,857,5],[858,4,858,5],[859,2,859,7],[859,8,859,9],[860,1,861,2],[860,3,861,3],[860,4,860,5],[860,6,860,7],[865,7,865,9],[869,3,869,7],[870,3,870,7],[871,3,871,7],[874,7,874,9],[878,3,878,7],[879,7,879,9],[644,3,644,7],[243,0,283,0],[244,2,244,9],[245,1,246,3],[245,4,245,5],[246,4,246,5],[247,2,247,7],[247,8,247,9],[248,1,249,2],[248,3,249,3],[248,4,248,5],[248,6,248,7],[256,7,256,9],[259,3,259,7],[260,3,260,7],[261,3,261,7],[264,7,264,9],[267,3,267,7],[268,7,268,9],[271,3,271,7],[273,8,273,9],[276,3,276,7],[277,1,278,2],[277,3,278,3],[277,4,278,4],[277,5,277,7],[277,9,278,9],[281,3,281,7],[282,5,282,7],[646,8,646,9],[649,3,649,7],[650,1,651,2],[650,3,651,3],[650,4,651,4],[650,5,650,7],[650,9,651,9],[654,3,654,7],[655,5,655,7],[620,2,620,9],[621,1,622,3],[621,4,621,5],[622,4,622,5],[623,2,623,7],[623,8,623,9],[624,1,625,2],[624,3,625,3],[624,4,624,5],[624,6,624,7],[629,7,629,9],[632,3,632,7],[633,3,633,7],[634,3,634,7],[637,7,637,9],[640,3,640,7],[641,7,641,9],[7,13,7,15],[15,11,15,13],[27,8,27,9],[21,3,21,7],[4,2,4,7],[4,8,4,9],[5,1,6,2],[5,3,6,3],[5,4,5,5],[5,6,5,7],[529,0,578,0],[530,2,530,9],[531,1,532,3],[531,4,531,5],[532,4,532,5],[533,2,533,7],[533,8,533,9],[534,1,535,2],[534,3,535,3],[534,4,534,5],[534,6,534,7],[542,7,542,9],[544,3,544,7],[545,3,545,7],[546,3,546,7],[549,7,549,9],[557,3,557,7],[39,0,81,0],[40,2,40,9],[619,0,656,0],[41,1,42,3],[41,4,41,5],[42,4,42,5],[43,2,43,7],[43,8,43,9],[44,1,45,2],[0,0,37,0],[3,4,3,5],[0,11,0,12],[1,11,1,12],[2,4,2,5],[1,2,1,9],[2,1,3,3],[31,3,32,3],[31,4,32,4],[31,5,31,7],[31,9,32,9],[35,3,35,7],[36,5,36,7],[10,7,10,9],[13,3,13,7],[14,3,14,7],[15,3,15,7],[18,7,18,9],[30,3,30,7],[31,1,32,2],[22,7,22,9],[25,3,25,7],[2,10,2,11],[79,3,79,7],[80,5,80,7],[85,4,85,5],[74,3,74,7],[75,1,76,2],[75,3,76,3],[75,4,76,4],[75,5,75,7],[75,9,76,9],[57,3,57,7],[60,7,60,9],[63,3,63,7],[64,7,64,9],[69,3,69,7],[71,8,71,9],[44,3,45,3],[44,4,44,5],[44,6,44,7],[49,7,49,9],[55,3,55,7],[56,3,56,7],[114,1,115,2],[114,3,115,3],[114,4,115,4],[114,5,114,7],[114,9,115,9],[118,3,118,7],[93,7,93,9],[98,3,98,7],[101,7,101,9],[104,3,104,7],[105,7,105,9],[108,3,108,7],[83,0,120,0],[84,2,84,9],[85,1,86,3],[86,4,86,5],[87,2,87,7],[87,8,87,9],[88,1,89,2],[110,8,110,9],[113,3,113,7],[96,3,96,7],[97,3,97,7],[88,3,89,3],[88,4,88,5],[88,6,88,7],[136,3,136,7],[137,3,137,7],[140,7,140,9],[145,3,145,7],[146,7,146,9],[149,3,149,7],[127,1,128,2],[127,3,128,3],[127,4,127,5],[127,6,127,7],[132,7,132,9],[135,3,135,7],[119,5,119,7],[122,0,161,0],[123,2,123,9],[124,1,125,3],[124,4,124,5],[125,4,125,5],[126,2,126,7],[126,8,126,9],[159,3,159,7],[160,5,160,7],[179,3,179,7],[180,3,180,7],[183,7,183,9],[186,3,186,7],[187,7,187,9],[167,8,167,9],[168,1,169,2],[168,3,169,3],[168,4,168,5],[168,6,168,7],[173,7,173,9],[164,2,164,9],[165,1,166,3],[165,4,165,5],[166,4,166,5],[167,2,167,7],[151,8,151,9],[154,3,154,7],[155,1,156,2],[155,3,156,3],[155,4,156,4],[155,5,155,7],[155,9,156,9],[204,0,241,0],[205,2,205,9],[206,1,207,3],[206,4,206,5],[207,4,207,5],[208,2,208,7],[190,3,190,7],[192,8,192,9],[195,3,195,7],[196,1,197,2],[196,3,197,3],[196,4,197,4],[196,5,196,7],[196,9,197,9],[229,3,229,7],[231,8,231,9],[234,3,234,7],[235,1,236,2],[235,3,236,3],[235,4,236,4],[235,5,235,7],[235,9,236,9],[217,3,217,7],[218,3,218,7],[208,8,208,9],[209,1,210,2],[209,3,210,3],[209,4,209,5],[163,0,202,0],[200,3,200,7],[201,5,201,7],[178,3,178,7],[289,8,289,9],[290,1,291,2],[290,3,291,3],[290,4,290,5],[209,6,209,7],[214,7,214,9],[239,3,239,7],[240,5,240,7],[219,3,219,7],[222,7,222,9],[225,3,225,7],[226,7,226,9],[328,0,369,0],[329,2,329,9],[330,1,331,3],[330,4,330,5],[331,4,331,5],[332,2,332,7],[367,3,367,7],[368,5,368,7],[285,0,326,0],[286,2,286,9],[287,1,288,3],[287,4,287,5],[288,4,288,5],[289,2,289,7],[314,3,314,7],[316,8,316,9],[319,3,319,7],[320,1,321,2],[320,3,321,3],[320,4,321,4],[320,5,320,7],[320,9,321,9],[302,3,302,7],[303,3,303,7],[290,6,290,7],[299,7,299,9],[345,3,345,7],[346,3,346,7],[347,3,347,7],[350,7,350,9],[353,3,353,7],[354,7,354,9],[332,8,332,9],[333,1,334,2],[333,3,334,3],[333,4,333,5],[333,6,333,7],[342,7,342,9],[324,3,324,7],[325,5,325,7],[304,3,304,7],[307,7,307,9],[310,3,310,7],[311,7,311,9],[411,0,448,0]],"merged_total":1380,"flags":["merged_cut"]}
[1,"1ª/GRD",{"$nulls":8},{"$f":"J37","v":24209.41}]
[null,"OBRA:"," DRENAGEM E PAVIMENTAÇÃO - VIAS INTERNAS DO PARQUE DE EXPOSIÇÕES E RUA BOM JARDIM (BAIRRO SANTO ANTÔNIO) - SERRO-MG"]
[null,"Custo Unitário de Referência",null,null,"Minas Gerais"]
[{"$nulls":4}," Outubro/2024 ",null,null,"Produção da equipe ",0.5,{"$f":"VLOOKUP(A1,ORÇAMENTO!$A$10:$L$69,7,1)","v":"GL"}]
[null,"CPU.1","MOBILIZAÇÃO E DESMOBILIZAÇÃO",{"$nulls":5},"Valores em reais (R$)"]
[null,"A - EQUIPAMENTOS",null,"Quantidade","Utilização",null,"Custo Horário",null,null,"Custo"]
[{"$nulls":4},"Operativa","Improdutiva","Produtivo","Improdutivo",null,"Horário Total"]
[null,"E9687","Caminhão carroceria com capacidade de 5 t - 115 kW",8,0.6,0.4,142.93629999999999,55.767499999999998,null,{"$f":"D8*(E8*G8+F8*H8)","v":864.55023999999992}]
[null,"E9575","Caminhão basculante com caçamba estanque com capacidade de 14 m³ - 210 kW",8,1,0,303.24970000000002,88.600399999999993,null,{"$f":"D9*(E9*G9+F9*H9)","v":2425.9976000000001}]
[{"$nulls":7},"Custo horário total de equipamentos",null,{"$f":"SUM(J8:J9)","v":3290.5478400000002}]
[null,"B - MÃO DE OBRA",null,"Quantidade","Unidade",null,"Custo Horário","Custo Horário Total"]
[null,"P9824","Servente",16,"h",null,20.631399999999999,null,null,{"$f":"D12*G12","v":330.10239999999999}]
[{"$nulls":9},{"$f":"D13*G13","v":0}]
[null,null,null,"Custo horário total de mão de obra",{"$nulls":5},{"$f":"SUM(J12:J13)","v":330.10239999999999}]
[null,null,null,"Custo horário total de execução",{"$nulls":5},{"$f":"J10+J14","v":3620.6502399999999}]
[null,null,null,"Custo unitário de execução",{"$nulls":5},{"$f":"J15/I4","v":7241.3004799999999}]
[{"$nulls":7},"Custo do FIC",null,0]
[{"$nulls":7},"Custo do FIT",null,0]
[null,"C - MATERIAL",null,"Quantidade","Unidade",null,"Preço Unitário","Custo Unitário"]
[null,"-",0,null,0,null,0,null,null,{"$f":"D20*G20","v":0}]
[null,"-",0,null,0,null,0,null,null,{"$f":"D21*G21","v":0}]
[null,null,null,"Custo unitário total de material",{"$nulls":5},{"$f":"SUM(J20:J21)","v":0}]
[null,"D - ATIVIDADES AUXILIARES",null,"Quantidade","Unidade",null,"Custo Unitário","Custo Unitário"]
[null,5914640,"Transporte com cavalo mecânico com semirreboque com capacidade de 30 t - rodovia pavimentada",30300.2,"tkm",null,0.56000000000000005,null,null,{"$f":"D24*G24","v":16968.112000000001}]
[null,"-",0,0,0,null,0,null,null,{"$f":"D25*G25","v":0}]
[null,null,null,"Custo total de atividades auxiliares",{"$nulls":5},{"$f":"SUM(J24:J25)","v":16968.112000000001}]
[{"$nulls":7},"Subtotal",null,{"$f":"J16+J22+J26+J17+J18","v":24209.412479999999}]
[null,"E - TEMPO FIXO",null,"Código","Quantidade","Unidade",null,"Custo Unitário","Custo Unitário"]
[null,"-",0,"-",null,0,null,0,null,{"$f":"ROUNDDOWN(E29*H29,4)","v":0}]
[null,"-",0,"-",null,0,null,0,null,{"$f":"ROUNDDOWN(E30*H30,4)","v":0}]
[null,null,null,"Custo unitário total de tempo fixo",{"$nulls":5},{"$f":"SUM(J29:J30)","v":0}]
[null,"F - MOMENTO DE TRANSPORTE",null,"Quantidade","Unidade","DMT",null,null,null,"Custo Unitário"]
[{"$nulls":5},"LN","RP","P"]
[null,"-",0,null,"tkm"]
[null,"-",0,null,"tkm"]
[null,null,null,"Custo unitário total de transporte"]
[{"$nulls":5},"Custo unitário direto total",null,null,null,{"$f":"TRUNC(J27+J31,2)","v":24209.41}]
[null,"Obs."]
[]
[{"$f":"A1+1","v":2},"1ª/GRD",{"$nulls":8},{"$f":"J81","v":199922.17}]
[null,"OBRA:"," DRENAGEM E PAVIMENTAÇÃO - VIAS INTERNAS DO PARQUE DE EXPOSIÇÕES E RUA BOM JARDIM (BAIRRO SANTO ANTÔNIO) - SERRO-MG"]
[null,"Custo Unitário de Referência",null,null,"Minas Gerais"]
[{"$nulls":4}," Outubro/2024 ",null,null,"Produção da equipe ",0.1111111111111111,{"$f":"VLOOKUP(A40,ORÇAMENTO!$A$10:$L$69,7,1)","v":"GL"},"9 MESES"]
[null,"CPU.2","ADMINISTRAÇÃO LOCAL ",{"$nulls":5},"Valores em reais (R$)"]
[null,"A - EQUIPAMENTOS",null,"Quantidade","Utilização",null,"Custo Horário",null,null,"Custo"]
[{"$nulls":4},"Operativa","Improdutiva","Produtivo","Improdutivo",null,"Horário Total"]
[null,"-",0,null,null,null,0,0,null,{"$f":"D47*(E47*G47+F47*H47)","v":0}]
[null,"-",0,null,null,null,0,0,null,{"$f":"D48*(E48*G48+F48*H48)","v":0}]
[{"$nulls":7},"Custo horário total de equipamentos",null,{"$f":"SUM(J47:J48)","v":0}]
[null,"B - MÃO DE OBRA",null,"Quantidade","Unidade",null,"Custo Horário","Custo Horário Total"]
[null,"P9812","Engenheiro",0.19903345264681976,"mês",null,25688.310600000001,null,null,{"$f":"D51*G51","v":5112.8331513818985},{"$f":"ORÇAMENTO!L69","v":4598888.0299999993}]
[null,"P9840","Encarregado geral",1,"mês",null,9786.5214749999996,null,null,{"$f":"D52*G52","v":9786.5214749999996}]
[null,"P9876","Técnico de segurança do trabalho",0.5,"mês",null,5758.8393750000005,null,null,{"$f":"D53*G53","v":2879.4196875000002}]
[null,"P9858","Laboratorista",0.5,"mês",null,4732.1862000000001,null,null,{"$f":"D54*G54","v":2366.0931}]
[null,"P9806","Auxiliar administrativo",0.5,"mês",null,3275.7017999999998,null,null,{"$f":"D55*G55","v":1637.8508999999999}]
[null,null,null,"Custo horário total de mão de obra",{"$nulls":5},{"$f":"SUM(J51:J55)","v":21782.718313881898}]
[null,null,null,"Custo horário total de execução",{"$nulls":5},{"$f":"J49+J56","v":21782.718313881898}]
[null,null,null,"Custo unitário de execução",{"$nulls":5},{"$f":"J57/I43","v":196044.46482493708}]
[{"$nulls":7},"Custo do FIC",null,"-"]
[{"$nulls":7},"Custo do FIT",null,"-"]
[null,"C - MATERIAL",null,"Quantidade","Unidade",null,"Preço Unitário","Custo Unitário"]
[null,"-",0,0,0,null,0,null,null,{"$f":"D62*G62","v":0}]
[null,"-",0,0,0,null,0,null,null,{"$f":"D63*G63","v":0}]
[null,null,null,"Custo unitário total de material",{"$nulls":5},{"$f":"SUM(J62:J63)","v":0}]
[null,"D - ATIVIDADES AUXILIARES",null,"Quantidade","Unidade",null,"Custo Unitário","Custo Unitário"]
[null,14250,"Energia Elétrica",540,"kwh",null,0.95,null,null,{"$f":"D66*G66","v":513}]
[null,44480,"Tarifa A - Água e Esgoto",45,"m³",null,17.97,null,null,{"$f":"D67*G67","v":808.65}]
[null,5212560,"Placa de advertência para sinalização de obras montada em suporte metálico móvel, lado 1,00 m - utilização de 600 ciclos - fornecimento, 01 implantação e 01 retirada diária",528,"un.dia",null,3.82,null,null,{"$f":"D68*G68","v":2016.9599999999998}]
[null,"Cotação","Telefone",9,"mês",null,59.9,null,null,{"$f":"D69*G69","v":539.1}]
[null,null,null,"Custo total de atividades auxiliares",{"$nulls":5},{"$f":"SUM(J66:J69)","v":3877.7099999999996}]
[{"$nulls":7},"Subtotal",null,{"$f":"J58+J64+J70","v":199922.17482493707}]
[null,"E - TEMPO FIXO",null,"Código","Quantidade","Unidade",null,"Custo Unitário","Custo Unitário"]
[null,"-",0,"-",0,"t",null,0,null,{"$f":"ROUNDDOWN(E73*H73,4)","v":0}]
[null,"-",0,"-",0,"t",null,0,null,{"$f":"ROUNDDOWN(E74*H74,4)","v":0}]
[null,null,null,"Custo unitário total de tempo fixo",{"$nulls":5},{"$f":"SUM(J73:J74)","v":0}]
[null,"F - MOMENTO DE TRANSPORTE",null,"Quantidade","Unidade","DMT",null,null,null,"Custo Unitário"]
[{"$nulls":5},"LN","RP","P"]
[null,"-",0,null,"tkm"]
[null,"-",0,null,"tkm"]
[null,null,null,"Custo unitário total de transporte"]
[{"$nulls":5},"Custo unitário direto total",null,null,null,{"$f":"TRUNC(J71+J75,2)","v":199922.17}]
[null,"Obs."]
[]
[{"$f":"A40+1","v":3},"1ª/GRD",{"$nulls":8},{"$f":"J120","v":20500.740000000002}]
[null,"OBRA:"," DRENAGEM E PAVIMENTAÇÃO - VIAS INTERNAS DO PARQUE DE EXPOSIÇÕES E RUA BOM JARDIM (BAIRRO SANTO ANTÔNIO) - SERRO-MG"]
[null,"Custo Unitário de Referência",null,null,"Minas Gerais"]
[{"$nulls":4}," Outubro/2024 ",null,null,"Produção da equipe ",1,{"$f":"VLOOKUP(A84,ORÇAMENTO!$A$10:$L$69,7,1)","v":"GL"}]
[null,"CPU.3","CANTEIRO DE OBRAS ",{"$nulls":5},"Valores em reais (R$)"]
[null,"A - EQUIPAMENTOS",null,"Quantidade","Utilização",null,"Custo Horário",null,null,"Custo"]
[{"$nulls":4},"Operativa","Improdutiva","Produtivo","Improdutivo",null,"Horário Total"]
[null,"-",0,null,null,null,0,0,null,{"$f":"D91*(E91*G91+F91*H91)","v":0}]
[null,"-",0,null,null,null,0,0,null,{"$f":"D92*(E92*G92+F92*H92)","v":0}]
[{"$nulls":7},"Custo horário total de equipamentos",null,{"$f":"SUM(J91:J92)","v":0}]
[null,"B - MÃO DE OBRA",null,"Quantidade","Unidade",null,"Custo Horário","Custo Horário Total"]
[null,"P9824","Servente",8,"h",null,20.631399999999999,null,null,{"$f":"D95*G95","v":165.05119999999999}]
[null,"P9808","Carpinteiro",8,"h",null,25.901299999999999,null,null,{"$f":"D96*G96","v":207.21039999999999}]
[null,null,null,"Custo horário total de mão de obra",{"$nulls":5},{"$f":"SUM(J95:J96)","v":372.26159999999999}]
[null,null,null,"Custo horário total de execução",{"$nulls":5},{"$f":"J93+J97","v":372.26159999999999}]
[null,null,null,"Custo unitário de execução",{"$nulls":5},{"$f":"J98/I87","v":372.26159999999999}]
[{"$nulls":7},"Custo do FIC",null,"-"]
[{"$nulls":7},"Custo do FIT",null,"-"]
[null,"C - MATERIAL",null,"Quantidade","Unidade",null,"Preço Unitário","Custo Unitário"]
[null,"M0053","Tela plástica em polipropileno na cor laranja para tapume - L = 1,2 m",100,"m",null,1.8223,null,null,{"$f":"D103*G103","v":182.23}]
[null,"-",0,0,0,null,0,null,null,{"$f":"D104*G104","v":0}]
[null,null,null,"Custo unitário total de material",{"$nulls":5},{"$f":"SUM(J103:J104)","v":182.23}]
[null,"D - ATIVIDADES AUXILIARES",null,"Quantidade","Unidade",null,"Custo Unitário","Custo Unitário"]
[null,10775,"Locação de container 2,30 X 6,00 m, alt. 2,50 m, com 1 sanitário, para escritório, completo, sem divisórias internas",9,"mês",null,985,null,null,{"$f":"D107*G107","v":8865}]
[null,10779,"Locação de container 2,30 X 4,30 m, alt. 2,50 M, p/ sanitário, c/ 5 bacias, 1 lavatório e 4 mictórios",9,"mês",null,1231.25,null,null,{"$f":"D108*G108","v":11081.25}]
[null,null,null,"Custo total de atividades auxiliares",{"$nulls":5},{"$f":"SUM(J107:J108)","v":19946.25}]
[{"$nulls":7},"Subtotal",null,{"$f":"J99+J105+J109","v":20500.741600000001}]
[null,"E - TEMPO FIXO",null,"Código","Quantidade","Unidade",null,"Custo Unitário","Custo Unitário"]
[null,"-",0,"-",0,"t",null,0,null,{"$f":"ROUNDDOWN(E112*H112,4)","v":0}]
[null,"-",0,"-",0,"t",null,0,null,{"$f":"ROUNDDOWN(E113*H113,4)","v":0}]
[null,null,null,"Custo unitário total de tempo fixo",{"$nulls":5},{"$f":"SUM(J112:J113)","v":0}]
[null,"F - MOMENTO DE TRANSPORTE",null,"Quantidade","Unidade","DMT",null,null,null,"Custo Unitário"]
[{"$nulls":5},"LN","RP","P"]
[null,"-",0,0,"tkm"]
[null,"-",0,0,"tkm"]
[null,null,null,"Custo unitário total de transporte"]
[{"$nulls":5},"Custo unitário direto total",null,null,null,{"$f":"TRUNC(J110+J114,2)","v":20500.740000000002}]
[null,"Obs."]
[]
[{"$f":"A84+1","v":4},"1ª/GRD",{"$nulls":8},{"$f":"J161","v":349.69}]
[null,"OBRA:"," DRENAGEM E PAVIMENTAÇÃO - VIAS INTERNAS DO PARQUE DE EXPOSIÇÕES E RUA BOM JARDIM (BAIRRO SANTO ANTÔNIO) - SERRO-MG"]
[null,"Custo Unitário de Referência",null,null,"Minas Gerais"]
[{"$nulls":4}," Outubro/2024 ",null,null,"Produção da equipe ",1,{"$f":"VLOOKUP(A123,ORÇAMENTO!$A$10:$L$69,7,1)","v":"M2"}]
[null,103689,"PLACA DE OBRA EM CHAPA DE AÇO GALVANIZADO",{"$nulls":5},"Valores em reais (R$)"]
[null,"A - EQUIPAMENTOS",null,"Quantidade","Utilização",null,"Custo Horário",null,null,"Custo"]
[{"$nulls":4},"Operativa","Improdutiva","Produtivo","Improdutivo",null,"Horário Total"]
[null,"-",0,null,null,null,0,0,null,{"$f":"D130*(E130*G130+F130*H130)","v":0}]
[null,"-",0,null,null,null,0,0,null,{"$f":"D131*(E131*G131+F131*H131)","v":0}]
[{"$nulls":7},"Custo horário total de equipamentos",null,{"$f":"SUM(J130:J131)","v":0}]
[null,"B - MÃO DE OBRA",null,"Quantidade","Unidade",null,"Custo Horário","Custo Horário Total"]
[null,"P9824","Servente",1.1186,"h",null,20.631399999999999,null,null,{"$f":"D134*G134","v":23.07828404}]
[null,"P9808","Carpinteiro",0.37290000000000001,"h",null,25.901299999999999,null,null,{"$f":"D135*G135","v":9.6585947700000006}]
[null,null,null,"Custo horário total de mão de obra",{"$nulls":5},{"$f":"SUM(J134:J135)","v":32.73687881}]
[null,null,null,"Custo horário total de execução",{"$nulls":5},{"$f":"J132+J136","v":32.73687881}]
[null,null,null,"Custo unitário de execução",{"$nulls":5},{"$f":"J137/I126","v":32.73687881}]
[{"$nulls":7},"Custo do FIC",null,"-"]
[{"$nulls":7},"Custo do FIT",null,"-"]
[null,"C - MATERIAL",null,"Quantidade","Unidade",null,"Preço Unitário","Custo Unitário"]
[null,"M1358","Sarrafo em madeira de terceira - E = 2,5 cm e L = 5 cm",6.4165999999999999,"m",null,2.0499999999999998,null,null,{"$f":"D142*G142","v":13.154029999999999}]
[null,"M1205","Prego de ferro",2.4500000000000001E-2,"kg",null,16.54,null,null,{"$f":"D143*G143","v":0.40522999999999998}]
[null,"M0998","Madeira estrutural de eucalipto",2.2608E-2,"m³",null,2361.8182000000002,null,null,{"$f":"D144*G144","v":53.395985865600004}]
[null,4813,"Placa de obra (para construção civil) em chapa galvanizada *N. 22*, adesivada, de *2,4 X 1,2* m (sem postes para fixação)",1,"m²",null,250,null,null,{"$f":"D145*G145","v":250}]
[null,null,null,"Custo unitário total de material",{"$nulls":5},{"$f":"SUM(J142:J145)","v":316.95524586559998}]
[null,"D - ATIVIDADES AUXILIARES",null,"Quantidade","Unidade",null,"Custo Unitário","Custo Unitário"]
[null,"-",0,0,0,null,0,null,null,{"$f":"D148*G148","v":0}]
[null,"-",0,0,0,null,0,null,null,{"$f":"D149*G149","v":0}]
[null,null,null,"Custo total de atividades auxiliares",{"$nulls":5},{"$f":"SUM(J148:J149)","v":0}]
[{"$nulls":7},"Subtotal",null,{"$f":"J138+J146+J150","v":349.69212467559998}]
[null,"E - TEMPO FIXO",null,"Código","Quantidade","Unidade",null,"Custo Unitário","Custo Unitário"]
[null,"-",0,"-",0,"t",null,0,null,{"$f":"ROUNDDOWN(E153*H153,4)","v":0}]
[null,"-",0,"-",0,"t",null,0,null,{"$f":"ROUNDDOWN(E154*H154,4)","v":0}]
[null,null,null,"Custo unitário total de tempo fixo",{"$nulls":5},{"$f":"SUM(J153:J154)","v":0}]
[null,"F - MOMENTO DE TRANSPORTE",null,"Quantidade","Unidade","DMT",null,null,null,"Custo Unitário"]
[{"$nulls":5},"LN","RP","P"]
[null,"-",0,0,"tkm"]
[null,"-",0,0,"tkm"]
[null,null,null,"Custo unitário total de transporte"]
[{"$nulls":5},"Custo unitário direto total",null,null,null,{"$f":"TRUNC(J151+J155,2)","v":349.69}]
[null,"Obs."]
[]
[6,"1ª/GRD",{"$nulls":8},{"$f":"J202","v":0.48}]
[null,"OBRA:"," DRENAGEM E PAVIMENTAÇÃO - VIAS INTERNAS DO PARQUE DE EXPOSIÇÕES E RUA BOM JARDIM (BAIRRO SANTO ANTÔNIO) - SERRO-MG"]
[null,"Custo Unitário de Referência",null,null,"Minas Gerais"]
[{"$nulls":4}," Outubro/2024 ",null,null,"Produção da equipe ",1,{"$f":"VLOOKUP(A164,ORÇAMENTO!$A$10:$L$69,7,1)","v":"M2"}]
[null,78472,"SERVIÇOS TOPOGRÁFICOS PARA PAVIMENTAÇÃO, INCLUSIVE LEVANTAMENTO PLANIALTIMÉTRICO CADASTRAL, GERAÇÃO DE NOTAS DE SERVIÇO, SEÇÕES TRANSVERSAIS E GREIDE, ESTAQUEAMENTO E ACOMPANHAMENTO EXECUTIVO",{"$nulls":5},"Valores em reais (R$)"]
[null,"A - EQUIPAMENTOS",null,"Quantidade","Utilização",null,"Custo Horário",null,null,"Custo"]
[{"$nulls":4},"Operativa","Improdutiva","Produtivo","Improdutivo",null,"Horário Total"]
[null,92145,"Caminhonete cabine simples com motor 1.6 flex, câmbio manual, potência 101/104 cv, 2 portas",5.0000000000000001E-4,1,0,76.5,0,null,{"$f":"D171*(E171*G171+F171*H171)","v":3.8249999999999999E-2}]
[null,"-",0,0,1,0,0,0,null,{"$f":"D172*(E172*G172+F172*H172)","v":0}]
[{"$nulls":7},"Custo horário total de equipamentos",null,{"$f":"SUM(J171:J172)","v":3.8249999999999999E-2}]
[null,"B - MÃO DE OBRA",null,"Quantidade","Unidade",null,"Custo Horário","Custo Horário Total"]
[null,"P9949","Topógrafo",1.590909090909091E-5,"mês",null,6687.3099000000002,27.863791250000002,null,{"$f":"D175*G175","v":0.10638902113636364}]
[null,"P9950","Auxiliar de topografia",1.590909090909091E-5,"mês",null,6143.6953000000003,22.75442703703704,null,{"$f":"D176*G176","v":9.7740607045454564E-2}]
[null,"P9824","Servente",7.4999999999999997E-3,"h",null,20.631399999999999,8.5964166666666661E-2,null,{"$f":"D177*G177","v":0.1547355}]
[null,"P9848","Desenhista",9.090909090909091E-6,"mês",null,9985.8701999999994,36.984704444444439,null,{"$f":"D178*G178","v":9.0780638181818182E-2}]
[null,null,null,"Custo horário total de mão de obra",{"$nulls":5},{"$f":"SUM(J175:J178)","v":0.4496457663636364}]
[null,null,null,"Custo horário total de execução",{"$nulls":5},{"$f":"J173+J179","v":0.48789576636363641}]
[null,null,null,"Custo unitário de execução",{"$nulls":5},{"$f":"J180/I167","v":0.48789576636363641}]
[{"$nulls":7},"Custo do FIC",null,"-"]
[{"$nulls":7},"Custo do FIT",null,"-"]
[null,"C - MATERIAL",null,"Quantidade","Unidade",null,"Preço Unitário","Custo Unitário"]
[null,"-",0,0,0,null,0,null,null,{"$f":"D185*G185","v":0}]
[null,"-",0,0,0,null,0,null,null,{"$f":"D186*G186","v":0}]
[null,null,null,"Custo unitário total de material",{"$nulls":5},{"$f":"SUM(J185:J186)","v":0}]
[null,"D - ATIVIDADES AUXILIARES",null,"Quantidade","Unidade",null,"Custo Unitário","Custo Unitário"]
[null,"-",0,0,0,null,0,null,null,{"$f":"D189*G189","v":0}]
[null,"-",0,0,0,null,0,null,null,{"$f":"D190*G190","v":0}]
[null,null,null,"Custo total de atividades auxiliares",{"$nulls":5},{"$f":"SUM(J189:J190)","v":0}]
[{"$nulls":7},"Subtotal",null,{"$f":"J181+J187+J191","v":0.48789576636363641}]
[null,"E - TEMPO FIXO",null,"Código","Quantidade","Unidade",null,"Custo Unitário","Custo Unitário"]
[null,"-",0,"-",0,"t",null,0,null,{"$f":"ROUNDDOWN(E194*H194,4)","v":0}]
[null,"-",0,"-",0,"t",null,0,null,{"$f":"ROUNDDOWN(E195*H195,4)","v":0}]
[null,null,null,"Custo unitário total de tempo fixo",{"$nulls":5},{"$f":"SUM(J194:J195)","v":0}]
[null,"F - MOMENTO DE TRANSPORTE",null,"Quantidade","Unidade","DMT",null,null,null,"Custo Unitário"]
[{"$nulls":5},"LN","RP","P"]
[null,"-",0,0,"tkm"]
[null,"-",0,0,"tkm"]
[null,null,null,"Custo unitário total de transporte"]
[{"$nulls":5},"Custo unitário direto total",null,null,null,{"$f":"TRUNC(J192+J196,2)","v":0.48}]
[null,"Obs."]
[]
[{"$f":"A164+1","v":7},"1ª/GRD",{"$nulls":8},{"$f":"J241","v":6.59}]
[null,"OBRA:"," DRENAGEM E PAVIMENTAÇÃO - VIAS INTERNAS DO PARQUE DE EXPOSIÇÕES E RUA BOM JARDIM (BAIRRO SANTO ANTÔNIO) - SERRO-MG"]
[null,"Custo Unitário de Referência",null,null,"Minas Gerais"]
[{"$nulls":4}," Outubro/2024 ",null,null,"Produção da equipe ",230.19,{"$f":"VLOOKUP(A205,ORÇAMENTO!$A$10:$L$69,7,1)","v":"M3"}]
[null,5502140,"ESCAVAÇÃO, CARGA E TRANSPORTE DE MATERIAL DE 1ª CATEGORIA - DMT 1.000 A 1.200M, CAMINHO DE SERVIÇO EM REVESTIMENTO PRIMÁRIO",{"$nulls":5},"Valores em reais (R$)"]
[null,"A - EQUIPAMENTOS",null,"Quantidade","Utilização",null,"Custo Horário",null,null,"Custo"]
[{"$nulls":4},"Operativa","Improdutiva","Produtivo","Improdutivo",null,"Horário Total"]
[null,"E9667","Caminhão basculante com capacidade de 14 m³ - 210 kW",4,0.97,0.03,302.11750000000001,88.006100000000004,null,{"$f":"D212*(E212*G212+F212*H212)","v":1182.7766319999998}]
[null,"E9515","Escavadeira hidráulica sobre esteiras com caçamba com capacidade de 1,56 m³ - 118 kW",1,1,0,284.76839999999999,128.20959999999999,null,{"$f":"D213*(E213*G213+F213*H213)","v":284.76839999999999}]
[{"$nulls":7},"Custo horário total de equipamentos",null,{"$f":"SUM(J212:J213)","v":1467.5450319999998}]
[null,"B - MÃO DE OBRA",null,"Quantidade","Unidade",null,"Custo Horário","Custo Horário Total"]
[null,"P9824","Servente",1,"h",null,20.631399999999999,null,null,{"$f":"D216*G216","v":20.631399999999999}]
[{"$nulls":9},{"$f":"D217*G217","v":0}]
[null,null,null,"Custo horário total de mão de obra",{"$nulls":5},{"$f":"SUM(J216:J217)","v":20.631399999999999}]
[null,null,null,"Custo horário total de execução",{"$nulls":5},{"$f":"J214+J218","v":1488.1764319999997}]
[null,null,null,"Custo unitário de execução",{"$nulls":5},{"$f":"J219/I208","v":6.4649916677527246}]
[{"$nulls":7},"Custo do FIC",null,0.1313]
[{"$nulls":7},"Custo do FIT",null,0]
[null,"C - MATERIAL",null,"Quantidade","Unidade",null,"Preço Unitário","Custo Unitário"]
[null,"-",0,null,0,null,0,null,null,{"$f":"D224*G224","v":0}]
[null,"-",0,null,0,null,0,null,null,{"$f":"D225*G225","v":0}]
[null,null,null,"Custo unitário total de material",{"$nulls":5},{"$f":"SUM(J224:J225)","v":0}]
[null,"D - ATIVIDADES AUXILIARES",null,"Quantidade","Unidade",null,"Custo Unitário","Custo Unitário"]
[null,"-",0,0,0,null,0,null,null,{"$f":"D228*G228","v":0}]
[null,"-",0,0,0,null,0,null,null,{"$f":"D229*G229","v":0}]
[null,null,null,"Custo total de atividades auxiliares",{"$nulls":5},{"$f":"SUM(J228:J229)","v":0}]
[{"$nulls":7},"Subtotal",null,{"$f":"J220+J226+J230+J221+J222","v":6.596291667752725}]
[null,"E - TEMPO FIXO",null,"Código","Quantidade","Unidade",null,"Custo Unitário","Custo Unitário"]
[null,"-",0,"-",0,"t",null,0,null,{"$f":"ROUNDDOWN(E233*H233,4)","v":0}]
[null,"-",0,"-",0,"t",null,0,null,{"$f":"ROUNDDOWN(E234*H234,4)","v":0}]
[null,null,null,"Custo unitário total de tempo fixo",{"$nulls":5},{"$f":"SUM(J233:J234)","v":0}]
[null,"F - MOMENTO DE TRANSPORTE",null,"Quantidade","Unidade","DMT",null,null,null,"Custo Unitário"]
[{"$nulls":5},"LN","RP","P"]
[null,"-",0,null,"tkm","5914449","5914464","5914479"]
[null,"-",0,null,"tkm","5914449","5914464","5914479"]
[null,null,null,"Custo unitário total de transporte"]
[{"$nulls":5},"Custo unitário direto total",null,null,null,{"$f":"TRUNC(J231+J235,2)","v":6.59}]
[null,"Obs."]
[]
[8,"1ª/GRD",{"$nulls":8},{"$f":"J283","v":4.96}]
[null,"OBRA:"," DRENAGEM E PAVIMENTAÇÃO - VIAS INTERNAS DO PARQUE DE EXPOSIÇÕES E RUA BOM JARDIM (BAIRRO SANTO ANTÔNIO) - SERRO-MG"]
[null,"Custo Unitário de Referência",null,null,"Minas Gerais"]
[{"$nulls":4}," Outubro/2024 ",null,null,"Produção da equipe ",168.2,{"$f":"VLOOKUP(A244,ORÇAMENTO!$A$10:$L$69,7,1)","v":"M3"}]
[null,5502978,"COMPACTAÇÃO DE ATERRO A 100% DO PROCTOR NORMAL",{"$nulls":5},"Valores em reais (R$)"]
[null,"A - EQUIPAMENTOS",null,"Quantidade","Utilização",null,"Custo Horário",null,null,"Custo"]
[{"$nulls":4},"Operativa","Improdutiva","Produtivo","Improdutivo",null,"Horário Total"]
[null,"E9571","Caminhão tanque com capacidade de 10.000 l - 188 kW",1,0.9,0.1,318.0342,79.329300000000003,null,{"$f":"D251*(E251*G251+F251*H251)","v":294.16370999999998}]
[null,"E9518","Grade de 24 discos rebocável de D = 60 cm (24\")",1,0.52,0.48,4.9440999999999997,3.4430000000000001,null,4.2235719999999999]
[null,"E9524","Motoniveladora - 93 kW",1,0.28999999999999998,0.71,285.76339999999999,124.88290000000001,null,171.53824499999999]
[null,"E9685","Rolo compactador pé de carneiro vibratório autopropelido por pneus de 11,6 t - 82 kW",1,1,0,223.35149999999999,100.70740000000001,null,223.35149999999999]
[null,"E9577","Trator agrícola sobre pneus - 77 kW",1,0.52,0.48,150.32509999999999,54.863799999999998,null,104.50367599999998]
[{"$nulls":7},"Custo horário total de equipamentos",null,{"$f":"SUM(J251:J255)","v":797.7807029999999}]
[null,"B - MÃO DE OBRA",null,"Quantidade","Unidade",null,"Custo Horário","Custo Horário Total"]
[null,"P9824","Servente",1,"h",null,20.631399999999999,null,null,{"$f":"D258*G258","v":20.631399999999999}]
[null,"-",null,0,0,null,0,null,null,{"$f":"D259*G259","v":0}]
[null,null,null,"Custo horário total de mão de obra",{"$nulls":5},{"$f":"SUM(J258:J259)","v":20.631399999999999}]
[null,null,null,"Custo horário total de execução",{"$nulls":5},{"$f":"J256+J260","v":818.41210299999989}]
[null,null,null,"Custo unitário de execução",{"$nulls":5},{"$f":"J261/I247","v":4.8657081034482754}]
[{"$nulls":7},"Custo do FIC",null,9.9400000000000002E-2]
[{"$nulls":7},"Custo do FIT",null,0]
[null,"C - MATERIAL",null,"Quantidade","Unidade",null,"Preço Unitário","Custo Unitário"]
[null,"-",0,null,0,null,0,null,null,{"$f":"D266*G266","v":0}]
[null,"-",0,null,0,null,0,null,null,{"$f":"D267*G267","v":0}]
[null,null,null,"Custo unitário total de material",{"$nulls":5},{"$f":"SUM(J266:J267)","v":0}]
[null,"D - ATIVIDADES AUXILIARES",null,"Quantidade","Unidade",null,"Custo Unitário","Custo Unitário"]
[null,"-",0,0,0,null,0,null,null,{"$f":"D270*G270","v":0}]
[null,"-",0,0,0,null,0,null,null,{"$f":"D271*G271","v":0}]
[null,null,null,"Custo total de atividades auxiliares",{"$nulls":5},{"$f":"SUM(J270:J271)","v":0}]
[{"$nulls":7},"Subtotal",null,{"$f":"J262+J268+J272+J263+J264","v":4.9651081034482756}]
[null,"E - TEMPO FIXO",null,"Código","Quantidade","Unidade",null,"Custo Unitário","Custo Unitário"]
[null,"-",0,"-",0,"t",null,0,null,{"$f":"ROUNDDOWN(E275*H275,4)","v":0}]
[null,"-",0,"-",0,"t",null,0,null,{"$f":"ROUNDDOWN(E276*H276,4)","v":0}]
[null,null,null,"Custo unitário total de tempo fixo",{"$nulls":5},{"$f":"SUM(J275:J276)","v":0}]
[null,"F - MOMENTO DE TRANSPORTE",null,"Quantidade","Unidade","DMT",null,null,null,"Custo Unitário"]
[{"$nulls":5},"LN","RP","P"]
[null,"-",0,null,"tkm","5914449","5914464","5914479"]
[null,"-",0,null,"tkm","5914449","5914464","5914479"]
[null,null,null,"Custo unitário total de transporte"]
[{"$nulls":5},"Custo unitário direto total",null,null,null,{"$f":"TRUNC(J273+J277,2)","v":4.96}]
[null,"Obs."]
[]
[9,"1ª/GRD",{"$nulls":8},{"$f":"J326","v":1.1399999999999999}]
[null,"OBRA:"," DRENAGEM E PAVIMENTAÇÃO - VIAS INTERNAS DO PARQUE DE EXPOSIÇÕES E RUA BOM JARDIM (BAIRRO SANTO ANTÔNIO) - SERRO-MG"]
[null,"Custo Unitário de Referência",null,null,"Minas Gerais"]
[{"$nulls":4}," Outubro/2024 ",null,null,"Produção da equipe ",1121.33,{"$f":"VLOOKUP(A286,ORÇAMENTO!$A$10:$L$69,7,1)","v":"M2"}]
[null,4011209,"REGULARIZAÇÃO E COMPACTAÇÃO DO SUBLEITO ",{"$nulls":5},"Valores em reais (R$)"]
[null,"A - EQUIPAMENTOS",null,"Quantidade","Utilização",null,"Custo Horário",null,null,"Custo"]
[{"$nulls":4},"Operativa","Improdutiva","Produtivo","Improdutivo",null,"Horário Total"]
[null,"E9571","Caminhão tanque com capacidade de 10.000 l - 188 kW",2,0.51,0.49,318.0342,79.329300000000003,null,{"$f":"D293*(E293*G293+F293*H293)","v":402.13759800000003}]
[null,"E9518","Grade de 24 discos rebocável de D = 60 cm (24\")",1,0.69,0.31,4.9440999999999997,3.4430000000000001,null,4.4787590000000002]
[null,"E9524","Motoniveladora - 93 kW",1,0.71,0.28999999999999998,285.76339999999999,124.88290000000001,null,239.10805499999998]
[null,"E9762","Rolo compactador de pneus autopropelido de 27 t - 85 kW",1,0.96,0.04,253.3622,123.72410000000001,null,248.17667599999999]
[null,"E9685","Rolo compactador pé de carneiro vibratório autopropelido por pneus de 11,6 t - 82 kW",1,1,0,223.35149999999999,100.70740000000001,null,223.35149999999999]
[null,"E9577","Trator agrícola sobre pneus - 77 kW",1,0.69,0.31,150.32509999999999,54.863799999999998,null,120.73209699999998]
[{"$nulls":7},"Custo horário total de equipamentos",null,{"$f":"SUM(J293:J298)","v":1237.9846850000001}]
[null,"B - MÃO DE OBRA",null,"Quantidade","Unidade",null,"Custo Horário","Custo Horário Total"]
[null,"P9824","Servente",1,"h",null,20.631399999999999,null,null,{"$f":"D301*G301","v":20.631399999999999}]
[null,"-",null,0,0,null,0,null,null,{"$f":"D302*G302","v":0}]
[null,null,null,"Custo horário total de mão de obra",{"$nulls":5},{"$f":"SUM(J301:J302)","v":20.631399999999999}]
[null,null,null,"Custo horário total de execução",{"$nulls":5},{"$f":"J299+J303","v":1258.6160850000001}]
[null,null,null,"Custo unitário de execução",{"$nulls":5},{"$f":"J304/I289","v":1.1224314742314931}]
[{"$nulls":7},"Custo do FIC",null,2.2700000000000001E-2]
[{"$nulls":7},"Custo do FIT",null,0]
[null,"C - MATERIAL",null,"Quantidade","Unidade",null,"Preço Unitário","Custo Unitário"]
[null,"-",0,null,0,null,0,null,null,{"$f":"D309*G309","v":0}]
[null,"-",0,null,0,null,0,null,null,{"$f":"D310*G310","v":0}]
[null,null,null,"Custo unitário total de material",{"$nulls":5},{"$f":"SUM(J309:J310)","v":0}]
[null,"D - ATIVIDADES AUXILIARES",null,"Quantidade","Unidade",null,"Custo Unitário","Custo Unitário"]
[null,"-",0,0,0,null,0,null,null,{"$f":"D313*G313","v":0}]
[null,"-",0,0,0,null,0,null,null,{"$f":"D314*G314","v":0}]
[null,null,null,"Custo total de atividades auxiliares",{"$nulls":5},{"$f":"SUM(J313:J314)","v":0}]
[{"$nulls":7},"Subtotal",null,{"$f":"J305+J311+J315+J306+J307","v":1.1451314742314931}]
[null,"E - TEMPO FIXO",null,"Código","Quantidade","Unidade",null,"Custo Unitário","Custo Unitário"]
[null,"-",0,"-",0,"t",null,0,null,{"$f":"ROUNDDOWN(E318*H318,4)","v":0}]
[null,"-",0,"-",0,"t",null,0,null,{"$f":"ROUNDDOWN(E319*H319,4)","v":0}]
[null,null,null,"Custo unitário total de tempo fixo",{"$nulls":5},{"$f":"SUM(J318:J319)","v":0}]
[null,"F - MOMENTO DE TRANSPORTE",null,"Quantidade","Unidade","DMT",null,null,null,"Custo Unitário"]
[{"$nulls":5},"LN","RP","P"]
[null,"-",0,null,"tkm","5914449","5914464","5914479"]
[null,"-",0,null,"tkm","5914449","5914464","5914479"]
[null,null,null,"Custo unitário total de transporte"]
[{"$nulls":5},"Custo unitário direto total",null,null,null,{"$f":"TRUNC(J316+J320,2)","v":1.1399999999999999}]
[null,"Obs."]
[]
[{"$f":"A286+1","v":10},"1ª/GRD",{"$nulls":8},{"$f":"J369","v":12.27}]
[null,"OBRA:"," DRENAGEM E PAVIMENTAÇÃO - VIAS INTERNAS DO PARQUE DE EXPOSIÇÕES E RUA BOM JARDIM (BAIRRO SANTO ANTÔNIO) - SERRO-MG"]
[null,"Custo Unitário de Referência",null,null,"Minas Gerais"]
[{"$nulls":4}," Outubro/2024 ",null,null,"Produção da equipe ",168.2,{"$f":"VLOOKUP(A329,ORÇAMENTO!$A$10:$L$69,7,1)","v":"M3"}]
[null,4011219,"EXECUÇÃO E COMPACTAÇÃO DE BASE ESTABILIZADA GRANULOMETRICAMENTE SEM MISTURA COM MATERIAL DE JAZIDA",{"$nulls":5},"Valores em reais (R$)"]
[null,"A - EQUIPAMENTOS",null,"Quantidade","Utilização",null,"Custo Horário",null,null,"Custo"]
[{"$nulls":4},"Operativa","Improdutiva","Produtivo","Improdutivo",null,"Horário Total"]
[null,"E9571","Caminhão tanque com capacidade de 10.000 l - 188 kW",1,0.93,7.0000000000000007E-2,318.0342,79.329300000000003,null,{"$f":"D336*(E336*G336+F336*H336)","v":301.32485700000001}]
[null,"E9518","Grade de 24 discos rebocável de D = 60 cm (24\")",1,0.52,0.48,4.9440999999999997,3.4430000000000001,null,4.2235719999999999]
[null,"E9524","Motoniveladora - 93 kW",1,0.74,0.26,285.76339999999999,124.88290000000001,null,243.93446999999998]
[null,"E9762","Rolo compactador de pneus autopropelido de 27 t - 85 kW",1,0.96,0.04,253.3622,123.72410000000001,null,248.17667599999999]
[null,"E9685","Rolo compactador pé de carneiro vibratório autopropelido por pneus de 11,6 t - 82 kW",1,1,0,223.35149999999999,100.70740000000001,null,223.35149999999999]
[null,"E9577","Trator agrícola sobre pneus - 77 kW",1,0.52,0.48,150.32509999999999,54.863799999999998,null,104.50367599999998]
[{"$nulls":7},"Custo horário total de equipamentos",null,{"$f":"SUM(J336:J341)","v":1125.5147509999999}]
[null,"B - MÃO DE OBRA",null,"Quantidade","Unidade",null,"Custo Horário","Custo Horário Total"]
[null,"P9824","Servente",1,"h",null,20.631399999999999,null,null,{"$f":"D344*G344","v":20.631399999999999}]
[null,"-",0,0,0,null,0,null,null,{"$f":"D345*G345","v":0}]
[null,null,null,"Custo horário total de mão de obra",{"$nulls":5},{"$f":"SUM(J344:J345)","v":20.631399999999999}]
[null,null,null,"Custo horário total de execução",{"$nulls":5},{"$f":"J342+J346","v":1146.1461509999999}]
[null,null,null,"Custo unitário de execução",{"$nulls":5},{"$f":"J347/I332","v":6.814186391200951}]
[{"$nulls":7},"Custo do FIC",null,0.13930000000000001]
[{"$nulls":7},"Custo do FIT",null,0]
[null,"C - MATERIAL",null,"Quantidade","Unidade",null,"Preço Unitário","Custo Unitário"]
[null,"-",0,null,0,null,0,null,null,{"$f":"D352*G352","v":0}]
[null,"-",0,null,0,null,0,null,null,{"$f":"D353*G353","v":0}]
[null,null,null,"Custo unitário total de material",{"$nulls":5},{"$f":"SUM(J352:J353)","v":0}]
[null,"D - ATIVIDADES AUXILIARES",null,"Quantidade","Unidade",null,"Custo Unitário","Custo Unitário"]
[null,4016096,"Escavação e carga de material de jazida com escavadeira hidráulica de 1,56 m³",1.1002700000000001,"m³",null,1.35,null,null,{"$f":"D356*G356","v":1.4853645000000002}]
[null,"-",0,0,0,null,0,null,null,{"$f":"D357*G357","v":0}]
[null,null,null,"Custo total de atividades auxiliares",{"$nulls":5},{"$f":"SUM(J356:J357)","v":1.4853645000000002}]
[{"$nulls":7},"Subtotal",null,{"$f":"J348+J354+J358+J349+J350","v":8.4388508912009517}]
[null,"E - TEMPO FIXO",null,"Código","Quantidade","Unidade",null,"Custo Unitário","Custo Unitário"]
[null,4016096,"Escavação e carga de material de jazida com escavadeira hidráulica de 1,56 m³",5914354,2.0630099999999998,"t",null,1.86,null,{"$f":"ROUNDDOWN(E361*H361,4)","v":3.8371}]
[null,"-",0,"-",null,"t",null,0,null,{"$f":"ROUNDDOWN(E362*H362,4)","v":0}]
[null,null,null,"Custo unitário total de tempo fixo",{"$nulls":5},{"$f":"SUM(J361:J362)","v":3.8371}]
[null,"F - MOMENTO DE TRANSPORTE",null,"Quantidade","Unidade","DMT",null,null,null,"Custo Unitário"]
[{"$nulls":5},"LN","RP","P"]
[null,4016096,"Escavação e carga de material de jazida com escavadeira hidráulica de 1,56 m³",2.0630099999999998,"tkm","5914359","5914374","5914389"]
[null,"-",0,0,"tkm"]
[null,null,null,"Custo unitário total de transporte"]
[{"$nulls":5},"Custo unitário direto total",null,null,null,{"$f":"TRUNC(J359+J363,2)","v":12.27}]
[null,"Obs."]
[]
[11,"1ª/GRD",{"$nulls":8},{"$f":"J409","v":81.48}]
[null,"OBRA:"," DRENAGEM E PAVIMENTAÇÃO - VIAS INTERNAS DO PARQUE DE EXPOSIÇÕES E RUA BOM JARDIM (BAIRRO SANTO ANTÔNIO) - SERRO-MG"]
[null,"Custo Unitário de Referência",null,null,"Minas Gerais"]
[{"$nulls":4}," Outubro/2024 ",null,null,"Produção da equipe ",5.9417706476530006,{"$f":"VLOOKUP(A372,ORÇAMENTO!$A$10:$L$69,7,1)","v":"M2"}]
[null,92394,"EXECUÇÃO DE PAVIMENTO EM PISO INTERTRAVADO, COM BLOCO DE CONCRETO DO TIPO SEXTAVADO DE 25 X 25CM, ESPESSURA 8 CM",{"$nulls":5},"Valores em reais (R$)"]
[null,"A - EQUIPAMENTOS",null,"Quantidade","Utilização",null,"Custo Horário",null,null,"Custo"]
[{"$nulls":4},"Operativa","Improdutiva","Produtivo","Improdutivo",null,"Horário Total"]
[null,"E9556","Compactador manual de placa vibratória - 3,00 kW",1,0.01,0.99,7.1031000000000004,0.90529999999999999,null,{"$f":"D379*(E379*G379+F379*H379)","v":0.96727800000000008}]
[null,"E9587","Serra para corte de concreto - 4 kW",1,0.02,0.98,9.5810999999999993,1.3258000000000001,null,{"$f":"D380*(E380*G380+F380*H380)","v":1.4909060000000001}]
[{"$nulls":7},"Custo horário total de equipamentos",null,{"$f":"SUM(J379:J380)","v":2.4581840000000001}]
[null,"B - MÃO DE OBRA",null,"Quantidade","Unidade",null,"Custo Horário","Custo Horário Total"]
[null,"P9824","Servente",1,"h",null,20.631399999999999,null,null,{"$f":"D383*G383","v":20.631399999999999}]
[null,"P9802a","Calceteiro",1,"h",null,26.619499999999999,null,null,{"$f":"D384*G384","v":26.619499999999999}]
[null,null,null,"Custo horário total de mão de obra",{"$nulls":5},{"$f":"SUM(J383:J384)","v":47.250900000000001}]
[null,null,null,"Custo horário total de execução",{"$nulls":5},{"$f":"J381+J385","v":49.709084000000004}]
[null,null,null,"Custo unitário de execução",{"$nulls":5},{"$f":"J386/I375","v":8.3660388372000014}]
[{"$nulls":7},"Custo do FIC",null,0]
[{"$nulls":7},"Custo do FIT",null,0]
[null,"C - MATERIAL",null,"Quantidade","Unidade",null,"Preço Unitário","Custo Unitário"]
[null,"M0028","Areia média",5.6800000000000003E-2,"m³",null,161.85489999999999,null,null,{"$f":"D391*G391","v":9.1933583199999998}]
[null,"M1135","Pó de pedra",6.6E-3,"m³",null,157.50319999999999,null,null,{"$f":"D392*G392","v":1.0395211199999999}]
[null,712,"Bloquete / Piso intertravado de concreto - Modelo: Sextavado 25x25, espessura = 8cm",1.0038,"m²",null,62.65,"SINAPI",null,{"$f":"D393*G393","v":62.888069999999999}]
[null,null,null,"Custo unitário total de material",{"$nulls":5},{"$f":"SUM(J391:J393)","v":73.120949440000004}]
[null,"D - ATIVIDADES AUXILIARES",null,"Quantidade","Unidade",null,"Custo Unitário","Custo Unitário"]
[null,"-",0,0,0,null,0,null,null,{"$f":"D396*G396","v":0}]
[null,"-",0,0,0,null,0,null,null,{"$f":"D397*G397","v":0}]
[null,null,null,"Custo total de atividades auxiliares",{"$nulls":5},{"$f":"SUM(J396:J397)","v":0}]
[{"$nulls":7},"Subtotal",null,{"$f":"J387+J394+J398+J388+J389","v":81.486988277199998}]
[null,"E - TEMPO FIXO",null,"Código","Quantidade","Unidade",null,"Custo Unitário","Custo Unitário"]
[null,"-",0,"-",0,"t",null,0,null,{"$f":"ROUNDDOWN(E401*H401,4)","v":0}]
[null,"-",0,"-",0,"t",null,0,null,{"$f":"ROUNDDOWN(E402*H402,4)","v":0}]
[null,null,null,"Custo unitário total de tempo fixo",{"$nulls":5},{"$f":"SUM(J401:J402)","v":0}]
[null,"F - MOMENTO DE TRANSPORTE",null,"Quantidade","Unidade","DMT",null,null,null,"Custo Unitário"]
[{"$nulls":5},"LN","RP","P"]
[null,"-",0,null,"tkm"]
[null,"-",0,null,"tkm"]
[null,null,null,"Custo unitário total de transporte"]
[{"$nulls":5},"Custo unitário direto total",null,null,null,{"$f":"TRUNC(J399+J403,2)","v":81.48}]
[null,"Obs."]
[]
[12,"1ª/GRD",{"$nulls":8},{"$f":"J448","v":0.39}]
[null,"OBRA:"," DRENAGEM E PAVIMENTAÇÃO - VIAS INTERNAS DO PARQUE DE EXPOSIÇÕES E RUA BOM JARDIM (BAIRRO SANTO ANTÔNIO) - SERRO-MG"]
[null,"Custo Unitário de Referência",null,null,"Minas Gerais"]
[{"$nulls":4}," Outubro/2024 ",null,null,"Produção da equipe ",1038.46,{"$f":"VLOOKUP(A412,ORÇAMENTO!$A$10:$L$69,7,1)","v":"M2"}]
[null,4011352,"IMPRIMAÇÃO COM EMULSÃO ASFÁLTICA (EAI)",{"$nulls":5},"Valores em reais (R$)"]
[null,"A - EQUIPAMENTOS",null,"Quantidade","Utilização",null,"Custo Horário",null,null,"Custo"]
[{"$nulls":4},"Operativa","Improdutiva","Produtivo","Improdutivo",null,"Horário Total"]
[null,"E9509","Caminhão tanque distribuidor de asfalto com capacidade de 6.000 l - 7 kW/136 kW",1,1,0,256.48719999999997,71.489999999999995,null,{"$f":"D419*(E419*G419+F419*H419)","v":256.48719999999997}]
[null,"E9558","Tanque de estocagem de asfalto com capacidade de 30.000 l",2,1,0,55.635300000000001,38.003,null,{"$f":"D420*(E420*G420+F420*H420)","v":111.2706}]
[{"$nulls":7},"Custo horário total de equipamentos",null,{"$f":"SUM(J419:J420)","v":367.75779999999997}]
[null,"B - MÃO DE OBRA",null,"Quantidade","Unidade",null,"Custo Horário","Custo Horário Total"]
[null,"P9824","Servente",2,"h",null,20.631399999999999,null,null,{"$f":"D423*G423","v":41.262799999999999}]
[null,"-",{"$nulls":7},{"$f":"D424*G424","v":0}]
[null,null,null,"Custo horário total de mão de obra",{"$nulls":5},{"$f":"SUM(J423:J424)","v":41.262799999999999}]
[null,null,null,"Custo horário total de execução",{"$nulls":5},{"$f":"J421+J425","v":409.02059999999994}]
[null,null,null,"Custo unitário de execução",{"$nulls":5},{"$f":"J426/I415","v":0.39387227240336647}]
[{"$nulls":7},"Custo do FIC",null,1.2999999999999999E-3]
[{"$nulls":7},"Custo do FIT",null,0]
[null,"C - MATERIAL",null,"Quantidade","Unidade",null,"Preço Unitário","Custo Unitário"]
[null,"M2092","Emulsão asfáltica para imprimação",1.2999999999999999E-3,"t",null,0,"FORNECIMENTO COM BDI DIFERENCIADO",null,{"$f":"D431*G431","v":0}]
[null,"-",0,89.28,0,null,0,null,null,{"$f":"D432*G432","v":0}]
[null,null,null,"Custo unitário total de material",{"$nulls":5},{"$f":"SUM(J431:J432)","v":0}]
[null,"D - ATIVIDADES AUXILIARES",null,"Quantidade","Unidade",null,"Custo Unitário","Custo Unitário"]
[null,"-",0,0,0,null,0,null,null,{"$f":"D435*G435","v":0}]
[null,"-",0,0,0,null,0,null,null,{"$f":"D436*G436","v":0}]
[null,null,null,"Custo total de atividades auxiliares",{"$nulls":5},{"$f":"SUM(J435:J436)","v":0}]
[{"$nulls":7},"Subtotal",null,{"$f":"J427+J433+J437+J428+J429","v":0.3951722724033665}]
[null,"E - TEMPO FIXO",null,"Código","Quantidade","Unidade",null,"Custo Unitário","Custo Unitário"]
[null,"-",0,"-",0,"t",null,0,null,{"$f":"ROUNDDOWN(E440*H440,4)","v":0}]
[null,"-",0,"-",0,"t",null,0,null,{"$f":"ROUNDDOWN(E441*H441,4)","v":0}]
[null,null,null,"Custo unitário total de tempo fixo",{"$nulls":5},{"$f":"SUM(J440:J441)","v":0}]
[null,"F - MOMENTO DE TRANSPORTE",null,"Quantidade","Unidade","DMT",null,null,null,"Custo Unitário"]
[{"$nulls":5},"LN","RP","P"]
[null,"-",0,null,"tkm"]
[null,"-",0,null,"tkm"]
[null,null,null,"Custo unitário total de transporte"]
[{"$nulls":5},"Custo unitário direto total",null,null,null,{"$f":"TRUNC(J438+J442,2)","v":0.39}]
[null,"Obs."]
[]
[{"$f":"A412+1","v":13},"1ª/GRD",{"$nulls":8},{"$f":"J487","v":0.27}]
[null,"OBRA:"," DRENAGEM E PAVIMENTAÇÃO - VIAS INTERNAS DO PARQUE DE EXPOSIÇÕES E RUA BOM JARDIM (BAIRRO SANTO ANTÔNIO) - SERRO-MG"]
[null,"Custo Unitário de Referência",null,null,"Minas Gerais"]
[{"$nulls":4}," Outubro/2024 ",null,null,"Produção da equipe ",1500,{"$f":"VLOOKUP(A451,ORÇAMENTO!$A$10:$L$69,7,1)","v":"M2"}]
[null,4011353,"PINTURA DE LIGAÇÃO COM EMULSÃO ASFÁLTICA RR-1C",{"$nulls":5},"Valores em reais (R$)"]
[null,"A - EQUIPAMENTOS",null,"Quantidade","Utilização",null,"Custo Horário",null,null,"Custo"]
[{"$nulls":4},"Operativa","Improdutiva","Produtivo","Improdutivo",null,"Horário Total"]
[null,"E9509","Caminhão tanque distribuidor de asfalto com capacidade de 6.000 l - 7 kW/136 kW",1,1,0,256.48719999999997,71.489999999999995,null,{"$f":"D458*(E458*G458+F458*H458)","v":256.48719999999997}]
[null,"E9558","Tanque de estocagem de asfalto com capacidade de 30.000 l",2,1,0,55.635300000000001,38.003,null,{"$f":"D459*(E459*G459+F459*H459)","v":111.2706}]
[{"$nulls":7},"Custo horário total de equipamentos",null,{"$f":"SUM(J458:J459)","v":367.75779999999997}]
[null,"B - MÃO DE OBRA",null,"Quantidade","Unidade",null,"Custo Horário","Custo Horário Total"]
[null,"P9824","Servente",2,"h",null,20.631399999999999,null,null,{"$f":"D462*G462","v":41.262799999999999}]
[null,"-",{"$nulls":7},{"$f":"D463*G463","v":0}]
[null,null,null,"Custo horário total de mão de obra",{"$nulls":5},{"$f":"SUM(J462:J463)","v":41.262799999999999}]
[null,null,null,"Custo horário total de execução",{"$nulls":5},{"$f":"J460+J464","v":409.02059999999994}]
[null,null,null,"Custo unitário de execução",{"$nulls":5},{"$f":"J465/I454","v":0.27268039999999999}]
[{"$nulls":7},"Custo do FIC",null,8.9999999999999998E-4]
[{"$nulls":7},"Custo do FIT",null,0]
[null,"C - MATERIAL",null,"Quantidade","Unidade",null,"Preço Unitário","Custo Unitário"]
[null,"M1946","Emulsão asfáltica - RR-1C",4.4999999999999999E-4,"t",null,0,"FORNECIMENTO COM BDI DIFERENCIADO",null,{"$f":"D470*G470","v":0}]
[null,"-",0,null,0,null,0,null,null,{"$f":"D471*G471","v":0}]
[null,null,null,"Custo unitário total de material",{"$nulls":5},{"$f":"SUM(J470:J471)","v":0}]
[null,"D - ATIVIDADES AUXILIARES",null,"Quantidade","Unidade",null,"Custo Unitário","Custo Unitário"]
[null,"-",0,0,0,null,0,null,null,{"$f":"D474*G474","v":0}]
[null,"-",0,0,0,null,0,null,null,{"$f":"D475*G475","v":0}]
[null,null,null,"Custo total de atividades auxiliares",{"$nulls":5},{"$f":"SUM(J474:J475)","v":0}]
[{"$nulls":7},"Subtotal",null,{"$f":"J466+J472+J476+J467+J468","v":0.2735804}]
[null,"E - TEMPO FIXO",null,"Código","Quantidade","Unidade",null,"Custo Unitário","Custo Unitário"]
[null,"-",0,"-",0,"t",null,0,null,{"$f":"ROUNDDOWN(E479*H479,4)","v":0}]
[null,"-",0,"-",0,"t",null,0,null,{"$f":"ROUNDDOWN(E480*H480,4)","v":0}]
[null,null,null,"Custo unitário total de tempo fixo",{"$nulls":5},{"$f":"SUM(J479:J480)","v":0}]
[null,"F - MOMENTO DE TRANSPORTE",null,"Quantidade","Unidade","DMT",null,null,null,"Custo Unitário"]
[{"$nulls":5},"LN","RP","P"]
[null,"-",0,null,"tkm"]
[null,"-",0,null,"tkm"]
[null,null,null,"Custo unitário total de transporte"]
[{"$nulls":5},"Custo unitário direto total",null,null,null,{"$f":"TRUNC(J477+J481,2)","v":0.27}]
[null,"Obs."]
[]
[{"$f":"A451+1","v":14},"1ª/GRD",{"$nulls":8},{"$f":"J527","v":229.97}]
[null,"OBRA:"," DRENAGEM E PAVIMENTAÇÃO - VIAS INTERNAS DO PARQUE DE EXPOSIÇÕES E RUA BOM JARDIM (BAIRRO SANTO ANTÔNIO) - SERRO-MG"]
[null,"Custo Unitário de Referência",null,null,"Minas Gerais"]
[{"$nulls":4}," Outubro/2024 ",null,null,"Produção da equipe ",99.6,{"$f":"VLOOKUP(A490,ORÇAMENTO!$A$10:$L$69,7,1)","v":"T"}]
[null,4011463,"EXECUÇÃO DE PAVIMENTO COM APLICAÇÃO DE CONCRETO ASFÁLTICO USINADO A QUENTE (CBUQ), CAMADA DE ROLAMENTO - EXCLUSIVE TRANSPORTE",{"$nulls":5},"Valores em reais (R$)"]
[null,"A - EQUIPAMENTOS",null,"Quantidade","Utilização",null,"Custo Horário",null,null,"Custo"]
[{"$nulls":4},"Operativa","Improdutiva","Produtivo","Improdutivo",null,"Horário Total"]
[null,"E9762","Rolo compactador de pneus autopropelido de 27 t - 85 kW",1,0.71,0.28999999999999998,253.3622,123.72410000000001,null,{"$f":"D497*(E497*G497+F497*H497)","v":215.76715099999998}]
[null,"E9681","Rolo compactador liso tandem vibratório autopropelido de 10,4 t - 82 kW",1,0.82,0.18,292.98790000000002,112.532,null,{"$f":"D498*(E498*G498+F498*H498)","v":260.50583799999998}]
[null,"E9545","Vibroacabadora de asfalto sobre esteiras - 97 kW",1,1,0,355.74560000000002,153.1112,null,{"$f":"D499*(E499*G499+F499*H499)","v":355.74560000000002}]
[{"$nulls":7},"Custo horário total de equipamentos",null,{"$f":"SUM(J497:J499)","v":832.01858900000002}]
[null,"B - MÃO DE OBRA",null,"Quantidade","Unidade",null,"Custo Horário","Custo Horário Total"]
[null,"P9824","Servente",8,"h",null,20.631399999999999,null,null,{"$f":"D502*G502","v":165.05119999999999}]
[null,"-",0,null,0,null,0,null,null,{"$f":"D503*G503","v":0}]
[null,null,null,"Custo horário total de mão de obra",{"$nulls":5},{"$f":"SUM(J502:J503)","v":165.05119999999999}]
[null,null,null,"Custo horário total de execução",{"$nulls":5},{"$f":"J500+J504","v":997.06978900000001}]
[null,null,null,"Custo unitário de execução",{"$nulls":5},{"$f":"J505/I493","v":10.010740853413655}]
[{"$nulls":7},"Custo do FIC",null,3.4000000000000002E-2]
[{"$nulls":7},"Custo do FIT",null,0]
[null,"C - MATERIAL",null,"Quantidade","Unidade",null,"Preço Unitário","Custo Unitário"]
[null,"-",0,null,0,null,0,null,null,{"$f":"D510*G510","v":0}]
[null,"-",0,null,0,null,0,null,null,{"$f":"D511*G511","v":0}]
[null,null,null,"Custo unitário total de material",{"$nulls":5},{"$f":"SUM(J510:J511)","v":0}]
[null,"D - ATIVIDADES AUXILIARES",null,"Quantidade","Unidade",null,"Custo Unitário","Custo Unitário"]
[null,6416078,"Usinagem de concreto asfáltico - faixa C - areia e brita comerciais",1,"t",null,212.08330273072286,null,null,{"$f":"D514*G514","v":212.08330273072286}]
[null,"-",0,0,0,null,0,null,null,{"$f":"D515*G515","v":0}]
[null,null,null,"Custo total de atividades auxiliares",{"$nulls":5},{"$f":"SUM(J514:J515)","v":212.08330273072286}]
[{"$nulls":7},"Subtotal",null,{"$f":"J506+J512+J516+J507+J508","v":222.12804358413652}]
[null,"E - TEMPO FIXO",null,"Código","Quantidade","Unidade",null,"Custo Unitário","Custo Unitário"]
[null,6416078,"Usinagem de concreto asfáltico - faixa C - areia e brita comerciais",5914649,1,"t",null,7.85,null,{"$f":"ROUNDDOWN(E519*H519,4)","v":7.85}]
[null,"-",0,"-",0,"t",null,0,null,{"$f":"ROUNDDOWN(E520*H520,4)","v":0}]
[null,null,null,"Custo unitário total de tempo fixo",{"$nulls":5},{"$f":"SUM(J519:J520)","v":7.85}]
[null,"F - MOMENTO DE TRANSPORTE",null,"Quantidade","Unidade","DMT",null,null,null,"Custo Unitário"]
[{"$nulls":5},"LN","RP","P"]
[null,6416078,"Usinagem de concreto asfáltico - faixa C - areia e brita comerciais",1,"tkm"]
[null,"-",0,0,"tkm"]
[null,null,null,"Custo unitário total de transporte"]
[{"$nulls":5},"Custo unitário direto total",null,null,null,{"$f":"TRUNC(J517+J521,2)","v":229.97}]
[null,"Obs."]
[]
[null,"1ª/GRD",{"$nulls":8},{"$f":"J578","v":212.08330273072286}]
[null,"OBRA:"," DRENAGEM E PAVIMENTAÇÃO - VIAS INTERNAS DO PARQUE DE EXPOSIÇÕES E RUA BOM JARDIM (BAIRRO SANTO ANTÔNIO) - SERRO-MG"]
[null,"Custo Unitário de Referência - Auxiliar",null,null,"Minas Gerais"]
[{"$nulls":4}," Outubro/2024 ",null,null,"Produção da equipe ",99.6,"t"]
[null,6416078,"Usinagem de concreto asfáltico - faixa C - areia e brita comerciais",{"$nulls":5},"Valores em reais (R$)"]
[null,"A - EQUIPAMENTOS",null,"Quantidade","Utilização",null,"Custo Horário",null,null,"Custo"]
[{"$nulls":4},"Operativa","Improdutiva","Produtivo","Improdutivo",null,"Horário Total"]
[null,"E9559","Aquecedor de fluido térmico - 12 kW",1,1,0,70.256299999999996,40.131300000000003,null,{"$f":"D537*(E537*G537+F537*H537)","v":70.256299999999996}]
[null,"E9584","Carregadeira de pneus com capacidade de 1,72 m³ - 113 kW",1,0.81,0.19,198.703,99.0672,null,{"$f":"D538*(E538*G538+F538*H538)","v":179.772198}]
[null,"E9021","Grupo gerador - 456 kVA",1,1,0,406.80880000000002,22.1935,null,{"$f":"D539*(E539*G539+F539*H539)","v":406.80880000000002}]
[null,"E9558","Tanque de estocagem de asfalto com capacidade de 30.000 l",2,1,0,55.635300000000001,38.003,null,{"$f":"D540*(E540*G540+F540*H540)","v":111.2706}]
[null,"E9689","Usina de asfalto a quente gravimétrica com capacidade de 100/140 t/h - 260 kW",1,1,0,1238.6309000000001,656.54520000000002,null,{"$f":"D541*(E541*G541+F541*H541)","v":1238.6309000000001}]
[{"$nulls":7},"Custo horário total de equipamentos",null,{"$f":"SUM(J537:J541)","v":2006.7387980000001}]
[null,"B - MÃO DE OBRA",null,"Quantidade","Unidade",null,"Custo Horário","Custo Horário Total"]
[null,"P9824","Servente",4,"h",null,20.631399999999999,null,null,{"$f":"D544*G544","v":82.525599999999997}]
[null,null,null,"Custo horário total de mão de obra",{"$nulls":5},{"$f":"SUM(J544:J544)","v":82.525599999999997}]
[null,null,null,"Custo horário total de execução",{"$nulls":5},{"$f":"J542+J545","v":2089.2643980000003}]
[null,null,null,"Custo unitário de execução",{"$nulls":5},{"$f":"J546/I533","v":20.976550180722896}]
[{"$nulls":7},"Custo do FIC",null,0]
[{"$nulls":7},"Custo do FIT",null,0]
[null,"C - MATERIAL",null,"Quantidade","Unidade",null,"Preço Unitário","Custo Unitário"]
[null,"M0028","Areia média",0.33123999999999998,"m³",null,161.85489999999999,null,null,{"$f":"D551*G551","v":53.612817075999992}]
[null,"M0005","Brita 0",6.3700000000000007E-2,"m³",null,181.11600000000001,null,null,{"$f":"D552*G552","v":11.537089200000002}]
[null,"M0191","Brita 1",6.3700000000000007E-2,"m³",null,175.32830000000001,null,null,11.168412710000002]
[null,"M0344","Cal hidratada - a granel",57.323999999999998,"kg",null,0.59379999999999999,null,null,34.038991199999998]
[null,"M1943","Cimento asfáltico de petróleo - CAP 50/70",6.4490000000000006E-2,"t",null,0,"FORNECIMENTO COM BDI DIFERENCIADO",null,0]
[null,"M1941","Óleo tipo A1",8,"l",null,6.6567999999999996,null,null,53.254399999999997]
[null,"M1103","Pedrisco",0.14013999999999999,"m³",null,177.70259999999999,null,null,24.903242363999997]
[null,null,null,"Custo unitário total de material",{"$nulls":5},{"$f":"SUM(J551:J557)","v":188.51495254999998}]
[null,"D - ATIVIDADES AUXILIARES",null,"Quantidade","Unidade",null,"Custo Unitário","Custo Unitário"]
[null,"-",0,0,0,null,0,null,null,{"$f":"D560*G560","v":0}]
[null,null,null,"Custo total de atividades auxiliares",{"$nulls":5},{"$f":"SUM(J560:J560)","v":0}]
[{"$nulls":7},"Subtotal",null,{"$f":"J547+J558+J561+J548+J549","v":209.49150273072286}]
[null,"E - TEMPO FIXO",null,"Código","Quantidade","Unidade",null,"Custo Unitário","Custo Unitário"]
[null,"M0028","Areia média",5914647,0.49686000000000002,"t",null,1.78,null,{"$f":"ROUNDDOWN(E564*H564,4)","v":0.88439999999999996}]
[null,"M0005","Brita 0",5914647,9.5549999999999996E-2,"t",null,1.78,null,{"$f":"ROUNDDOWN(E565*H565,4)","v":0.17}]
[null,"M0191","Brita 1",5914647,9.5549999999999996E-2,"t",null,1.78,null,{"$f":"ROUNDDOWN(E566*H566,4)","v":0.17}]
[null,"M0344","Cal hidratada - a granel",5914363,5.7320000000000003E-2,"t",null,17.329999999999998,null,{"$f":"ROUNDDOWN(E567*H567,4)","v":0.99329999999999996}]
[null,"M1103","Pedrisco",5914647,0.21021000000000001,"t",null,1.78,null,{"$f":"ROUNDDOWN(E568*H568,4)","v":0.37409999999999999}]
[null,null,null,"Custo unitário total de tempo fixo",{"$nulls":5},{"$f":"SUM(J564:J568)","v":2.5917999999999997}]
[null,"F - MOMENTO DE TRANSPORTE",null,"Quantidade","Unidade","DMT",null,null,null,"Custo Unitário"]
[{"$nulls":5},"LN","RP","P"]
[null,"M0028","Areia média",0.49686000000000002,"tkm"]
[null,"M0005","Brita 0",9.5549999999999996E-2,"tkm"]
[null,"M0191","Brita 1",9.5549999999999996E-2,"tkm"]
[null,"M0344","Cal hidratada - a granel",5.7320000000000003E-2,"tkm"]
[null,"M1103","Pedrisco",0.21021000000000001,"tkm"]
[null,null,null,"Custo unitário total de transporte"]
[{"$nulls":5},"Custo unitário direto total",null,null,null,{"$f":"J562+J569","v":212.08330273072286}]
[null,"Obs."]
[]
[{"$f":"A490+1","v":15},"1ª/GRD",{"$nulls":8},{"$f":"J617","v":0.64}]
[null,"OBRA:"," DRENAGEM E PAVIMENTAÇÃO - VIAS INTERNAS DO PARQUE DE EXPOSIÇÕES E RUA BOM JARDIM (BAIRRO SANTO ANTÔNIO) - SERRO-MG"]
[null,"Custo Unitário de Referência",null,null,"Minas Gerais"]
[{"$nulls":4}," Outubro/2024 ",null,null,"Produção da equipe ",470.61,{"$f":"VLOOKUP(A581,ORÇAMENTO!$A$10:$L$69,7,1)","v":"TXKM"}]
[null,5915321,"TRANSPORTE COM CAMINHÃO BASCULANTE, EM RODOVIA PAVIMENTADA",{"$nulls":5},"Valores em reais (R$)"]
[null,"A - EQUIPAMENTOS",null,"Quantidade","Utilização",null,"Custo Horário",null,null,"Custo"]
[{"$nulls":4},"Operativa","Improdutiva","Produtivo","Improdutivo",null,"Horário Total"]
[null,"E9667","Caminhão basculante com capacidade de 14 m³ - 210 kW",1,1,0,302.11750000000001,88.006100000000004,null,{"$f":"D588*(E588*G588+F588*H588)","v":302.11750000000001}]
[null,"-",0,null,null,null,0,0,null,{"$f":"D589*(E589*G589+F589*H589)","v":0}]
[{"$nulls":7},"Custo horário total de equipamentos",null,{"$f":"SUM(J588:J589)","v":302.11750000000001}]
[null,"B - MÃO DE OBRA",null,"Quantidade","Unidade",null,"Custo Horário","Custo Horário Total"]
[null,"-",0,null,0,null,0,null,null,{"$f":"D592*G592","v":0}]
[null,"-",0,null,0,null,0,null,null,{"$f":"D593*G593","v":0}]
[null,null,null,"Custo horário total de mão de obra",{"$nulls":5},{"$f":"SUM(J592:J593)","v":0}]
[null,null,null,"Custo horário total de execução",{"$nulls":5},{"$f":"J590+J594","v":302.11750000000001}]
[null,null,null,"Custo unitário de execução",{"$nulls":5},{"$f":"J595/I584","v":0.64196999638766705}]
[{"$nulls":7},"Custo do FIC",null,0]
[{"$nulls":7},"Custo do FIT",null,0]
[null,"C - MATERIAL",null,"Quantidade","Unidade",null,"Preço Unitário","Custo Unitário"]
[null,"-",0,0,0,null,0,null,null,{"$f":"D600*G600","v":0}]
[null,"-",0,0,0,null,0,null,null,{"$f":"D601*G601","v":0}]
[null,null,null,"Custo unitário total de material",{"$nulls":5},{"$f":"SUM(J600:J601)","v":0}]
[null,"D - ATIVIDADES AUXILIARES",null,"Quantidade","Unidade",null,"Custo Unitário","Custo Unitário"]
[null,"-",0,0,0,null,0,null,null,{"$f":"D604*G604","v":0}]
[null,"-",0,0,0,null,0,null,null,{"$f":"D605*G605","v":0}]
[null,null,null,"Custo total de atividades auxiliares",{"$nulls":5},{"$f":"SUM(J604:J605)","v":0}]
[{"$nulls":7},"Subtotal",null,{"$f":"J596+J602+J606+J597+J598","v":0.64196999638766705}]
[null,"E - TEMPO FIXO",null,"Código","Quantidade","Unidade",null,"Custo Unitário","Custo Unitário"]
[null,"-",0,"-",0,"t",null,0,null,{"$f":"ROUNDDOWN(E609*H609,4)","v":0}]
[null,"-",0,"-",0,"t",null,0,null,{"$f":"ROUNDDOWN(E610*H610,4)","v":0}]
[null,null,null,"Custo unitário total de tempo fixo",{"$nulls":5},{"$f":"SUM(J609:J610)","v":0}]
[null,"F - MOMENTO DE TRANSPORTE",null,"Quantidade","Unidade","DMT",null,null,null,"Custo Unitário"]
[{"$nulls":5},"LN","RP","P"]
[null,"-",0,0,"tkm"]
[null,"-",0,0,"tkm"]
[null,null,null,"Custo unitário total de transporte"]
[{"$nulls":5},"Custo unitário direto total",null,null,null,{"$f":"TRUNC(J607+J611,2)","v":0.64}]
[null,"Obs."]
[]
[16,"1ª/GRD",{"$nulls":8},{"$f":"J656","v":0.7}]
[null,"OBRA:"," DRENAGEM E PAVIMENTAÇÃO - VIAS INTERNAS DO PARQUE DE EXPOSIÇÕES E RUA BOM JARDIM (BAIRRO SANTO ANTÔNIO) - SERRO-MG"]
[null,"Custo Unitário de Referência",null,null,"Minas Gerais"]
[{"$nulls":4}," Outubro/2024 ",null,null,"Produção da equipe ",435.75,{"$f":"VLOOKUP(A620,ORÇAMENTO!$A$10:$L$69,7,1)","v":"TXKM"}]
[null,5915320,"TRANSPORTE COM CAMINHÃO BASCULANTE, RODOVIA EM REVESTIMENTO PRIMÁRIO",{"$nulls":5},"Valores em reais (R$)"]
[null,"A - EQUIPAMENTOS",null,"Quantidade","Utilização",null,"Custo Horário",null,null,"Custo"]
[{"$nulls":4},"Operativa","Improdutiva","Produtivo","Improdutivo",null,"Horário Total"]
[null,"E9667","Caminhão basculante com capacidade de 14 m³ - 210 kW",1,1,0,302.11750000000001,88.006100000000004,null,{"$f":"D627*(E627*G627+F627*H627)","v":302.11750000000001}]
[null,"-",0,null,null,null,0,0,null,{"$f":"D628*(E628*G628+F628*H628)","v":0}]
[{"$nulls":7},"Custo horário total de equipamentos",null,{"$f":"SUM(J627:J628)","v":302.11750000000001}]
[null,"B - MÃO DE OBRA",null,"Quantidade","Unidade",null,"Custo Horário","Custo Horário Total"]
[null,"-",0,null,0,null,0,null,null,{"$f":"D631*G631","v":0}]
[null,"-",0,null,0,null,0,null,null,{"$f":"D632*G632","v":0}]
[null,null,null,"Custo horário total de mão de obra",{"$nulls":5},{"$f":"SUM(J631:J632)","v":0}]
[null,null,null,"Custo horário total de execução",{"$nulls":5},{"$f":"J629+J633","v":302.11750000000001}]
[null,null,null,"Custo unitário de execução",{"$nulls":5},{"$f":"J634/I623","v":0.69332759609868044}]
[{"$nulls":7},"Custo do FIC",null,1.4200000000000001E-2]
[{"$nulls":7},"Custo do FIT",null,0]
[null,"C - MATERIAL",null,"Quantidade","Unidade",null,"Preço Unitário","Custo Unitário"]
[null,"-",0,0,0,null,0,null,null,{"$f":"D639*G639","v":0}]
[null,"-",0,0,0,null,0,null,null,{"$f":"D640*G640","v":0}]
[null,null,null,"Custo unitário total de material",{"$nulls":5},{"$f":"SUM(J639:J640)","v":0}]
[null,"D - ATIVIDADES AUXILIARES",null,"Quantidade","Unidade",null,"Custo Unitário","Custo Unitário"]
[null,"-",0,0,0,null,0,null,null,{"$f":"D643*G643","v":0}]
[null,"-",0,0,0,null,0,null,null,{"$f":"D644*G644","v":0}]
[null,null,null,"Custo total de atividades auxiliares",{"$nulls":5},{"$f":"SUM(J643:J644)","v":0}]
[{"$nulls":7},"Subtotal",null,{"$f":"J635+J641+J645+J636+J637","v":0.70752759609868043}]
[null,"E - TEMPO FIXO",null,"Código","Quantidade","Unidade",null,"Custo Unitário","Custo Unitário"]
[null,"-",0,"-",0,"t",null,0,null,{"$f":"ROUNDDOWN(E648*H648,4)","v":0}]
[null,"-",0,"-",0,"t",null,0,null,{"$f":"ROUNDDOWN(E649*H649,4)","v":0}]
[null,null,null,"Custo unitário total de tempo fixo",{"$nulls":5},{"$f":"SUM(J648:J649)","v":0}]
[null,"F - MOMENTO DE TRANSPORTE",null,"Quantidade","Unidade","DMT",null,null,null,"Custo Unitário"]
[{"$nulls":5},"LN","RP","P"]
[null,"-",0,0,"tkm"]
[null,"-",0,0,"tkm"]
[null,null,null,"Custo unitário total de transporte"]
[{"$nulls":5},"Custo unitário direto total",null,null,null,{"$f":"TRUNC(J646+J650,2)","v":0.7}]
[null,"Obs."]
[]
[{"$f":"A620+1","v":17},"1ª/GRD",{"$nulls":8},{"$f":"J695","v":0.73}]
[null,"OBRA:"," DRENAGEM E PAVIMENTAÇÃO - VIAS INTERNAS DO PARQUE DE EXPOSIÇÕES E RUA BOM JARDIM (BAIRRO SANTO ANTÔNIO) - SERRO-MG"]
[null,"Custo Unitário de Referência",null,null,"Minas Gerais"]
[{"$nulls":4}," Outubro/2024 ",null,null,"Produção da equipe ",241.03,{"$f":"VLOOKUP(A659,ORÇAMENTO!$A$10:$L$69,7,1)","v":"TXKM"}]
[null,5914434,"TRANSPORTE COM CAMINHÃO CARROCERIA 9T, EM VIA URBANA PREDOMINANTEMENTE PAVIMENTADA",{"$nulls":5},"Valores em reais (R$)"]
[null,"A - EQUIPAMENTOS",null,"Quantidade","Utilização",null,"Custo Horário",null,null,"Custo"]
[{"$nulls":4},"Operativa","Improdutiva","Produtivo","Improdutivo",null,"Horário Total"]
[null,"E9508","Caminhão carroceria com capacidade de 9 t - 136 kW",1,1,0,176.18940000000001,67.083100000000002,null,{"$f":"D666*(E666*G666+F666*H666)","v":176.18940000000001}]
[null,"-",0,null,null,null,0,0,null,{"$f":"D667*(E667*G667+F667*H667)","v":0}]
[{"$nulls":7},"Custo horário total de equipamentos",null,{"$f":"SUM(J666:J667)","v":176.18940000000001}]
[null,"B - MÃO DE OBRA",null,"Quantidade","Unidade",null,"Custo Horário","Custo Horário Total"]
[null,"-",0,0,0,null,0,null,null,{"$f":"D670*G670","v":0}]
[null,"-",0,0,0,null,0,null,null,{"$f":"D671*G671","v":0}]
[null,null,null,"Custo horário total de mão de obra",{"$nulls":5},{"$f":"SUM(J670:J671)","v":0}]
[null,null,null,"Custo horário total de execução",{"$nulls":5},{"$f":"J668+J672","v":176.18940000000001}]
[null,null,null,"Custo unitário de execução",{"$nulls":5},{"$f":"J673/I662","v":0.73098535452018421}]
[{"$nulls":7},"Custo do FIC",null,0]
[{"$nulls":7},"Custo do FIT",null,0]
[null,"C - MATERIAL",null,"Quantidade","Unidade",null,"Preço Unitário","Custo Unitário"]
[null,"-",0,0,0,null,0,null,null,{"$f":"D678*G678","v":0}]
[null,"-",0,0,0,null,0,null,null,{"$f":"D679*G679","v":0}]
[null,null,null,"Custo unitário total de material",{"$nulls":5},{"$f":"SUM(J678:J679)","v":0}]
[null,"D - ATIVIDADES AUXILIARES",null,"Quantidade","Unidade",null,"Custo Unitário","Custo Unitário"]
[null,"-",0,0,0,null,0,null,null,{"$f":"D682*G682","v":0}]
[null,"-",0,0,0,null,0,null,null,{"$f":"D683*G683","v":0}]
[null,null,null,"Custo total de atividades auxiliares",{"$nulls":5},{"$f":"SUM(J682:J683)","v":0}]
[{"$nulls":7},"Subtotal",null,{"$f":"J674+J680+J684+J675+J676","v":0.73098535452018421}]
[null,"E - TEMPO FIXO",null,"Código","Quantidade","Unidade",null,"Custo Unitário","Custo Unitário"]
[null,"-",0,"-",0,"t",null,0,null,{"$f":"ROUNDDOWN(E687*H687,4)","v":0}]
[null,"-",0,"-",0,"t",null,0,null,{"$f":"ROUNDDOWN(E688*H688,4)","v":0}]
[null,null,null,"Custo unitário total de tempo fixo",{"$nulls":5},{"$f":"SUM(J687:J688)","v":0}]
[null,"F - MOMENTO DE TRANSPORTE",null,"Quantidade","Unidade","DMT",null,null,null,"Custo Unitário"]
[{"$nulls":5},"LN","RP","P"]
[null,"-",0,0,"tkm"]
[null,"-",0,0,"tkm"]
[null,null,null,"Custo unitário total de transporte"]
[{"$nulls":5},"Custo unitário direto total",null,null,null,{"$f":"TRUNC(J685+J689,2)","v":0.73}]
[null,"Obs."]
[]
[{"$f":"A659+1","v":18},"1ª/GRD",{"$nulls":8},{"$f":"J734","v":1.1599999999999999}]
[null,"OBRA:"," DRENAGEM E PAVIMENTAÇÃO - VIAS INTERNAS DO PARQUE DE EXPOSIÇÕES E RUA BOM JARDIM (BAIRRO SANTO ANTÔNIO) - SERRO-MG"]
[null,"Custo Unitário de Referência",null,null,"Minas Gerais"]
[{"$nulls":4}," Outubro/2024 ",null,null,"Produção da equipe ",224.1,{"$f":"VLOOKUP(A698,ORÇAMENTO!$A$10:$L$69,7,1)","v":"TXKM"}]
[null,5914612,"TRANSPORTE DE MASSA ASFÁLTICA COM CAMINHÃO BASCULANTE, EM VIA URBANA PREDOMINANTEMENTE PAVIMENTADA",{"$nulls":5},"Valores em reais (R$)"]
[null,"A - EQUIPAMENTOS",null,"Quantidade","Utilização",null,"Custo Horário",null,null,"Custo"]
[{"$nulls":4},"Operativa","Improdutiva","Produtivo","Improdutivo",null,"Horário Total"]
[null,"E9520","Caminhão com caçamba térmica com capacidade de 6 m³ - 188 kW",1,1,0,261.73930000000001,75.977099999999993,null,{"$f":"D705*(E705*G705+F705*H705)","v":261.73930000000001}]
[null,"-",0,null,null,null,0,0,null,{"$f":"D706*(E706*G706+F706*H706)","v":0}]
[{"$nulls":7},"Custo horário total de equipamentos",null,{"$f":"SUM(J705:J706)","v":261.73930000000001}]
[null,"B - MÃO DE OBRA",null,"Quantidade","Unidade",null,"Custo Horário","Custo Horário Total"]
[null,"-",0,0,0,null,0,null,null,{"$f":"D709*G709","v":0}]
[null,"-",0,0,0,null,0,null,null,{"$f":"D710*G710","v":0}]
[null,null,null,"Custo horário total de mão de obra",{"$nulls":5},{"$f":"SUM(J709:J710)","v":0}]
[null,null,null,"Custo horário total de execução",{"$nulls":5},{"$f":"J707+J711","v":261.73930000000001}]
[null,null,null,"Custo unitário de execução",{"$nulls":5},{"$f":"J712/I701","v":1.1679576082106204}]
[{"$nulls":7},"Custo do FIC",null,0]
[{"$nulls":7},"Custo do FIT",null,0]
[null,"C - MATERIAL",null,"Quantidade","Unidade",null,"Preço Unitário","Custo Unitário"]
[null,"-",0,0,0,null,0,null,null,{"$f":"D717*G717","v":0}]
[null,"-",0,0,0,null,0,null,null,{"$f":"D718*G718","v":0}]
[null,null,null,"Custo unitário total de material",{"$nulls":5},{"$f":"SUM(J717:J718)","v":0}]
[null,"D - ATIVIDADES AUXILIARES",null,"Quantidade","Unidade",null,"Custo Unitário","Custo Unitário"]
[null,"-",0,0,0,null,0,null,null,{"$f":"D721*G721","v":0}]
[null,"-",0,0,0,null,0,null,null,{"$f":"D722*G722","v":0}]
[null,null,null,"Custo total de atividades auxiliares",{"$nulls":5},{"$f":"SUM(J721:J722)","v":0}]
[{"$nulls":7},"Subtotal",null,{"$f":"J713+J719+J723+J714+J715","v":1.1679576082106204}]
[null,"E - TEMPO FIXO",null,"Código","Quantidade","Unidade",null,"Custo Unitário","Custo Unitário"]
[null,"-",0,"-",0,"t",null,0,null,{"$f":"ROUNDDOWN(E726*H726,4)","v":0}]
[null,"-",0,"-",0,"t",null,0,null,{"$f":"ROUNDDOWN(E727*H727,4)","v":0}]
[null,null,null,"Custo unitário total de tempo fixo",{"$nulls":5},{"$f":"SUM(J726:J727)","v":0}]
[null,"F - MOMENTO DE TRANSPORTE",null,"Quantidade","Unidade","DMT",null,null,null,"Custo Unitário"]
[{"$nulls":5},"LN","RP","P"]
[null,"-",0,0,"tkm"]
[null,"-",0,0,"tkm"]
[null,null,null,"Custo unitário total de transporte"]
[{"$nulls":5},"Custo unitário direto total",null,null,null,{"$f":"TRUNC(J724+J728,2)","v":1.1599999999999999}]
[null,"Obs."]
[]
[{"$f":"A698+1","v":19},"1ª/GRD",{"$nulls":8},{"$f":"J773","v":1.71}]
[null,"OBRA:"," DRENAGEM E PAVIMENTAÇÃO - VIAS INTERNAS DO PARQUE DE EXPOSIÇÕES E RUA BOM JARDIM (BAIRRO SANTO ANTÔNIO) - SERRO-MG"]
[null,"Custo Unitário de Referência",null,null,"Minas Gerais"]
[{"$nulls":4}," Outubro/2024 ",null,null,"Produção da equipe ",149.4,{"$f":"VLOOKUP(A737,ORÇAMENTO!$A$10:$L$69,7,1)","v":"TXKM"}]
[null,5914622,"TRANSPORTE COM CAMINHÃO TANQUE DE TRANSPORTE DE MATERIAL ASFÁLTICO DE 30000 L, EM VIA URBANA PREDOMINANTEMENTE PAVIMENTADA",{"$nulls":5},"Valores em reais (R$)"]
[null,"A - EQUIPAMENTOS",null,"Quantidade","Utilização",null,"Custo Horário",null,null,"Custo"]
[{"$nulls":4},"Operativa","Improdutiva","Produtivo","Improdutivo",null,"Horário Total"]
[null,"E9509","Caminhão tanque distribuidor de asfalto com capacidade de 6.000 l - 7 kW/136 kW",1,1,0,256.48719999999997,71.489999999999995,null,{"$f":"D744*(E744*G744+F744*H744)","v":256.48719999999997}]
[null,"-",0,null,null,null,0,0,null,{"$f":"D745*(E745*G745+F745*H745)","v":0}]
[{"$nulls":7},"Custo horário total de equipamentos",null,{"$f":"SUM(J744:J745)","v":256.48719999999997}]
[null,"B - MÃO DE OBRA",null,"Quantidade","Unidade",null,"Custo Horário","Custo Horário Total"]
[null,"-",0,0,0,null,0,null,null,{"$f":"D748*G748","v":0}]
[null,"-",0,0,0,null,0,null,null,{"$f":"D749*G749","v":0}]
[null,null,null,"Custo horário total de mão de obra",{"$nulls":5},{"$f":"SUM(J748:J749)","v":0}]
[null,null,null,"Custo horário total de execução",{"$nulls":5},{"$f":"J746+J750","v":256.48719999999997}]
[null,null,null,"Custo unitário de execução",{"$nulls":5},{"$f":"J751/I740","v":1.7167817938420347}]
[{"$nulls":7},"Custo do FIC",null,0]
[{"$nulls":7},"Custo do FIT",null,0]
[null,"C - MATERIAL",null,"Quantidade","Unidade",null,"Preço Unitário","Custo Unitário"]
[null,"-",0,996,0,null,0,null,null,{"$f":"D756*G756","v":0}]
[null,"-",0,89.28,0,null,0,null,null,{"$f":"D757*G757","v":0}]
[null,null,null,"Custo unitário total de material",{"$nulls":5},{"$f":"SUM(J756:J757)","v":0}]
[null,"D - ATIVIDADES AUXILIARES",null,"Quantidade","Unidade",null,"Custo Unitário","Custo Unitário"]
[null,"-",0,0,0,null,0,null,null,{"$f":"D760*G760","v":0}]
[null,"-",0,0,0,null,0,null,null,{"$f":"D761*G761","v":0}]
[null,null,null,"Custo total de atividades auxiliares",{"$nulls":5},{"$f":"SUM(J760:J761)","v":0}]
[{"$nulls":7},"Subtotal",null,{"$f":"J752+J758+J762+J753+J754","v":1.7167817938420347}]
[null,"E - TEMPO FIXO",null,"Código","Quantidade","Unidade",null,"Custo Unitário","Custo Unitário"]
[null,"-",0,"-",0,"t",null,0,null,{"$f":"ROUNDDOWN(E765*H765,4)","v":0}]
[null,"-",0,"-",0,"t",null,0,null,{"$f":"ROUNDDOWN(E766*H766,4)","v":0}]
[null,null,null,"Custo unitário total de tempo fixo",{"$nulls":5},{"$f":"SUM(J765:J766)","v":0}]
[null,"F - MOMENTO DE TRANSPORTE",null,"Quantidade","Unidade","DMT",null,null,null,"Custo Unitário"]
[{"$nulls":5},"LN","RP","P"]
[null,"-",0,0,"tkm"]
[null,"-",0,0,"tkm"]
[null,null,null,"Custo unitário total de transporte"]
[{"$nulls":5},"Custo unitário direto total",null,null,null,{"$f":"TRUNC(J763+J767,2)","v":1.71}]
[null,"Obs."]
[]
[{"$f":"A737+1","v":20},"1ª/GRD",{"$nulls":8},{"$f":"J813","v":48.29}]
[null,"OBRA:"," DRENAGEM E PAVIMENTAÇÃO - VIAS INTERNAS DO PARQUE DE EXPOSIÇÕES E RUA BOM JARDIM (BAIRRO SANTO ANTÔNIO) - SERRO-MG"]
[null,"Custo Unitário de Referência",null,null,"Minas Gerais"]
[{"$nulls":4}," Outubro/2024 ",null,null,"Produção da equipe ",9.1491000000000007,{"$f":"VLOOKUP(A776,ORÇAMENTO!$A$10:$L$69,7,1)","v":"M"}]
[null,94267,"GUIA (MEIO-FIO) E SARJETA CONJUGADOS DE CONCRETO, MOLDADA IN LOCO COM EXTRUSORA, 45 CM BASE (15 CM BASE DA GUIA + 30 CM BASE DA SARJETA) X 22 CM ALTURA",{"$nulls":5},"Valores em reais (R$)"]
[null,"A - EQUIPAMENTOS",null,"Quantidade","Utilização",null,"Custo Horário",null,null,"Custo"]
[{"$nulls":4},"Operativa","Improdutiva","Produtivo","Improdutivo",null,"Horário Total"]
[null,"E9102","Extrusora para sarjeta de concreto - 10,44 kW",1,0.17,0.83,46.516599999999997,32.439100000000003,null,{"$f":"D783*(E783*G783+F783*H783)","v":34.832275000000003}]
[null,"-",0,null,null,null,0,0,null,{"$f":"D784*(E784*G784+F784*H784)","v":0}]
[{"$nulls":7},"Custo horário total de equipamentos",null,{"$f":"SUM(J783:J784)","v":34.832275000000003}]
[null,"B - MÃO DE OBRA",null,"Quantidade","Unidade",null,"Custo Horário","Custo Horário Total"]
[null,"P9824","Servente",0.45300000000000001,"h",null,20.631399999999999,null,null,{"$f":"D787*G787","v":9.3460242000000004}]
[null,"P9802","Ajudante especializado",0.10929999999999999,"h",null,26.619499999999999,null,null,{"$f":"D788*G788","v":2.9095113499999998}]
[null,"P9821","Pedreiro",0.22650000000000001,"h",null,26.1035,null,null,{"$f":"D789*G789","v":5.9124427500000003}]
[null,null,null,"Custo horário total de mão de obra",{"$nulls":5},{"$f":"SUM(J787:J789)","v":18.167978300000001}]
[null,null,null,"Custo horário total de execução",{"$nulls":5},{"$f":"J785+J790","v":53.000253300000004}]
[null,null,null,"Custo unitário de execução",{"$nulls":5},{"$f":"J791/I779","v":5.7929472079220909}]
[{"$nulls":7},"Custo do FIC",null,0]
[{"$nulls":7},"Custo do FIT",null,0]
[null,"C - MATERIAL",null,"Quantidade","Unidade",null,"Preço Unitário","Custo Unitário"]
[null,"M0082","Areia média lavada",1.49E-2,"m³",null,165.2723,null,null,{"$f":"D796*G796","v":2.46255727}]
[null,"M0451","Concreto usinado - fck = 20 MPa (comercial)",6.7299999999999999E-2,"m³",null,570,null,null,{"$f":"D797*G797","v":38.360999999999997}]
[null,null,null,"Custo unitário total de material",{"$nulls":5},{"$f":"SUM(J796:J797)","v":40.823557269999995}]
[null,"D - ATIVIDADES AUXILIARES",null,"Quantidade","Unidade",null,"Custo Unitário","Custo Unitário"]
[null,1109669,"Argamassa de cimento e areia 1:3 - confecção em betoneira e lançamento manual - areia comercial",3.3E-3,"m³",null,508.55,null,null,{"$f":"D800*G800","v":1.678215}]
[null,"-",0,0,0,null,0,null,null,{"$f":"D801*G801","v":0}]
[null,null,null,"Custo total de atividades auxiliares",{"$nulls":5},{"$f":"SUM(J800:J801)","v":1.678215}]
[{"$nulls":7},"Subtotal",null,{"$f":"J792+J798+J802+J793+J794","v":48.294719477922087}]
[null,"E - TEMPO FIXO",null,"Código","Quantidade","Unidade",null,"Custo Unitário","Custo Unitário"]
[null,"-",0,"-",0,"t",null,0,null,{"$f":"ROUNDDOWN(E805*H805,4)","v":0}]
[null,"-",0,"-",0,"t",null,0,null,{"$f":"ROUNDDOWN(E806*H806,4)","v":0}]
[null,null,null,"Custo unitário total de tempo fixo",{"$nulls":5},{"$f":"SUM(J805:J806)","v":0}]
[null,"F - MOMENTO DE TRANSPORTE",null,"Quantidade","Unidade","DMT",null,null,null,"Custo Unitário"]
[{"$nulls":5},"LN","RP","P"]
[null,"-",0,0,"tkm","5914449","5914464","5914479"]
[null,"-",0,0,"tkm","5914449","5914464","5914479"]
[null,null,null,"Custo unitário total de transporte"]
[{"$nulls":5},"Custo unitário direto total",null,null,null,{"$f":"TRUNC(J803+J807,2)","v":48.29}]
[null,"Obs."]
[]
[23,"1ª/GRD",{"$nulls":8},{"$f":"J853","v":24.06}]
[null,"OBRA:"," DRENAGEM E PAVIMENTAÇÃO - VIAS INTERNAS DO PARQUE DE EXPOSIÇÕES E RUA BOM JARDIM (BAIRRO SANTO ANTÔNIO) - SERRO-MG"]
[null,"Custo Unitário de Referência",null,null,"Minas Gerais"]
[{"$nulls":4}," Outubro/2024 ",null,null,"Produção da equipe ",11.534000000000001,{"$f":"VLOOKUP(A816,ORÇAMENTO!$A$10:$L$69,7,1)","v":"M"}]
[null,94263,"GUIA (MEIO FIO) EM CONCRETO, MOLDADO IN LOCO COM EXTRUSORA - 13CM DE BASE X 22CM DE ALTURA - PARA TRAVAMENTO",{"$nulls":5},"Valores em reais (R$)"]
[null,"A - EQUIPAMENTOS",null,"Quantidade","Utilização",null,"Custo Horário",null,null,"Custo"]
[{"$nulls":4},"Operativa","Improdutiva","Produtivo","Improdutivo",null,"Horário Total"]
[null,"E9103","Extrusora para meio-fio de concreto - 10,44 kW",1,0.17,0.83,43.981299999999997,30.957000000000001,null,{"$f":"D823*(E823*G823+F823*H823)","v":33.171130999999995}]
[null,"-",0,null,null,null,0,0,null,{"$f":"D824*(E824*G824+F824*H824)","v":0}]
[{"$nulls":7},"Custo horário total de equipamentos",null,{"$f":"SUM(J823:J824)","v":33.171130999999995}]
[null,"B - MÃO DE OBRA",null,"Quantidade","Unidade",null,"Custo Horário","Custo Horário Total"]
[null,"P9821","Pedreiro",0.2039,"h",null,26.1035,null,null,{"$f":"D827*G827","v":5.3225036499999998}]
[null,"P9802","Ajudante especializado",8.6699999999999999E-2,"H",null,26.619499999999999,null,null,{"$f":"D828*G828","v":2.3079106499999997}]
[null,"P9824","Servente",0.4078,"h",null,20.631399999999999,null,null,{"$f":"D829*G829","v":8.4134849200000001}]
[null,null,null,"Custo horário total de mão de obra",{"$nulls":5},{"$f":"SUM(J827:J829)","v":16.04389922}]
[null,null,null,"Custo horário total de execução",{"$nulls":5},{"$f":"J825+J830","v":49.215030219999996}]
[null,null,null,"Custo unitário de execução",{"$nulls":5},{"$f":"J831/I819","v":4.2669525073695151}]
[{"$nulls":7},"Custo do FIC",null,0]
[{"$nulls":7},"Custo do FIT",null,0]
[null,"C - MATERIAL",null,"Quantidade","Unidade",null,"Preço Unitário","Custo Unitário"]
[null,"M0082","Areia média lavada",6.6E-3,"m³",null,165.2723,null,null,{"$f":"D836*G836","v":1.09079718}]
[null,"M0451","Concreto usinado - fck = 20 MPa (comercial)",3.1399999999999997E-2,"m³",null,570,null,null,{"$f":"D837*G837","v":17.898}]
[null,null,null,"Custo unitário total de material",{"$nulls":5},{"$f":"SUM(J836:J837)","v":18.988797179999999}]
[null,"D - ATIVIDADES AUXILIARES",null,"Quantidade","Unidade",null,"Custo Unitário","Custo Unitário"]
[null,1109669,"Argamassa de cimento e areia 1:3 - confecção em betoneira e lançamento manual - areia comercial",1.6000000000000001E-3,"m³",null,508.55,null,null,{"$f":"D840*G840","v":0.81368000000000007}]
[null,"-",0,null,0,null,0,null,null,{"$f":"D841*G841","v":0}]
[null,null,null,"Custo total de atividades auxiliares",{"$nulls":5},{"$f":"SUM(J840:J841)","v":0.81368000000000007}]
[{"$nulls":7},"Subtotal",null,{"$f":"J832+J838+J842+J833+J834","v":24.069429687369517}]
[null,"E - TEMPO FIXO",null,"Código","Quantidade","Unidade",null,"Custo Unitário","Custo Unitário"]
[null,"-",0,"-",0,"t",null,0,null,{"$f":"ROUNDDOWN(E845*H845,4)","v":0}]
[null,"-",0,"-",0,"t",null,0,null,{"$f":"ROUNDDOWN(E846*H846,4)","v":0}]
[null,null,null,"Custo unitário total de tempo fixo",{"$nulls":5},{"$f":"SUM(J845:J846)","v":0}]
[null,"F - MOMENTO DE TRANSPORTE",null,"Quantidade","Unidade","DMT",null,null,null,"Custo Unitário"]
[{"$nulls":5},"LN","RP","P"]
[null,"-",0,0,"tkm"]
[null,"-",0,0,"tkm"]
[null,null,null,"Custo unitário total de transporte"]
[{"$nulls":5},"Custo unitário direto total",null,null,null,{"$f":"TRUNC(J843+J847,2)","v":24.06}]
[null,"Obs."]
[]
[24,"1ª/GRD",{"$nulls":8},{"$f":"J894","v":746.26}]
[null,"OBRA:"," DRENAGEM E PAVIMENTAÇÃO - VIAS INTERNAS DO PARQUE DE EXPOSIÇÕES E RUA BOM JARDIM (BAIRRO SANTO ANTÔNIO) - SERRO-MG"]
[null,"Custo Unitário de Referência",null,null,"Minas Gerais"]
[{"$nulls":4}," Outubro/2024 ",null,null,"Produção da equipe ",1,{"$f":"VLOOKUP(A856,ORÇAMENTO!$A$10:$L$69,7,1)","v":"M3"}]
[null,94990,"EXECUÇÃO DE PASSEIO (CALÇADA) OU PISO DE CONCRETO COM CONCRETO MOLDADO IN LOCO, FEITO EM OBRA, ACABAMENTO CONVENCIONAL, NÃO ARMADO.",{"$nulls":5},"Valores em reais (R$)"]
[null,"A - EQUIPAMENTOS",null,"Quantidade","Utilização",null,"Custo Horário",null,null,"Custo"]
[{"$nulls":4},"Operativa","Improdutiva","Produtivo","Improdutivo",null,"Horário Total"]
[null,"-",0,null,null,null,0,0,null,{"$f":"D863*(E863*G863+F863*H863)","v":0}]
[null,"-",0,null,null,null,0,0,null,{"$f":"D864*(E864*G864+F864*H864)","v":0}]
[{"$nulls":7},"Custo horário total de equipamentos",null,{"$f":"SUM(J863:J864)","v":0}]
[null,"B - MÃO DE OBRA",null,"Quantidade","Unidade",null,"Custo Horário","Custo Horário Total"]
[null,"P9808","Carpinteiro",1.6268,"h",null,25.901299999999999,null,null,{"$f":"D867*G867","v":42.13623484}]
[null,"P9821","Pedreiro",1.4149,"h",null,26.1035,null,null,{"$f":"D868*G868","v":36.933842150000004}]
[null,"P9824","Servente",3.0417000000000001,"h",null,20.631399999999999,null,null,{"$f":"D869*G869","v":62.754529380000001}]
[null,null,null,"Custo horário total de mão de obra",{"$nulls":5},{"$f":"SUM(J867:J869)","v":141.82460637}]
[null,null,null,"Custo horário total de execução",{"$nulls":5},{"$f":"J865+J870","v":141.82460637}]
[null,null,null,"Custo unitário de execução",{"$nulls":5},{"$f":"J871/I859","v":141.82460637}]
[{"$nulls":7},"Custo do FIC",null,0]
[{"$nulls":7},"Custo do FIT",null,0]
[null,"C - MATERIAL",null,"Quantidade","Unidade",null,"Preço Unitário","Custo Unitário"]
[null,"M0451","Concreto usinado - fck = 20 MPa (comercial)",1.0315000000000001,"m³",null,570,null,null,{"$f":"D876*G876","v":587.95500000000004}]
[null,"M1205","Prego de ferro",0.2994,"kg",null,16.54,null,null,{"$f":"D877*G877","v":4.9520759999999999}]
[null,"M1358","Sarrafo em madeira de terceira - E = 2,5 cm e L = 5 cm",5.625,"m",null,2.0499999999999998,null,null,{"$f":"D878*G878","v":11.531249999999998}]
[null,null,null,"Custo unitário total de material",{"$nulls":5},{"$f":"SUM(J876:J878)","v":604.43832600000007}]
[null,"D - ATIVIDADES AUXILIARES",null,"Quantidade","Unidade",null,"Custo Unitário","Custo Unitário"]
[null,"-",0,null,0,null,0,null,null,{"$f":"D881*G881","v":0}]
[null,"-",0,null,0,null,0,null,null,{"$f":"D882*G882","v":0}]
[null,null,null,"Custo total de atividades auxiliares",{"$nulls":5},{"$f":"SUM(J881:J882)","v":0}]
[{"$nulls":7},"Subtotal",null,{"$f":"J872+J879+J883+J873+J874","v":746.26293237000004}]
[null,"E - TEMPO FIXO",null,"Código","Quantidade","Unidade",null,"Custo Unitário","Custo Unitário"]
[null,"-",0,"-",null,"t",null,0,null,{"$f":"ROUNDDOWN(E886*H886,4)","v":0}]
[null,"-",0,"-",null,"t",null,0,null,{"$f":"ROUNDDOWN(E887*H887,4)","v":0}]
[null,null,null,"Custo unitário total de tempo fixo",{"$nulls":5},{"$f":"SUM(J886:J887)","v":0}]
[null,"F - MOMENTO DE TRANSPORTE",null,"Quantidade","Unidade","DMT",null,null,null,"Custo Unitário"]
[{"$nulls":5},"LN","RP","P"]
[null,"-",0,null,"tkm"]
[null,"-",0,null,"tkm"]
[null,null,null,"Custo unitário total de transporte"]
[{"$nulls":5},"Custo unitário direto total",null,null,null,{"$f":"TRUNC(J884+J888,2)","v":746.26}]
[null,"Obs."]
[]
[25,"1ª/GRD",{"$nulls":8},{"$f":"J934","v":9.65}]
[null,"OBRA:"," DRENAGEM E PAVIMENTAÇÃO - VIAS INTERNAS DO PARQUE DE EXPOSIÇÕES E RUA BOM JARDIM (BAIRRO SANTO ANTÔNIO) - SERRO-MG"]
[null,"Custo Unitário de Referência",null,null,"Minas Gerais"]
[{"$nulls":4}," Outubro/2024 ",null,null,"Produção da equipe ",8.4602368866328259,{"$f":"VLOOKUP(A897,ORÇAMENTO!$A$10:$L$69,7,1)","v":"M"}]
[null,99063,"LOCAÇÃO DE REDE DE ÁGUA OU ESGOTO",{"$nulls":5},"Valores em reais (R$)"]
[null,"A - EQUIPAMENTOS",null,"Quantidade","Utilização",null,"Custo Horário",null,null,"Custo"]
[{"$nulls":4},"Operativa","Improdutiva","Produtivo","Improdutivo",null,"Horário Total"]
[null,"E9535","Serra circular com bancada - D = 30 cm - 4 kW",1,0.19,0.81,25.5639,25.221399999999999,null,{"$f":"D904*(E904*G904+F904*H904)","v":25.286475000000003}]
[null,"-",0,null,null,null,0,0,null,{"$f":"D905*(E905*G905+F905*H905)","v":0}]
[{"$nulls":7},"Custo horário total de equipamentos",null,{"$f":"SUM(J904:J905)","v":25.286475000000003}]
[null,"B - MÃO DE OBRA",null,"Quantidade","Unidade",null,"Custo Horário","Custo Horário Total"]
[null,"P9808","Carpinteiro",1,"h",null,25.901299999999999,null,null,{"$f":"D908*G908","v":25.901299999999999}]
[null,"P9802","Ajudante especializado",1,"h",null,26.619499999999999,null,null,{"$f":"D909*G909","v":26.619499999999999}]
[null,null,null,"Custo horário total de mão de obra",{"$nulls":5},{"$f":"SUM(J908:J909)","v":52.520799999999994}]
[null,null,null,"Custo horário total de execução",{"$nulls":5},{"$f":"J906+J910","v":77.807275000000004}]
[null,null,null,"Custo unitário de execução",{"$nulls":5},{"$f":"J911/I900","v":9.1968199049999999}]
[{"$nulls":7},"Custo do FIC",null,0]
[{"$nulls":7},"Custo do FIT",null,0]
[null,"C - MATERIAL",null,"Quantidade","Unidade",null,"Preço Unitário","Custo Unitário"]
[null,"M0284","Caibro de pinho - L = 7,5 cm e E = 7,5 cm",4.1300000000000003E-2,"m",null,8.6898,null,null,{"$f":"D916*G916","v":0.35888874000000004}]
[null,"M1205","Prego de ferro",6.9999999999999999E-4,"kg",null,16.54,null,null,{"$f":"D917*G917","v":1.1578E-2}]
[null,"M1358","Sarrafo em madeira de terceira - E = 2,5 cm e L = 5 cm",4.1300000000000003E-2,"m",null,2.0499999999999998,null,null,{"$f":"D918*G918","v":8.4665000000000004E-2}]
[null,null,null,"Custo unitário total de material",{"$nulls":5},{"$f":"SUM(J916:J918)","v":0.45513174000000001}]
[null,"D - ATIVIDADES AUXILIARES",null,"Quantidade","Unidade",null,"Custo Unitário","Custo Unitário"]
[null,"-",0,null,0,null,0,null,null,{"$f":"D921*G921","v":0}]
[null,"-",0,null,0,null,0,null,null,{"$f":"D922*G922","v":0}]
[null,null,null,"Custo total de atividades auxiliares",{"$nulls":5},{"$f":"SUM(J921:J922)","v":0}]
[{"$nulls":7},"Subtotal",null,{"$f":"J912+J919+J923+J913+J914","v":9.6519516450000005}]
[null,"E - TEMPO FIXO",null,"Código","Quantidade","Unidade",null,"Custo Unitário","Custo Unitário"]
[null,"-",0,"-",null,"t",null,0,null,{"$f":"ROUNDDOWN(E926*H926,4)","v":0}]
[null,"-",0,"-",null,"t",null,0,null,{"$f":"ROUNDDOWN(E927*H927,4)","v":0}]
[null,null,null,"Custo unitário total de tempo fixo",{"$nulls":5},{"$f":"SUM(J926:J927)","v":0}]
[null,"F - MOMENTO DE TRANSPORTE",null,"Quantidade","Unidade","DMT",null,null,null,"Custo Unitário"]
[{"$nulls":5},"LN","RP","P"]
[null,"-",0,null,"tkm"]
[null,"-",0,null,"tkm"]
[null,null,null,"Custo unitário total de transporte"]
[{"$nulls":5},"Custo unitário direto total",null,null,null,{"$f":"TRUNC(J924+J928,2)","v":9.65}]
[null,"Obs."]
[]
[26,"1ª/GRD",{"$nulls":8},{"$f":"J973","v":6.53}]
[null,"OBRA:"," DRENAGEM E PAVIMENTAÇÃO - VIAS INTERNAS DO PARQUE DE EXPOSIÇÕES E RUA BOM JARDIM (BAIRRO SANTO ANTÔNIO) - SERRO-MG"]
[null,"Custo Unitário de Referência",null,null,"Minas Gerais"]
[{"$nulls":4}," Outubro/2024 ",null,null,"Produção da equipe ",26,{"$f":"VLOOKUP(A937,ORÇAMENTO!$A$10:$L$69,7,1)","v":"M3"}]
[null,4805757,"ESCAVAÇÃO MECÂNICA DE VALA EM MATERIAL DE 1ª CATEGORIA",{"$nulls":5},"Valores em reais (R$)"]
[null,"A - EQUIPAMENTOS",null,"Quantidade","Utilização",null,"Custo Horário",null,null,"Custo"]
[{"$nulls":4},"Operativa","Improdutiva","Produtivo","Improdutivo",null,"Horário Total"]
[null,"E9526","Retroescavadeira de pneus - capacidade da caçamba da pá-carregadeira de 0,76 m³ e da retroescavadeira de 0,29 m³ - 58 kW ",1,1,0,145.78960000000001,74.024699999999996,null,{"$f":"D944*(E944*G944+F944*H944)","v":145.78960000000001}]
[null,"-",0,null,null,null,0,0,null,{"$f":"D945*(E945*G945+F945*H945)","v":0}]
[{"$nulls":7},"Custo horário total de equipamentos",null,{"$f":"SUM(J944:J945)","v":145.78960000000001}]
[null,"B - MÃO DE OBRA",null,"Quantidade","Unidade",null,"Custo Horário","Custo Horário Total"]
[null,"P9824","Servente",1,"h",null,20.631399999999999,null,null,{"$f":"D948*G948","v":20.631399999999999}]
[null,"-",0,null,0,null,0,null,null,{"$f":"D949*G949","v":0}]
[null,null,null,"Custo horário total de mão de obra",{"$nulls":5},{"$f":"SUM(J948:J949)","v":20.631399999999999}]
[null,null,null,"Custo horário total de execução",{"$nulls":5},{"$f":"J946+J950","v":166.42099999999999}]
[null,null,null,"Custo unitário de execução",{"$nulls":5},{"$f":"J951/I940","v":6.4008076923076924}]
[{"$nulls":7},"Custo do FIC",null,0.1308]
[{"$nulls":7},"Custo do FIT",null,0]
[null,"C - MATERIAL",null,"Quantidade","Unidade",null,"Preço Unitário","Custo Unitário"]
[null,"-",0,null,0,null,0,null,null,{"$f":"D956*G956","v":0}]
[null,"-",0,null,0,null,0,null,null,{"$f":"D957*G957","v":0}]
[null,null,null,"Custo unitário total de material",{"$nulls":5},{"$f":"SUM(J956:J957)","v":0}]
[null,"D - ATIVIDADES AUXILIARES",null,"Quantidade","Unidade",null,"Custo Unitário","Custo Unitário"]
[null,"-",0,null,0,null,0,null,null,{"$f":"D960*G960","v":0}]
[null,"-",0,null,0,null,0,null,null,{"$f":"D961*G961","v":0}]
[null,null,null,"Custo total de atividades auxiliares",{"$nulls":5},{"$f":"SUM(J960:J961)","v":0}]
[{"$nulls":7},"Subtotal",null,{"$f":"J952+J958+J962+J953+J954","v":6.5316076923076922}]
[null,"E - TEMPO FIXO",null,"Código","Quantidade","Unidade",null,"Custo Unitário","Custo Unitário"]
[null,"-",0,"-",null,"t",null,0,null,{"$f":"ROUNDDOWN(E965*H965,4)","v":0}]
[null,"-",0,"-",null,"t",null,0,null,{"$f":"ROUNDDOWN(E966*H966,4)","v":0}]
[null,null,null,"Custo unitário total de tempo fixo",{"$nulls":5},{"$f":"SUM(J965:J966)","v":0}]
[null,"F - MOMENTO DE TRANSPORTE",null,"Quantidade","Unidade","DMT",null,null,null,"Custo Unitário"]
[{"$nulls":5},"LN","RP","P"]
[null,"-",0,null,"tkm"]
[null,"-",0,null,"tkm"]
[null,null,null,"Custo unitário total de transporte"]
[{"$nulls":5},"Custo unitário direto total",null,null,null,{"$f":"TRUNC(J963+J967,2)","v":6.53}]
[null,"Obs."]
[]
[27,"1ª/GRD",{"$nulls":8},{"$f":"J1012","v":4.6399999999999997}]
[null,"OBRA:"," DRENAGEM E PAVIMENTAÇÃO - VIAS INTERNAS DO PARQUE DE EXPOSIÇÕES E RUA BOM JARDIM (BAIRRO SANTO ANTÔNIO) - SERRO-MG"]
[null,"Custo Unitário de Referência",null,null,"Minas Gerais"]
[{"$nulls":4}," Outubro/2024 ",null,null,"Produção da equipe ",4.4444400000000002,{"$f":"VLOOKUP(A976,ORÇAMENTO!$A$10:$L$69,7,1)","v":"M2"}]
[null,4805756,"APILOAMENTO MANUAL DE FUNDO DE VALA",{"$nulls":5},"Valores em reais (R$)"]
[null,"A - EQUIPAMENTOS",null,"Quantidade","Utilização",null,"Custo Horário",null,null,"Custo"]
[{"$nulls":4},"Operativa","Improdutiva","Produtivo","Improdutivo",null,"Horário Total"]
[null,"-",0,null,null,null,0,0,null,{"$f":"D983*(E983*G983+F983*H983)","v":0}]
[null,"-",0,null,null,null,0,0,null,{"$f":"D984*(E984*G984+F984*H984)","v":0}]
[{"$nulls":7},"Custo horário total de equipamentos",null,{"$f":"SUM(J983:J984)","v":0}]
[null,"B - MÃO DE OBRA",null,"Quantidade","Unidade",null,"Custo Horário","Custo Horário Total"]
[null,"P9824","Servente",1,"h",null,20.631399999999999,null,null,{"$f":"D987*G987","v":20.631399999999999}]
[null,"-",0,null,0,null,0,null,null,{"$f":"D988*G988","v":0}]
[null,null,null,"Custo horário total de mão de obra",{"$nulls":5},{"$f":"SUM(J987:J988)","v":20.631399999999999}]
[null,null,null,"Custo horário total de execução",{"$nulls":5},{"$f":"J985+J989","v":20.631399999999999}]
[null,null,null,"Custo unitário de execução",{"$nulls":5},{"$f":"J990/I979","v":4.6420696420696421}]
[{"$nulls":7},"Custo do FIC",null,0]
[{"$nulls":7},"Custo do FIT",null,0]
[null,"C - MATERIAL",null,"Quantidade","Unidade",null,"Preço Unitário","Custo Unitário"]
[null,"-",0,null,0,null,0,null,null,{"$f":"D995*G995","v":0}]
[null,"-",0,null,0,null,0,null,null,{"$f":"D996*G996","v":0}]
[null,null,null,"Custo unitário total de material",{"$nulls":5},{"$f":"SUM(J995:J996)","v":0}]
[null,"D - ATIVIDADES AUXILIARES",null,"Quantidade","Unidade",null,"Custo Unitário","Custo Unitário"]
[null,"-",0,null,0,null,0,null,null,{"$f":"D999*G999","v":0}]
[null,"-",0,null,0,null,0,null,null,{"$f":"D1000*G1000","v":0}]
[null,null,null,"Custo total de atividades auxiliares",{"$nulls":5},{"$f":"SUM(J999:J1000)","v":0}]
[{"$nulls":7},"Subtotal",null,{"$f":"J991+J997+J1001+J992+J993","v":4.6420696420696421}]
[null,"E - TEMPO FIXO",null,"Código","Quantidade","Unidade",null,"Custo Unitário","Custo Unitário"]
[null,"-",0,"-",null,"t",null,0,null,{"$f":"ROUNDDOWN(E1004*H1004,4)","v":0}]
[null,"-",0,"-",null,"t",null,0,null,{"$f":"ROUNDDOWN(E1005*H1005,4)","v":0}]
[null,null,null,"Custo unitário total de tempo fixo",{"$nulls":5},{"$f":"SUM(J1004:J1005)","v":0}]
[null,"F - MOMENTO DE TRANSPORTE",null,"Quantidade","Unidade","DMT",null,null,null,"Custo Unitário"]
[{"$nulls":5},"LN","RP","P"]
[null,"-",0,null,"tkm"]
[null,"-",0,null,"tkm"]
[null,null,null,"Custo unitário total de transporte"]
[{"$nulls":5},"Custo unitário direto total",null,null,null,{"$f":"TRUNC(J1002+J1006,2)","v":4.6399999999999997}]
[null,"Obs."]
[]
[28,"1ª/GRD",{"$nulls":8},{"$f":"J1054","v":469.56}]
[null,"OBRA:"," DRENAGEM E PAVIMENTAÇÃO - VIAS INTERNAS DO PARQUE DE EXPOSIÇÕES E RUA BOM JARDIM (BAIRRO SANTO ANTÔNIO) - SERRO-MG"]
[null,"Custo Unitário de Referência",null,null,"Minas Gerais"]
[{"$nulls":4}," Outubro/2024 ",null,null,"Produção da equipe ",3.9289900000000002,{"$f":"VLOOKUP(A1015,ORÇAMENTO!$A$10:$L$69,7,1)","v":"M3"}]
[null,1106057,"EXECUÇÃO DE BERÇO EM CONCRETO MAGRO, PREPARO EM BETONEIRA",{"$nulls":5},"Valores em reais (R$)"]
[null,"A - EQUIPAMENTOS",null,"Quantidade","Utilização",null,"Custo Horário",null,null,"Custo"]
[{"$nulls":4},"Operativa","Improdutiva","Produtivo","Improdutivo",null,"Horário Total"]
[null,"E9519","Betoneira com motor a gasolina com capacidade de 600 l - 10 kW",1,1,0,48.447800000000001,28.0122,null,{"$f":"D1022*(E1022*G1022+F1022*H1022)","v":48.447800000000001}]
[null,"E9071","Transportador manual carrinho de mão com capacidade de 80 l",4,0.88,0.12,0.66869999999999996,0.4546,null,{"$f":"D1023*(E1023*G1023+F1023*H1023)","v":2.5720320000000001}]
[null,"E9064","Transportador manual gerica com capacidade de 180 l",3,0.41,0.59,1.5044,1.0226999999999999,null,{"$f":"D1024*(E1024*G1024+F1024*H1024)","v":3.6605909999999993}]
[{"$nulls":7},"Custo horário total de equipamentos",null,{"$f":"SUM(J1022:J1024)","v":54.680422999999998}]
[null,"B - MÃO DE OBRA",null,"Quantidade","Unidade",null,"Custo Horário","Custo Horário Total"]
[null,"P9821","Pedreiro",1,"h",null,26.1035,null,null,{"$f":"D1027*G1027","v":26.1035}]
[null,"P9824","Servente",9,"h",null,20.631399999999999,null,null,{"$f":"D1028*G1028","v":185.68259999999998}]
[null,null,null,"Custo horário total de mão de obra",{"$nulls":5},{"$f":"SUM(J1027:J1028)","v":211.78609999999998}]
[null,null,null,"Custo horário total de execução",{"$nulls":5},{"$f":"J1025+J1029","v":266.466523}]
[null,null,null,"Custo unitário de execução",{"$nulls":5},{"$f":"J1030/I1018","v":67.82061623979699}]
[{"$nulls":7},"Custo do FIC",null,0]
[{"$nulls":7},"Custo do FIT",null,0]
[null,"C - MATERIAL",null,"Quantidade","Unidade",null,"Preço Unitário","Custo Unitário"]
[null,"M0082","Areia média lavada",0.59948000000000001,"m³",null,165.2723,null,null,{"$f":"D1035*G1035","v":99.077438404000006}]
[null,"M0192","Brita 2",0.73507999999999996,"m³",null,172.0985,null,null,{"$f":"D1036*G1036","v":126.50616538}]
[null,"M0424","Cimento Portland CP II - 32 - saco",280.53417999999999,"kg",null,0.58350000000000002,null,null,{"$f":"D1037*G1037","v":163.69169403000001}]
[null,null,null,"Custo unitário total de material",{"$nulls":5},{"$f":"SUM(J1035:J1037)","v":389.275297814}]
[null,"D - ATIVIDADES AUXILIARES",null,"Quantidade","Unidade",null,"Custo Unitário","Custo Unitário"]
[null,"-",0,null,0,null,0,null,null,{"$f":"D1040*G1040","v":0}]
[null,"-",0,null,0,null,0,null,null,{"$f":"D1041*G1041","v":0}]
[null,null,null,"Custo total de atividades auxiliares",{"$nulls":5},{"$f":"SUM(J1040:J1041)","v":0}]
[{"$nulls":7},"Subtotal",null,{"$f":"J1031+J1038+J1042+J1032+J1033","v":457.095914053797}]
[null,"E - TEMPO FIXO",null,"Código","Quantidade","Unidade",null,"Custo Unitário","Custo Unitário"]
[null,"M0082","Areia média lavada",5914647,0.89922000000000002,"t",null,1.78,null,{"$f":"ROUNDDOWN(E1045*H1045,4)","v":1.6006}]
[null,"M0192","Brita 2",5914647,1.1026199999999999,"t",null,1.78,null,{"$f":"ROUNDDOWN(E1046*H1046,4)","v":1.9625999999999999}]
[null,"M0424","Cimento Portland CP II - 32 - saco",5914655,0.28053,"t",null,31.73,null,{"$f":"ROUNDDOWN(E1047*H1047,4)","v":8.9011999999999993}]
[null,null,null,"Custo unitário total de tempo fixo",{"$nulls":5},{"$f":"SUM(J1045:J1047)","v":12.464399999999999}]
[null,"F - MOMENTO DE TRANSPORTE",null,"Quantidade","Unidade","DMT",null,null,null,"Custo Unitário"]
[{"$nulls":5},"LN","RP","P"]
[null,"-",0,null,"tkm"]
[null,"-",0,null,"tkm"]
[null,null,null,"Custo unitário total de transporte"]
[{"$nulls":5},"Custo unitário direto total",null,null,null,{"$f":"TRUNC(J1043+J1048,2)","v":469.56}]
[null,"Obs."]
[]
[29,"1ª/GRD",{"$nulls":8},{"$f":"J1102","v":21.68}]
[null,"OBRA:"," DRENAGEM E PAVIMENTAÇÃO - VIAS INTERNAS DO PARQUE DE EXPOSIÇÕES E RUA BOM JARDIM (BAIRRO SANTO ANTÔNIO) - SERRO-MG"]
[null,"Custo Unitário de Referência",null,null,"Minas Gerais"]
[{"$nulls":4}," Outubro/2024 ",null,null,"Produção da equipe ",1,{"$f":"VLOOKUP(A1057,ORÇAMENTO!$A$10:$L$69,7,1)","v":"M3"}]
[null,2108167,"ESCORAMENTO DE VALA TIPO PONTALETEAMENTO",{"$nulls":5},"Valores em reais (R$)"]
[null,"A - EQUIPAMENTOS",null,"Quantidade","Utilização",null,"Custo Horário",null,null,"Custo"]
[{"$nulls":4},"Operativa","Improdutiva","Produtivo","Improdutivo",null,"Horário Total"]
[null,"E9066","Grupo gerador - 14 kVA",4.4269999999999997E-2,1,null,18.274100000000001,4.6045999999999996,null,{"$f":"D1064*(E1064*G1064+F1064*H1064)","v":0.80899440700000003}]
[null,"E9535","Serra circular com bancada - D = 30 cm - 4 kW",4.4269999999999997E-2,1,null,25.5639,25.221399999999999,null,{"$f":"D1065*(E1065*G1065+F1065*H1065)","v":1.1317138529999999}]
[{"$nulls":7},"Custo horário total de equipamentos",null,{"$f":"SUM(J1064:J1065)","v":1.9407082600000001}]
[null,"B - MÃO DE OBRA",null,"Quantidade","Unidade",null,"Custo Horário","Custo Horário Total"]
[null,"P9801","Ajudante",0.25,"h",null,22.636700000000001,null,null,{"$f":"D1068*G1068","v":5.6591750000000003}]
[null,"P9808","Carpinteiro",0.25,"h",null,25.901299999999999,null,null,{"$f":"D1069*G1069","v":6.4753249999999998}]
[null,null,null,"Custo horário total de mão de obra",{"$nulls":5},{"$f":"SUM(J1068:J1069)","v":12.134499999999999}]
[null,null,null,"Custo horário total de execução",{"$nulls":5},{"$f":"J1066+J1070","v":14.07520826}]
[null,null,null,"Custo unitário de execução",{"$nulls":5},{"$f":"J1071/I1060","v":14.07520826}]
[{"$nulls":7},"Custo do FIC",null,0]
[{"$nulls":7},"Custo do FIT",null,0]
[null,"C - MATERIAL",null,"Quantidade","Unidade",null,"Preço Unitário","Custo Unitário"]
[null,"M0301","Pontalete para escoramento - D = 10 cm",0.49907000000000001,"m",null,4.2942,null,null,{"$f":"D1076*G1076","v":2.1431063940000001}]
[null,"M1205","Prego de ferro",2.6460000000000001E-2,"kg",null,16.54,null,null,{"$f":"D1077*G1077","v":0.43764839999999999}]
[null,"M0290","Tábua - E = 2,5 cm e L = 10 cm",0.32083,"m",null,4.3109999999999999,null,null,1.38309813]
[null,"M0289","Tábua - E = 2,5 cm e L = 15 cm",3.5650000000000001E-2,"m",null,5.4832999999999998,null,null,0.19547964500000001]
[null,"M0286","Tábua - E = 2,5 cm e L = 30 cm",0.21389,"m",null,15.1739,null,null,{"$f":"D1080*G1080","v":3.2455454709999998}]
[null,null,null,"Custo unitário total de material",{"$nulls":5},{"$f":"SUM(J1076:J1080)","v":7.4048780399999998}]
[null,"D - ATIVIDADES AUXILIARES",null,"Quantidade","Unidade",null,"Custo Unitário","Custo Unitário"]
[null,"-",0,null,0,null,0,null,null,{"$f":"D1083*G1083","v":0}]
[null,"-",0,null,0,null,0,null,null,{"$f":"D1084*G1084","v":0}]
[null,null,null,"Custo total de atividades auxiliares",{"$nulls":5},{"$f":"SUM(J1083:J1084)","v":0}]
[{"$nulls":7},"Subtotal",null,{"$f":"J1072+J1081+J1085+J1073+J1074","v":21.4800863}]
[null,"E - TEMPO FIXO",null,"Código","Quantidade","Unidade",null,"Custo Unitário","Custo Unitário"]
[null,"M0301","Pontalete para escoramento - D = 10 cm",5914655,3.9199999999999999E-3,"t",null,31.73,null,{"$f":"ROUNDDOWN(E1088*H1088,4)","v":0.12429999999999999}]
[null,"M1205","Prego de ferro",5914655,3.0000000000000001E-5,"t",null,31.73,null,{"$f":"ROUNDDOWN(E1089*H1089,4)","v":8.9999999999999998E-4}]
[null,"M0290","Tábua - E = 2,5 cm e L = 10 cm",5914655,8.0000000000000004E-4,"t",null,31.73,null,2.53E-2]
[null,"M0289","Tábua - E = 2,5 cm e L = 15 cm",5914655,1.2999999999999999E-4,"t",null,31.73,null,4.1000000000000003E-3]
[null,"M0286","Tábua - E = 2,5 cm e L = 30 cm",5914655,1.6000000000000001E-3,"t",null,31.73,null,{"$f":"ROUNDDOWN(E1092*H1092,4)","v":5.0700000000000002E-2}]
[null,null,null,"Custo unitário total de tempo fixo",{"$nulls":5},{"$f":"SUM(J1088:J1092)","v":0.20529999999999998}]
[null,"F - MOMENTO DE TRANSPORTE",null,"Quantidade","Unidade","DMT",null,null,null,"Custo Unitário"]
[{"$nulls":5},"LN","RP","P"]
[null,"M0301","Pontalete para escoramento - D = 10 cm",3.9199999999999999E-3,"tkm"]
[null,"M1205","Prego de ferro",3.0000000000000001E-5,"tkm"]
[null,"M0290","Tábua - E = 2,5 cm e L = 10 cm",8.0000000000000004E-4,"tkm"]
[null,"M0289","Tábua - E = 2,5 cm e L = 15 cm",1.2999999999999999E-4,"tkm"]
[null,"M0286","Tábua - E = 2,5 cm e L = 30 cm",1.6000000000000001E-3,"tkm"]
[null,null,null,"Custo unitário total de transporte"]
[{"$nulls":5},"Custo unitário direto total",null,null,null,{"$f":"TRUNC(J1086+J1093,2)","v":21.68}]
[null,"Obs."]
[]
[30,"1ª/GRD",{"$nulls":8},{"$f":"J1141","v":170.28}]
[null,"OBRA:"," DRENAGEM E PAVIMENTAÇÃO - VIAS INTERNAS DO PARQUE DE EXPOSIÇÕES E RUA BOM JARDIM (BAIRRO SANTO ANTÔNIO) - SERRO-MG"]
[null,"Custo Unitário de Referência",null,null,"Minas Gerais"]
[{"$nulls":4}," Outubro/2024 ",null,null,"Produção da equipe ",9.9600000000000009,{"$f":"VLOOKUP(A1105,ORÇAMENTO!$A$10:$L$69,7,1)","v":"M"}]
[null,"2003869a","TUBO DE CONCRETO PA-1 PARA REDES COLETORAS DE ÁGUAS PLUVIAIS, DIÂMETRO = 400MM - FORNECIMENTO E ASSENTAMENTO",{"$nulls":5},"Valores em reais (R$)"]
[null,"A - EQUIPAMENTOS",null,"Quantidade","Utilização",null,"Custo Horário",null,null,"Custo"]
[{"$nulls":4},"Operativa","Improdutiva","Produtivo","Improdutivo",null,"Horário Total"]
[null,"E9686","Caminhão carroceria com guindauto com capacidade de 20 t.m - 136 kW",1,1,0,304.03199999999998,114.4121,null,{"$f":"D1112*(E1112*G1112+F1112*H1112)","v":304.03199999999998}]
[null,"-",0,null,null,null,0,0,null,{"$f":"D1113*(E1113*G1113+F1113*H1113)","v":0}]
[{"$nulls":7},"Custo horário total de equipamentos",null,{"$f":"SUM(J1112:J1113)","v":304.03199999999998}]
[null,"B - MÃO DE OBRA",null,"Quantidade","Unidade",null,"Custo Horário","Custo Horário Total"]
[null,"P9821","Pedreiro",1,"h",null,26.1035,null,null,{"$f":"D1116*G1116","v":26.1035}]
[null,"P9824","Servente",3,"h",null,20.631399999999999,null,null,{"$f":"D1117*G1117","v":61.894199999999998}]
[null,null,null,"Custo horário total de mão de obra",{"$nulls":5},{"$f":"SUM(J1116:J1117)","v":87.997699999999995}]
[null,null,null,"Custo horário total de execução",{"$nulls":5},{"$f":"J1114+J1118","v":392.02969999999999}]
[null,null,null,"Custo unitário de execução",{"$nulls":5},{"$f":"J1119/I1108","v":39.360411646586343}]
[{"$nulls":7},"Custo do FIC",null,0]
[{"$nulls":7},"Custo do FIT",null,0]
[null,"C - MATERIAL",null,"Quantidade","Unidade",null,"Preço Unitário","Custo Unitário"]
[null,"M2163","Tubo de concreto armado PA1 - D = 0,40 m",1,"m",null,129.9083,null,null,{"$f":"D1124*G1124","v":129.9083}]
[null,"-",0,null,0,null,0,null,null,{"$f":"D1125*G1125","v":0}]
[null,null,null,"Custo unitário total de material",{"$nulls":5},{"$f":"SUM(J1124:J1125)","v":129.9083}]
[null,"D - ATIVIDADES AUXILIARES",null,"Quantidade","Unidade",null,"Custo Unitário","Custo Unitário"]
[null,1109669,"Argamassa de cimento e areia 1:3 - confecção em betoneira e lançamento manual - areia comercial",1.9920000000000003E-3,"m³",null,508.55,null,null,{"$f":"D1128*G1128","v":1.0130316000000001}]
[null,"-",0,null,0,null,0,null,null,{"$f":"D1129*G1129","v":0}]
[null,null,null,"Custo total de atividades auxiliares",{"$nulls":5},{"$f":"SUM(J1128:J1129)","v":1.0130316000000001}]
[{"$nulls":7},"Subtotal",null,{"$f":"J1120+J1126+J1130+J1121+J1122","v":170.28174324658633}]
[null,"E - TEMPO FIXO",null,"Código","Quantidade","Unidade",null,"Custo Unitário","Custo Unitário"]
[null,"-",0,"-",null,"t",null,0,null,{"$f":"ROUNDDOWN(E1133*H1133,4)","v":0}]
[null,"-",0,"-",null,"t",null,0,null,{"$f":"ROUNDDOWN(E1134*H1134,4)","v":0}]
[null,null,null,"Custo unitário total de tempo fixo",{"$nulls":5},{"$f":"SUM(J1133:J1134)","v":0}]
[null,"F - MOMENTO DE TRANSPORTE",null,"Quantidade","Unidade","DMT",null,null,null,"Custo Unitário"]
[{"$nulls":5},"LN","RP","P"]
[null,"M2187","Tubo de concreto armado PA1 - D = 0,50 m",0.23599999999999999,"tkm"]
[null,"-",0,null,"tkm"]
[null,null,null,"Custo unitário total de transporte"]
[{"$nulls":5},"Custo unitário direto total",null,null,null,{"$f":"TRUNC(J1131+J1135,2)","v":170.28}]
[null,"Obs."]
[]
[31,"1ª/GRD",{"$nulls":8},{"$f":"J1180","v":266.02}]
[null,"OBRA:"," DRENAGEM E PAVIMENTAÇÃO - VIAS INTERNAS DO PARQUE DE EXPOSIÇÕES E RUA BOM JARDIM (BAIRRO SANTO ANTÔNIO) - SERRO-MG"]
[null,"Custo Unitário de Referência",null,null,"Minas Gerais"]
[{"$nulls":4}," Outubro/2024 ",null,null,"Produção da equipe ",8.3000000000000007,{"$f":"VLOOKUP(A1144,ORÇAMENTO!$A$10:$L$69,7,1)","v":"M"}]
[null,2003822,"TUBO DE CONCRETO PA-1 PARA REDES COLETORAS DE ÁGUAS PLUVIAIS, DIÂMETRO = 600MM - FORNECIMENTO E ASSENTAMENTO",{"$nulls":5},"Valores em reais (R$)"]
[null,"A - EQUIPAMENTOS",null,"Quantidade","Utilização",null,"Custo Horário",null,null,"Custo"]
[{"$nulls":4},"Operativa","Improdutiva","Produtivo","Improdutivo",null,"Horário Total"]
[null,"E9686","Caminhão carroceria com guindauto com capacidade de 20 t.m - 136 kW",1,1,0,304.03199999999998,114.4121,null,{"$f":"D1151*(E1151*G1151+F1151*H1151)","v":304.03199999999998}]
[null,"-",0,null,null,null,0,0,null,{"$f":"D1152*(E1152*G1152+F1152*H1152)","v":0}]
[{"$nulls":7},"Custo horário total de equipamentos",null,{"$f":"SUM(J1151:J1152)","v":304.03199999999998}]
[null,"B - MÃO DE OBRA",null,"Quantidade","Unidade",null,"Custo Horário","Custo Horário Total"]
[null,"P9821","Pedreiro",1,"h",null,26.1035,null,null,{"$f":"D1155*G1155","v":26.1035}]
[null,"P9824","Servente",3,"h",null,20.631399999999999,null,null,{"$f":"D1156*G1156","v":61.894199999999998}]
[null,null,null,"Custo horário total de mão de obra",{"$nulls":5},{"$f":"SUM(J1155:J1156)","v":87.997699999999995}]
[null,null,null,"Custo horário total de execução",{"$nulls":5},{"$f":"J1153+J1157","v":392.02969999999999}]
[null,null,null,"Custo unitário de execução",{"$nulls":5},{"$f":"J1158/I1147","v":47.232493975903608}]
[{"$nulls":7},"Custo do FIC",null,0]
[{"$nulls":7},"Custo do FIT",null,0]
[null,"C - MATERIAL",null,"Quantidade","Unidade",null,"Preço Unitário","Custo Unitário"]
[null,"M2167","Tubo de concreto armado PA1 - D = 0,60 m",1,"m",null,216.60329999999999,null,null,{"$f":"D1163*G1163","v":216.60329999999999}]
[null,"-",0,null,0,null,0,null,null,{"$f":"D1164*G1164","v":0}]
[null,null,null,"Custo unitário total de material",{"$nulls":5},{"$f":"SUM(J1163:J1164)","v":216.60329999999999}]
[null,"D - ATIVIDADES AUXILIARES",null,"Quantidade","Unidade",null,"Custo Unitário","Custo Unitário"]
[null,1109669,"Argamassa de cimento e areia 1:3 - confecção em betoneira e lançamento manual - areia comercial",4.3E-3,"m³",null,508.55,null,null,{"$f":"D1167*G1167","v":2.1867649999999998}]
[null,"-",0,null,0,null,0,null,null,{"$f":"D1168*G1168","v":0}]
[null,null,null,"Custo total de atividades auxiliares",{"$nulls":5},{"$f":"SUM(J1167:J1168)","v":2.1867649999999998}]
[{"$nulls":7},"Subtotal",null,{"$f":"J1159+J1165+J1169+J1160+J1161","v":266.02255897590356}]
[null,"E - TEMPO FIXO",null,"Código","Quantidade","Unidade",null,"Custo Unitário","Custo Unitário"]
[null,"-",0,"-",null,"t",null,0,null,{"$f":"ROUNDDOWN(E1172*H1172,4)","v":0}]
[null,"-",0,"-",null,"t",null,0,null,{"$f":"ROUNDDOWN(E1173*H1173,4)","v":0}]
[null,null,null,"Custo unitário total de tempo fixo",{"$nulls":5},{"$f":"SUM(J1172:J1173)","v":0}]
[null,"F - MOMENTO DE TRANSPORTE",null,"Quantidade","Unidade","DMT",null,null,null,"Custo Unitário"]
[{"$nulls":5},"LN","RP","P"]
[null,"-",0,null,"tkm"]
[null,"-",0,null,"tkm"]
[null,null,null,"Custo unitário total de transporte"]
[{"$nulls":5},"Custo unitário direto total",null,null,null,{"$f":"TRUNC(J1170+J1174,2)","v":266.02}]
[null,"Obs."]
[]
[32,"1ª/GRD",{"$nulls":8},{"$f":"J1219","v":443.94}]
[null,"OBRA:"," DRENAGEM E PAVIMENTAÇÃO - VIAS INTERNAS DO PARQUE DE EXPOSIÇÕES E RUA BOM JARDIM (BAIRRO SANTO ANTÔNIO) - SERRO-MG"]
[null,"Custo Unitário de Referência",null,null,"Minas Gerais"]
[{"$nulls":4}," Outubro/2024 ",null,null,"Produção da equipe ",6.2249999999999996,{"$f":"VLOOKUP(A1183,ORÇAMENTO!$A$10:$L$69,7,1)","v":"M"}]
[null,2003826,"TUBO DE CONCRETO PA-1 PARA REDES COLETORAS DE ÁGUAS PLUVIAIS, DIÂMETRO = 800MM - FORNECIMENTO E ASSENTAMENTO",{"$nulls":5},"Valores em reais (R$)"]
[null,"A - EQUIPAMENTOS",null,"Quantidade","Utilização",null,"Custo Horário",null,null,"Custo"]
[{"$nulls":4},"Operativa","Improdutiva","Produtivo","Improdutivo",null,"Horário Total"]
[null,"E9686","Caminhão carroceria com guindauto com capacidade de 20 t.m - 136 kW",1,1,0,304.03199999999998,114.4121,null,{"$f":"D1190*(E1190*G1190+F1190*H1190)","v":304.03199999999998}]
[null,"-",0,null,null,null,0,0,null,{"$f":"D1191*(E1191*G1191+F1191*H1191)","v":0}]
[{"$nulls":7},"Custo horário total de equipamentos",null,{"$f":"SUM(J1190:J1191)","v":304.03199999999998}]
[null,"B - MÃO DE OBRA",null,"Quantidade","Unidade",null,"Custo Horário","Custo Horário Total"]
[null,"P9821","Pedreiro",1,"h",null,26.1035,null,null,{"$f":"D1194*G1194","v":26.1035}]
[null,"P9824","Servente",3,"h",null,20.631399999999999,null,null,{"$f":"D1195*G1195","v":61.894199999999998}]
[null,null,null,"Custo horário total de mão de obra",{"$nulls":5},{"$f":"SUM(J1194:J1195)","v":87.997699999999995}]
[null,null,null,"Custo horário total de execução",{"$nulls":5},{"$f":"J1192+J1196","v":392.02969999999999}]
[null,null,null,"Custo unitário de execução",{"$nulls":5},{"$f":"J1197/I1186","v":62.976658634538154}]
[{"$nulls":7},"Custo do FIC",null,0]
[{"$nulls":7},"Custo do FIT",null,0]
[null,"C - MATERIAL",null,"Quantidade","Unidade",null,"Preço Unitário","Custo Unitário"]
[null,"M2171","Tubo de concreto armado PA1 - D = 0,80 m",1,"m",null,378.16660000000002,null,null,{"$f":"D1202*G1202","v":378.16660000000002}]
[null,"-",0,null,0,null,0,null,null,{"$f":"D1203*G1203","v":0}]
[null,null,null,"Custo unitário total de material",{"$nulls":5},{"$f":"SUM(J1202:J1203)","v":378.16660000000002}]
[null,"D - ATIVIDADES AUXILIARES",null,"Quantidade","Unidade",null,"Custo Unitário","Custo Unitário"]
[null,1109669,"Argamassa de cimento e areia 1:3 - confecção em betoneira e lançamento manual - areia comercial",5.4999999999999997E-3,"m³",null,508.55,null,null,{"$f":"D1206*G1206","v":2.7970250000000001}]
[null,"-",0,null,0,null,0,null,null,{"$f":"D1207*G1207","v":0}]
[null,null,null,"Custo total de atividades auxiliares",{"$nulls":5},{"$f":"SUM(J1206:J1207)","v":2.7970250000000001}]
[{"$nulls":7},"Subtotal",null,{"$f":"J1198+J1204+J1208+J1199+J1200","v":443.94028363453816}]
[null,"E - TEMPO FIXO",null,"Código","Quantidade","Unidade",null,"Custo Unitário","Custo Unitário"]
[null,"-",0,"-",null,"t",null,0,null,{"$f":"ROUNDDOWN(E1211*H1211,4)","v":0}]
[null,"-",0,"-",null,"t",null,0,null,{"$f":"ROUNDDOWN(E1212*H1212,4)","v":0}]
[null,null,null,"Custo unitário total de tempo fixo",{"$nulls":5},{"$f":"SUM(J1211:J1212)","v":0}]
[null,"F - MOMENTO DE TRANSPORTE",null,"Quantidade","Unidade","DMT",null,null,null,"Custo Unitário"]
[{"$nulls":5},"LN","RP","P"]
[null,"-",0,null,"tkm"]
[null,"-",0,null,"tkm"]
[null,null,null,"Custo unitário total de transporte"]
[{"$nulls":5},"Custo unitário direto total",null,null,null,{"$f":"TRUNC(J1209+J1213,2)","v":443.94}]
[null,"Obs."]
[]
[33,"1ª/GRD",{"$nulls":8},{"$f":"J1262","v":1728.59}]
[null,"OBRA:"," DRENAGEM E PAVIMENTAÇÃO - VIAS INTERNAS DO PARQUE DE EXPOSIÇÕES E RUA BOM JARDIM (BAIRRO SANTO ANTÔNIO) - SERRO-MG"]
[null,"Custo Unitário de Referência",null,null,"Minas Gerais"]
[{"$nulls":4}," Outubro/2024 ",null,null,"Produção da equipe ",1,{"$f":"VLOOKUP(A1222,ORÇAMENTO!$A$10:$L$69,7,1)","v":"UN."}]
[null,2003634,"BOCA DE LOBO DUPLA COM GRELHA DE CONCRETO - BLDG 01",{"$nulls":5},"Valores em reais (R$)"]
[null,"A - EQUIPAMENTOS",null,"Quantidade","Utilização",null,"Custo Horário",null,null,"Custo"]
[{"$nulls":4},"Operativa","Improdutiva","Produtivo","Improdutivo",null,"Horário Total"]
[null,"-",0,null,null,null,0,0,null,{"$f":"D1229*(E1229*G1229+F1229*H1229)","v":0}]
[null,"-",0,null,null,null,0,0,null,{"$f":"D1230*(E1230*G1230+F1230*H1230)","v":0}]
[{"$nulls":7},"Custo horário total de equipamentos",null,{"$f":"SUM(J1229:J1230)","v":0}]
[null,"B - MÃO DE OBRA",null,"Quantidade","Unidade",null,"Custo Horário","Custo Horário Total"]
[null,"P9824","Servente",0.2,"h",null,20.631399999999999,null,null,{"$f":"D1233*G1233","v":4.1262800000000004}]
[null,"-",0,null,0,null,0,null,null,{"$f":"D1234*G1234","v":0}]
[null,null,null,"Custo horário total de mão de obra",{"$nulls":5},{"$f":"SUM(J1233:J1234)","v":4.1262800000000004}]
[null,null,null,"Custo horário total de execução",{"$nulls":5},{"$f":"J1231+J1235","v":4.1262800000000004}]
[null,null,null,"Custo unitário de execução",{"$nulls":5},{"$f":"J1236/I1225","v":4.1262800000000004}]
[{"$nulls":7},"Custo do FIC",null,0]
[{"$nulls":7},"Custo do FIT",null,0]
[null,"C - MATERIAL",null,"Quantidade","Unidade",null,"Preço Unitário","Custo Unitário"]
[null,"-",0,null,0,null,0,null,null,{"$f":"D1241*G1241","v":0}]
[null,"-",0,null,0,null,0,null,null,{"$f":"D1242*G1242","v":0}]
[null,null,null,"Custo unitário total de material",{"$nulls":5},{"$f":"SUM(J1241:J1242)","v":0}]
[null,"D - ATIVIDADES AUXILIARES",null,"Quantidade","Unidade",null,"Custo Unitário","Custo Unitário"]
[null,2009619,"Alvenaria de blocos de concreto 19 x 19 x 39 cm com espessura de 20 cm - areia comercial",6.37,"m²",null,116.08,null,null,{"$f":"D1245*G1245","v":739.42960000000005}]
[null,1109669,"Argamassa de cimento e areia 1:3 - confecção em betoneira e lançamento manual - areia comercial",0.11,"m³",null,508.55,null,null,{"$f":"D1246*G1246","v":55.9405}]
[null,407819,"Armação em aço CA-50 - fornecimento, preparo e colocação",15.1,"kg",null,11.85,null,null,178.935]
[null,1107892,"Concreto fck = 20 MPa - confecção em betoneira e lançamento manual - areia e brita comerciais",0.46,"m³",null,483.33,null,null,222.33180000000002]
[null,1107896,"Concreto fck = 25 MPa - confecção em betoneira e lançamento manual - areia e brita comerciais",0.11,"m³",null,501.91,null,null,55.210100000000004]
[null,3103302,"Fôrmas de tábuas de pinho para dispositivos de drenagem - utilização de 3 vezes - confecção, instalação e retirada",6.6,"m²",null,71.61,null,null,{"$f":"D1250*G1250","v":472.62599999999998}]
[null,null,null,"Custo total de atividades auxiliares",{"$nulls":5},{"$f":"SUM(J1245:J1250)","v":1724.473}]
[{"$nulls":7},"Subtotal",null,{"$f":"J1237+J1243+J1251+J1238+J1239","v":1728.5992799999999}]
[null,"E - TEMPO FIXO",null,"Código","Quantidade","Unidade",null,"Custo Unitário","Custo Unitário"]
[null,"-",0,"-",null,"t",null,0,null,{"$f":"ROUNDDOWN(E1254*H1254,4)","v":0}]
[null,"-",0,"-",null,"t",null,0,null,{"$f":"ROUNDDOWN(E1255*H1255,4)","v":0}]
[null,null,null,"Custo unitário total de tempo fixo",{"$nulls":5},{"$f":"SUM(J1254:J1255)","v":0}]
[null,"F - MOMENTO DE TRANSPORTE",null,"Quantidade","Unidade","DMT",null,null,null,"Custo Unitário"]
[{"$nulls":5},"LN","RP","P"]
[null,"-",0,null,"tkm"]
[null,"-",0,null,"tkm"]
[null,null,null,"Custo unitário total de transporte"]
[{"$nulls":5},"Custo unitário direto total",null,null,null,{"$f":"TRUNC(J1252+J1256,2)","v":1728.59}]
[null,"Obs."]
[]
[34,"1ª/GRD",{"$nulls":8},{"$f":"J1302","v":2890.3}]
[null,"OBRA:"," DRENAGEM E PAVIMENTAÇÃO - VIAS INTERNAS DO PARQUE DE EXPOSIÇÕES E RUA BOM JARDIM (BAIRRO SANTO ANTÔNIO) - SERRO-MG"]
[null,"Custo Unitário de Referência",null,null,"Minas Gerais"]
[{"$nulls":4}," Outubro/2024 ",null,null,"Produção da equipe ",1,{"$f":"VLOOKUP(A1265,ORÇAMENTO!$A$10:$L$69,7,1)","v":"UN."}]
[null,2003685,"POÇO DE VISITA - PVI 05",{"$nulls":5},"Valores em reais (R$)"]
[null,"A - EQUIPAMENTOS",null,"Quantidade","Utilização",null,"Custo Horário",null,null,"Custo"]
[{"$nulls":4},"Operativa","Improdutiva","Produtivo","Improdutivo",null,"Horário Total"]
[null,"-",0,null,null,null,0,0,null,{"$f":"D1272*(E1272*G1272+F1272*H1272)","v":0}]
[null,"-",0,null,null,null,0,0,null,{"$f":"D1273*(E1273*G1273+F1273*H1273)","v":0}]
[{"$nulls":7},"Custo horário total de equipamentos",null,{"$f":"SUM(J1272:J1273)","v":0}]
[null,"B - MÃO DE OBRA",null,"Quantidade","Unidade",null,"Custo Horário","Custo Horário Total"]
[null,"-",0,null,0,null,0,null,null,{"$f":"D1276*G1276","v":0}]
[null,"-",0,null,0,null,0,null,null,{"$f":"D1277*G1277","v":0}]
[null,null,null,"Custo horário total de mão de obra",{"$nulls":5},{"$f":"SUM(J1276:J1277)","v":0}]
[null,null,null,"Custo horário total de execução",{"$nulls":5},{"$f":"J1274+J1278","v":0}]
[null,null,null,"Custo unitário de execução",{"$nulls":5},{"$f":"J1279/I1268","v":0}]
[{"$nulls":7},"Custo do FIC",null,0]
[{"$nulls":7},"Custo do FIT",null,0]
[null,"C - MATERIAL",null,"Quantidade","Unidade",null,"Preço Unitário","Custo Unitário"]
[null,"-",0,null,0,null,0,null,null,{"$f":"D1284*G1284","v":0}]
[null,"-",0,null,0,null,0,null,null,{"$f":"D1285*G1285","v":0}]
[null,null,null,"Custo unitário total de material",{"$nulls":5},{"$f":"SUM(J1284:J1285)","v":0}]
[null,"D - ATIVIDADES AUXILIARES",null,"Quantidade","Unidade",null,"Custo Unitário","Custo Unitário"]
[null,407820,"Armação em aço CA-60 - fornecimento, preparo e colocação",25.7,"kg",null,12.91,null,null,{"$f":"D1288*G1288","v":331.78699999999998}]
[null,1107891,"Concreto fck = 20 MPa - confecção em betoneira e lançamento manual - areia extraída e brita produzida",2.89,"m³",null,300.02999999999997,null,null,867.08669999999995]
[null,3103302,"Fôrmas de tábuas de pinho para dispositivos de drenagem - utilização de 3 vezes - confecção, instalação e retirada",23.62,"m²",null,71.61,null,null,{"$f":"D1290*G1290","v":1691.4282000000001}]
[null,null,null,"Custo total de atividades auxiliares",{"$nulls":5},{"$f":"SUM(J1288:J1290)","v":2890.3018999999999}]
[{"$nulls":7},"Subtotal",null,{"$f":"J1280+J1286+J1291+J1281+J1282","v":2890.3018999999999}]
[null,"E - TEMPO FIXO",null,"Código","Quantidade","Unidade",null,"Custo Unitário","Custo Unitário"]
[null,"-",0,"-",null,"t",null,0,null,{"$f":"ROUNDDOWN(E1294*H1294,4)","v":0}]
[null,"-",0,"-",null,"t",null,0,null,{"$f":"ROUNDDOWN(E1295*H1295,4)","v":0}]
[null,null,null,"Custo unitário total de tempo fixo",{"$nulls":5},{"$f":"SUM(J1294:J1295)","v":0}]
[null,"F - MOMENTO DE TRANSPORTE",null,"Quantidade","Unidade","DMT",null,null,null,"Custo Unitário"]
[{"$nulls":5},"LN","RP","P"]
[null,"-",0,null,"tkm"]
[null,"-",0,null,"tkm"]
[null,null,null,"Custo unitário total de transporte"]
[{"$nulls":5},"Custo unitário direto total",null,null,null,{"$f":"TRUNC(J1292+J1296,2)","v":2890.3}]
[null,"Obs."]
[]
[35,"1ª/GRD",{"$nulls":8},{"$f":"J1345","v":746.69}]
[null,"OBRA:"," DRENAGEM E PAVIMENTAÇÃO - VIAS INTERNAS DO PARQUE DE EXPOSIÇÕES E RUA BOM JARDIM (BAIRRO SANTO ANTÔNIO) - SERRO-MG"]
[null,"Custo Unitário de Referência",null,null,"Minas Gerais"]
[{"$nulls":4}," Outubro/2024 ",null,null,"Produção da equipe ",1,{"$f":"VLOOKUP(A1305,ORÇAMENTO!$A$10:$L$69,7,1)","v":"M"}]
[null,2003411,"DESCIDA D'ÁGUA EM DEGRAUS PARA BSTC Ø600MM (DAD 110-26)",{"$nulls":5},"Valores em reais (R$)"]
[null,"A - EQUIPAMENTOS",null,"Quantidade","Utilização",null,"Custo Horário",null,null,"Custo"]
[{"$nulls":4},"Operativa","Improdutiva","Produtivo","Improdutivo",null,"Horário Total"]
[null,"-",0,null,null,null,0,0,null,{"$f":"D1312*(E1312*G1312+F1312*H1312)","v":0}]
[null,"-",0,null,null,null,0,0,null,{"$f":"D1313*(E1313*G1313+F1313*H1313)","v":0}]
[{"$nulls":7},"Custo horário total de equipamentos",null,{"$f":"SUM(J1312:J1313)","v":0}]
[null,"B - MÃO DE OBRA",null,"Quantidade","Unidade",null,"Custo Horário","Custo Horário Total"]
[null,"-",0,null,0,null,0,null,null,{"$f":"D1316*G1316","v":0}]
[null,"-",0,null,0,null,0,null,null,{"$f":"D1317*G1317","v":0}]
[null,null,null,"Custo horário total de mão de obra",{"$nulls":5},{"$f":"SUM(J1316:J1317)","v":0}]
[null,null,null,"Custo horário total de execução",{"$nulls":5},{"$f":"J1314+J1318","v":0}]
[null,null,null,"Custo unitário de execução",{"$nulls":5},{"$f":"J1319/I1308","v":0}]
[{"$nulls":7},"Custo do FIC",null,0]
[{"$nulls":7},"Custo do FIT",null,0]
[null,"C - MATERIAL",null,"Quantidade","Unidade",null,"Preço Unitário","Custo Unitário"]
[null,"-",0,null,0,null,0,null,null,{"$f":"D1324*G1324","v":0}]
[null,"-",0,null,0,null,0,null,null,{"$f":"D1325*G1325","v":0}]
[null,null,null,"Custo unitário total de material",{"$nulls":5},{"$f":"SUM(J1324:J1325)","v":0}]
[null,"D - ATIVIDADES AUXILIARES",null,"Quantidade","Unidade",null,"Custo Unitário","Custo Unitário"]
[null,1100657,"Adensamento de concreto por vibrador de imersão",0.42099999999999999,"m³",null,3.26,null,null,{"$f":"D1328*G1328","v":1.3724599999999998}]
[null,4805756,"Apiloamento manual de superfície com espessura de 15 cm",1.0849,"m²",null,4.6399999999999997,null,null,{"$f":"D1329*G1329","v":5.0339359999999997}]
[null,407819,"Armação em aço CA-50 - fornecimento, preparo e colocação",26.335000000000001,"kg",null,11.85,null,null,312.06975]
[null,1107892,"Concreto fck = 20 MPa - confecção em betoneira e lançamento manual - areia e brita comerciais",0.42099999999999999,"m³",null,483.33,null,null,203.48192999999998]
[null,4805750,"Escavação manual em material de 1ª categoria na profundidade de até 1 m",0.61829999999999996,"m³",null,42.11,null,null,26.036612999999999]
[null,3103302,"Fôrmas de tábuas de pinho para dispositivos de drenagem - utilização de 3 vezes - confecção, instalação e retirada",2.7747000000000002,"m²",null,71.61,null,null,{"$f":"D1333*G1333","v":198.69626700000001}]
[null,null,null,"Custo total de atividades auxiliares",{"$nulls":5},{"$f":"SUM(J1328:J1333)","v":746.69095599999991}]
[{"$nulls":7},"Subtotal",null,{"$f":"J1320+J1326+J1334+J1321+J1322","v":746.69095599999991}]
[null,"E - TEMPO FIXO",null,"Código","Quantidade","Unidade",null,"Custo Unitário","Custo Unitário"]
[null,"-",0,"-",null,"t",null,0,null,{"$f":"ROUNDDOWN(E1337*H1337,4)","v":0}]
[null,"-",0,"-",null,"t",null,0,null,{"$f":"ROUNDDOWN(E1338*H1338,4)","v":0}]
[null,null,null,"Custo unitário total de tempo fixo",{"$nulls":5},{"$f":"SUM(J1337:J1338)","v":0}]
[null,"F - MOMENTO DE TRANSPORTE",null,"Quantidade","Unidade","DMT",null,null,null,"Custo Unitário"]
[{"$nulls":5},"LN","RP","P"]
[null,"-",0,null,"tkm"]
[null,"-",0,null,"tkm"]
[null,null,null,"Custo unitário total de transporte"]
[{"$nulls":5},"Custo unitário direto total",null,null,null,{"$f":"TRUNC(J1335+J1339,2)","v":746.69}]
[null,"Obs."]
[]
[36,"1ª/GRD",{"$nulls":8},{"$f":"J1388","v":821.03}]
[null,"OBRA:"," DRENAGEM E PAVIMENTAÇÃO - VIAS INTERNAS DO PARQUE DE EXPOSIÇÕES E RUA BOM JARDIM (BAIRRO SANTO ANTÔNIO) - SERRO-MG"]
[null,"Custo Unitário de Referência",null,null,"Minas Gerais"]
[{"$nulls":4}," Outubro/2024 ",null,null,"Produção da equipe ",1,{"$f":"VLOOKUP(A1348,ORÇAMENTO!$A$10:$L$69,7,1)","v":"M"}]
[null,2003415,"DESCIDA D'ÁGUA EM DEGRAUS PARA BSTC Ø800MM (DAD 125-30)",{"$nulls":5},"Valores em reais (R$)"]
[null,"A - EQUIPAMENTOS",null,"Quantidade","Utilização",null,"Custo Horário",null,null,"Custo"]
[{"$nulls":4},"Operativa","Improdutiva","Produtivo","Improdutivo",null,"Horário Total"]
[null,"-",0,null,null,null,0,0,null,{"$f":"D1355*(E1355*G1355+F1355*H1355)","v":0}]
[null,"-",0,null,null,null,0,0,null,{"$f":"D1356*(E1356*G1356+F1356*H1356)","v":0}]
[{"$nulls":7},"Custo horário total de equipamentos",null,{"$f":"SUM(J1355:J1356)","v":0}]
[null,"B - MÃO DE OBRA",null,"Quantidade","Unidade",null,"Custo Horário","Custo Horário Total"]
[null,"-",0,null,0,null,0,null,null,{"$f":"D1359*G1359","v":0}]
[null,"-",0,null,0,null,0,null,null,{"$f":"D1360*G1360","v":0}]
[null,null,null,"Custo horário total de mão de obra",{"$nulls":5},{"$f":"SUM(J1359:J1360)","v":0}]
[null,null,null,"Custo horário total de execução",{"$nulls":5},{"$f":"J1357+J1361","v":0}]
[null,null,null,"Custo unitário de execução",{"$nulls":5},{"$f":"J1362/I1351","v":0}]
[{"$nulls":7},"Custo do FIC",null,0]
[{"$nulls":7},"Custo do FIT",null,0]
[null,"C - MATERIAL",null,"Quantidade","Unidade",null,"Preço Unitário","Custo Unitário"]
[null,"-",0,null,0,null,0,null,null,{"$f":"D1367*G1367","v":0}]
[null,"-",0,null,0,null,0,null,null,{"$f":"D1368*G1368","v":0}]
[null,null,null,"Custo unitário total de material",{"$nulls":5},{"$f":"SUM(J1367:J1368)","v":0}]
[null,"D - ATIVIDADES AUXILIARES",null,"Quantidade","Unidade",null,"Custo Unitário","Custo Unitário"]
[null,1100657,"Adensamento de concreto por vibrador de imersão",0.46629999999999999,"m³",null,3.26,null,null,{"$f":"D1371*G1371","v":1.5201379999999998}]
[null,4805756,"Apiloamento manual de superfície com espessura de 15 cm",1.2062999999999999,"m²",null,4.6399999999999997,null,null,{"$f":"D1372*G1372","v":5.5972319999999991}]
[null,407819,"Armação em aço CA-50 - fornecimento, preparo e colocação",28.732900000000001,"kg",null,11.85,null,null,340.48486500000001]
[null,1107892,"Concreto fck = 20 MPa - confecção em betoneira e lançamento manual - areia e brita comerciais",0.46629999999999999,"m³",null,483.33,null,null,225.376779]
[null,4805750,"Escavação manual em material de 1ª categoria na profundidade de até 1 m",0.74709999999999999,"m³",null,42.11,null,null,31.460380999999998]
[null,3103302,"Fôrmas de tábuas de pinho para dispositivos de drenagem - utilização de 3 vezes - confecção, instalação e retirada",3.0246,"m²",null,71.61,null,null,{"$f":"D1376*G1376","v":216.59160599999998}]
[null,null,null,"Custo total de atividades auxiliares",{"$nulls":5},{"$f":"SUM(J1371:J1376)","v":821.03100099999995}]
[{"$nulls":7},"Subtotal",null,{"$f":"J1363+J1369+J1377+J1364+J1365","v":821.03100099999995}]
[null,"E - TEMPO FIXO",null,"Código","Quantidade","Unidade",null,"Custo Unitário","Custo Unitário"]
[null,"-",0,"-",null,"t",null,0,null,{"$f":"ROUNDDOWN(E1380*H1380,4)","v":0}]
[null,"-",0,"-",null,"t",null,0,null,{"$f":"ROUNDDOWN(E1381*H1381,4)","v":0}]
[null,null,null,"Custo unitário total de tempo fixo",{"$nulls":5},{"$f":"SUM(J1380:J1381)","v":0}]
[null,"F - MOMENTO DE TRANSPORTE",null,"Quantidade","Unidade","DMT",null,null,null,"Custo Unitário"]
[{"$nulls":5},"LN","RP","P"]
[null,"-",0,null,"tkm"]
[null,"-",0,null,"tkm"]
[null,null,null,"Custo unitário total de transporte"]
[{"$nulls":5},"Custo unitário direto total",null,null,null,{"$f":"TRUNC(J1378+J1382,2)","v":821.03}]
[null,"Obs."]
[]
[37,"1ª/GRD",{"$nulls":8},{"$f":"J1429","v":842.48}]
[null,"OBRA:"," DRENAGEM E PAVIMENTAÇÃO - VIAS INTERNAS DO PARQUE DE EXPOSIÇÕES E RUA BOM JARDIM (BAIRRO SANTO ANTÔNIO) - SERRO-MG"]
[null,"Custo Unitário de Referência",null,null,"Minas Gerais"]
[{"$nulls":4}," Outubro/2024 ",null,null,"Produção da equipe ",1,{"$f":"VLOOKUP(A1391,ORÇAMENTO!$A$10:$L$69,7,1)","v":"UN."}]
[null,2003181,"BACIA DE DISSIPAÇÃO COM PEDRA DE MÃO IRREGULAR FIXADA EM CONCRETO PARA BSTC Ø600MM (DED 04A)",{"$nulls":5},"Valores em reais (R$)"]
[null,"A - EQUIPAMENTOS",null,"Quantidade","Utilização",null,"Custo Horário",null,null,"Custo"]
[{"$nulls":4},"Operativa","Improdutiva","Produtivo","Improdutivo",null,"Horário Total"]
[null,"-",0,null,null,null,0,0,null,{"$f":"D1398*(E1398*G1398+F1398*H1398)","v":0}]
[null,"-",0,null,null,null,0,0,null,{"$f":"D1399*(E1399*G1399+F1399*H1399)","v":0}]
[{"$nulls":7},"Custo horário total de equipamentos",null,{"$f":"SUM(J1398:J1399)","v":0}]
[null,"B - MÃO DE OBRA",null,"Quantidade","Unidade",null,"Custo Horário","Custo Horário Total"]
[null,"P9824","Servente",0.72599999999999998,"h",null,20.631399999999999,null,null,{"$f":"D1402*G1402","v":14.978396399999999}]
[null,"-",0,null,0,null,0,null,null,{"$f":"D1403*G1403","v":0}]
[null,null,null,"Custo horário total de mão de obra",{"$nulls":5},{"$f":"SUM(J1402:J1403)","v":14.978396399999999}]
[null,null,null,"Custo horário total de execução",{"$nulls":5},{"$f":"J1400+J1404","v":14.978396399999999}]
[null,null,null,"Custo unitário de execução",{"$nulls":5},{"$f":"J1405/I1394","v":14.978396399999999}]
[{"$nulls":7},"Custo do FIC",null,0]
[{"$nulls":7},"Custo do FIT",null,0]
[null,"C - MATERIAL",null,"Quantidade","Unidade",null,"Preço Unitário","Custo Unitário"]
[null,"M1097","Pedra de mão ou rachão",0.2833,"m³",null,162.45259999999999,null,null,{"$f":"D1410*G1410","v":46.022821579999999}]
[null,"-",0,null,0,null,0,null,null,{"$f":"D1411*G1411","v":0}]
[null,null,null,"Custo unitário total de material",{"$nulls":5},{"$f":"SUM(J1410:J1411)","v":46.022821579999999}]
[null,"D - ATIVIDADES AUXILIARES",null,"Quantidade","Unidade",null,"Custo Unitário","Custo Unitário"]
[null,4805756,"Apiloamento manual de superfície com espessura de 15 cm",4.4215,"m²",null,4.6399999999999997,null,null,{"$f":"D1414*G1414","v":20.51576}]
[null,1107892,"Concreto fck = 20 MPa - confecção em betoneira e lançamento manual - areia e brita comerciais",0.85540000000000005,"m³",null,483.33,null,null,{"$f":"D1415*G1415","v":413.44048200000003}]
[null,4805750,"Escavação manual em material de 1ª categoria na profundidade de até 1 m",0.88429999999999997,"m³",null,42.11,null,null,37.237873]
[null,3103302,"Fôrmas de tábuas de pinho para dispositivos de drenagem - utilização de 3 vezes - confecção, instalação e retirada",4.3224999999999998,"m²",null,71.61,null,null,{"$f":"D1417*G1417","v":309.53422499999999}]
[null,null,null,"Custo total de atividades auxiliares",{"$nulls":5},{"$f":"SUM(J1414:J1417)","v":780.72834}]
[{"$nulls":7},"Subtotal",null,{"$f":"J1406+J1412+J1418+J1407+J1408","v":841.72955797999998}]
[null,"E - TEMPO FIXO",null,"Código","Quantidade","Unidade",null,"Custo Unitário","Custo Unitário"]
[null,"M1097","Pedra de mão ou rachão",5914647,0.42494999999999999,"t",null,1.78,null,{"$f":"ROUNDDOWN(E1421*H1421,4)","v":0.75639999999999996}]
[null,"-",0,"-",null,"t",null,0,null,{"$f":"ROUNDDOWN(E1422*H1422,4)","v":0}]
[null,null,null,"Custo unitário total de tempo fixo",{"$nulls":5},{"$f":"SUM(J1421:J1422)","v":0.75639999999999996}]
[null,"F - MOMENTO DE TRANSPORTE",null,"Quantidade","Unidade","DMT",null,null,null,"Custo Unitário"]
[{"$nulls":5},"LN","RP","P"]
[null,"M1097","Pedra de mão ou rachão",0.42494999999999999,"tkm"]
[null,"-",0,null,"tkm"]
[null,null,null,"Custo unitário total de transporte"]
[{"$nulls":5},"Custo unitário direto total",null,null,null,{"$f":"TRUNC(J1419+J1423,2)","v":842.48}]
[null,"Obs."]
[]
[38,"1ª/GRD",{"$nulls":8},{"$f":"J1470","v":1112.02}]
[null,"OBRA:"," DRENAGEM E PAVIMENTAÇÃO - VIAS INTERNAS DO PARQUE DE EXPOSIÇÕES E RUA BOM JARDIM (BAIRRO SANTO ANTÔNIO) - SERRO-MG"]
[null,"Custo Unitário de Referência",null,null,"Minas Gerais"]
[{"$nulls":4}," Outubro/2024 ",null,null,"Produção da equipe ",1,{"$f":"VLOOKUP(A1432,ORÇAMENTO!$A$10:$L$69,7,1)","v":"UN."}]
[null,2003183,"BACIA DE DISSIPAÇÃO COM PEDRA DE MÃO IRREGULAR FIXADA EM CONCRETO PARA BSTC Ø800MM (DED 05A)",{"$nulls":5},"Valores em reais (R$)"]
[null,"A - EQUIPAMENTOS",null,"Quantidade","Utilização",null,"Custo Horário",null,null,"Custo"]
[{"$nulls":4},"Operativa","Improdutiva","Produtivo","Improdutivo",null,"Horário Total"]
[null,"-",0,null,null,null,0,0,null,{"$f":"D1439*(E1439*G1439+F1439*H1439)","v":0}]
[null,"-",0,null,null,null,0,0,null,{"$f":"D1440*(E1440*G1440+F1440*H1440)","v":0}]
[{"$nulls":7},"Custo horário total de equipamentos",null,{"$f":"SUM(J1439:J1440)","v":0}]
[null,"B - MÃO DE OBRA",null,"Quantidade","Unidade",null,"Custo Horário","Custo Horário Total"]
[null,"P9824","Servente",1.05,"h",null,20.631399999999999,null,null,{"$f":"D1443*G1443","v":21.662970000000001}]
[null,"-",0,null,0,null,0,null,null,{"$f":"D1444*G1444","v":0}]
[null,null,null,"Custo horário total de mão de obra",{"$nulls":5},{"$f":"SUM(J1443:J1444)","v":21.662970000000001}]
[null,null,null,"Custo horário total de execução",{"$nulls":5},{"$f":"J1441+J1445","v":21.662970000000001}]
[null,null,null,"Custo unitário de execução",{"$nulls":5},{"$f":"J1446/I1435","v":21.662970000000001}]
[{"$nulls":7},"Custo do FIC",null,0]
[{"$nulls":7},"Custo do FIT",null,0]
[null,"C - MATERIAL",null,"Quantidade","Unidade",null,"Preço Unitário","Custo Unitário"]
[null,"M1097","Pedra de mão ou rachão",0.4143,"m³",null,162.45259999999999,null,null,{"$f":"D1451*G1451","v":67.30411217999999}]
[null,"-",0,null,0,null,0,null,null,{"$f":"D1452*G1452","v":0}]
[null,null,null,"Custo unitário total de material",{"$nulls":5},{"$f":"SUM(J1451:J1452)","v":67.30411217999999}]
[null,"D - ATIVIDADES AUXILIARES",null,"Quantidade","Unidade",null,"Custo Unitário","Custo Unitário"]
[null,4805756,"Apiloamento manual de superfície com espessura de 15 cm",6.2153999999999998,"m²",null,4.6399999999999997,null,null,{"$f":"D1455*G1455","v":28.839455999999998}]
[null,1107892,"Concreto fck = 20 MPa - confecção em betoneira e lançamento manual - areia e brita comerciais",1.1732,"m³",null,483.33,null,null,{"$f":"D1456*G1456","v":567.04275599999994}]
[null,4805750,"Escavação manual em material de 1ª categoria na profundidade de até 1 m",1.2431000000000001,"m³",null,42.11,null,null,52.346941000000001]
[null,3103302,"Fôrmas de tábuas de pinho para dispositivos de drenagem - utilização de 3 vezes - confecção, instalação e retirada",5.2188999999999997,"m²",null,71.61,null,null,{"$f":"D1458*G1458","v":373.72542899999996}]
[null,null,null,"Custo total de atividades auxiliares",{"$nulls":5},{"$f":"SUM(J1455:J1458)","v":1021.954582}]
[{"$nulls":7},"Subtotal",null,{"$f":"J1447+J1453+J1459+J1448+J1449","v":1110.9216641799999}]
[null,"E - TEMPO FIXO",null,"Código","Quantidade","Unidade",null,"Custo Unitário","Custo Unitário"]
[null,"M1097","Pedra de mão ou rachão",5914647,0.62144999999999995,"t",null,1.78,null,{"$f":"ROUNDDOWN(E1462*H1462,4)","v":1.1061000000000001}]
[null,"-",0,"-",null,"t",null,0,null,{"$f":"ROUNDDOWN(E1463*H1463,4)","v":0}]
[null,null,null,"Custo unitário total de tempo fixo",{"$nulls":5},{"$f":"SUM(J1462:J1463)","v":1.1061000000000001}]
[null,"F - MOMENTO DE TRANSPORTE",null,"Quantidade","Unidade","DMT",null,null,null,"Custo Unitário"]
[{"$nulls":5},"LN","RP","P"]
[null,"M1097",{"$error":"#N/A"},0.62144999999999995,"tkm"]
[null,"-",0,null,"tkm"]
[null,null,null,"Custo unitário total de transporte"]
[{"$nulls":5},"Custo unitário direto total",null,null,null,{"$f":"TRUNC(J1460+J1464,2)","v":1112.02}]
[null,"Obs."]
[]
[39,"1ª/GRD",{"$nulls":8},{"$f":"J1509","v":16.260000000000002}]
[null,"OBRA:"," DRENAGEM E PAVIMENTAÇÃO - VIAS INTERNAS DO PARQUE DE EXPOSIÇÕES E RUA BOM JARDIM (BAIRRO SANTO ANTÔNIO) - SERRO-MG"]
[null,"Custo Unitário de Referência",null,null,"Minas Gerais"]
[{"$nulls":4}," Outubro/2024 ",null,null,"Produção da equipe ",3.1124999999999998,{"$f":"VLOOKUP(A1473,ORÇAMENTO!$A$10:$L$69,7,1)","v":"M3"}]
[null,4815671,"REATERRO COMPACTADO DE VALAS COM SOQUETE VIBRATÓRIO",{"$nulls":5},"Valores em reais (R$)"]
[null,"A - EQUIPAMENTOS",null,"Quantidade","Utilização",null,"Custo Horário",null,null,"Custo"]
[{"$nulls":4},"Operativa","Improdutiva","Produtivo","Improdutivo",null,"Horário Total"]
[null,"E9647","Compactador manual com soquete vibratório - 4,10 kW",1,1,0,9.3505000000000003,1.0375000000000001,null,{"$f":"D1480*(E1480*G1480+F1480*H1480)","v":9.3505000000000003}]
[null,"-",0,null,null,null,0,0,null,{"$f":"D1481*(E1481*G1481+F1481*H1481)","v":0}]
[{"$nulls":7},"Custo horário total de equipamentos",null,{"$f":"SUM(J1480:J1481)","v":9.3505000000000003}]
[null,"B - MÃO DE OBRA",null,"Quantidade","Unidade",null,"Custo Horário","Custo Horário Total"]
[null,"P9824","Servente",2,"h",null,20.631399999999999,null,null,{"$f":"D1484*G1484","v":41.262799999999999}]
[null,"-",0,null,0,null,0,null,null,{"$f":"D1485*G1485","v":0}]
[null,null,null,"Custo horário total de mão de obra",{"$nulls":5},{"$f":"SUM(J1484:J1485)","v":41.262799999999999}]
[null,null,null,"Custo horário total de execução",{"$nulls":5},{"$f":"J1482+J1486","v":50.613299999999995}]
[null,null,null,"Custo unitário de execução",{"$nulls":5},{"$f":"J1487/I1476","v":16.261301204819276}]
[{"$nulls":7},"Custo do FIC",null,0]
[{"$nulls":7},"Custo do FIT",null,0]
[null,"C - MATERIAL",null,"Quantidade","Unidade",null,"Preço Unitário","Custo Unitário"]
[null,"-",0,null,0,null,0,null,null,{"$f":"D1492*G1492","v":0}]
[null,"-",0,null,0,null,0,null,null,{"$f":"D1493*G1493","v":0}]
[null,null,null,"Custo unitário total de material",{"$nulls":5},{"$f":"SUM(J1492:J1493)","v":0}]
[null,"D - ATIVIDADES AUXILIARES",null,"Quantidade","Unidade",null,"Custo Unitário","Custo Unitário"]
[null,"-",0,null,0,null,0,null,null,{"$f":"D1496*G1496","v":0}]
[null,"-",0,null,0,null,0,null,null,{"$f":"D1497*G1497","v":0}]
[null,null,null,"Custo total de atividades auxiliares",{"$nulls":5},{"$f":"SUM(J1496:J1497)","v":0}]
[{"$nulls":7},"Subtotal",null,{"$f":"J1488+J1494+J1498+J1489+J1490","v":16.261301204819276}]
[null,"E - TEMPO FIXO",null,"Código","Quantidade","Unidade",null,"Custo Unitário","Custo Unitário"]
[null,"-",0,"-",null,"t",null,0,null,{"$f":"ROUNDDOWN(E1501*H1501,4)","v":0}]
[null,"-",0,"-",null,"t",null,0,null,{"$f":"ROUNDDOWN(E1502*H1502,4)","v":0}]
[null,null,null,"Custo unitário total de tempo fixo",{"$nulls":5},{"$f":"SUM(J1501:J1502)","v":0}]
[null,"F - MOMENTO DE TRANSPORTE",null,"Quantidade","Unidade","DMT",null,null,null,"Custo Unitário"]
[{"$nulls":5},"LN","RP","P"]
[null,"-",0,null,"tkm"]
[null,"-",0,null,"tkm"]
[null,null,null,"Custo unitário total de transporte"]
[{"$nulls":5},"Custo unitário direto total",null,null,null,{"$f":"TRUNC(J1499+J1503,2)","v":16.260000000000002}]
[null,"Obs."]
[]
[40,"1ª/GRD",{"$nulls":8},{"$f":"J1551","v":6306.15}]
[null,"OBRA:"," DRENAGEM E PAVIMENTAÇÃO - VIAS INTERNAS DO PARQUE DE EXPOSIÇÕES E RUA BOM JARDIM (BAIRRO SANTO ANTÔNIO) - SERRO-MG"]
[null,"Custo Unitário de Referência",null,null,"Minas Gerais"]
[{"$nulls":4}," Outubro/2024 ",null,null,"Produção da equipe ",0.32876352039977641,{"$f":"VLOOKUP(A1512,ORÇAMENTO!$A$10:$L$69,7,1)","v":"UN."}]
[null,"CPU.4","FAIXA ELEVADA PARA TRAVESSIA DE PEDESTRES - CONF. PROJETO, INCLUSIVE PINTURA DE SINALIZAÇÃO",{"$nulls":5},"Valores em reais (R$)"]
[null,"A - EQUIPAMENTOS",null,"Quantidade","Utilização",null,"Custo Horário",null,null,"Custo"]
[{"$nulls":4},"Operativa","Improdutiva","Produtivo","Improdutivo",null,"Horário Total"]
[null,"-",0,null,null,null,0,0,null,{"$f":"D1519*(E1519*G1519+F1519*H1519)","v":0}]
[null,"-",0,null,null,null,0,0,null,{"$f":"D1520*(E1520*G1520+F1520*H1520)","v":0}]
[{"$nulls":7},"Custo horário total de equipamentos",null,{"$f":"SUM(J1519:J1520)","v":0}]
[null,"B - MÃO DE OBRA",null,"Quantidade","Unidade",null,"Custo Horário","Custo Horário Total"]
[null,"P9821","Pedreiro",0.46516750501364368,"h",null,26.1035,null,null,{"$f":"D1523*G1523","v":12.142499967123648}]
[null,"P9808","Carpinteiro",0.53483249498635632,"h",null,25.901299999999999,null,null,{"$f":"D1524*G1524","v":13.85285690239011}]
[null,"P9824","Servente",1,"h",null,20.631399999999999,null,null,{"$f":"D1525*G1525","v":20.631399999999999}]
[null,null,null,"Custo horário total de mão de obra",{"$nulls":5},{"$f":"SUM(J1523:J1525)","v":46.626756869513756}]
[null,null,null,"Custo horário total de execução",{"$nulls":5},{"$f":"J1521+J1526","v":46.626756869513756}]
[null,null,null,"Custo unitário de execução",{"$nulls":5},{"$f":"J1527/I1515","v":141.82460637}]
[{"$nulls":7},"Custo do FIC",null,0]
[{"$nulls":7},"Custo do FIT",null,0]
[null,"C - MATERIAL",null,"Quantidade","Unidade",null,"Preço Unitário","Custo Unitário"]
[null,"M0451","Concreto usinado - fck = 20 MPa (comercial)",4.9499999999999993,"m³",null,570,null,null,{"$f":"D1532*G1532","v":2821.4999999999995}]
[null,"M1358","Sarrafo em madeira de terceira - E = 2,5 cm e L = 5 cm",7.4,"m",null,2.0499999999999998,null,null,{"$f":"D1533*G1533","v":15.17}]
[null,"M1205","Prego de ferro",0.2994,"kg",null,16.54,null,null,{"$f":"D1534*G1534","v":4.9520759999999999}]
[null,null,null,"Custo unitário total de material",{"$nulls":5},{"$f":"SUM(J1532:J1534)","v":2841.6220759999997}]
[null,"D - ATIVIDADES AUXILIARES",null,"Quantidade","Unidade",null,"Custo Unitário","Custo Unitário"]
[null,407819,"Armação em aço CA-50 - fornecimento, preparo e colocação",197.99999999999997,"kg",null,11.85,null,null,{"$f":"D1537*G1537","v":2346.2999999999997}]
[null,5214001,"Pintura de faixa com tinta acrílica emulsionada em água - espessura de 0,3 mm",36,"m²",null,12.9,null,null,{"$f":"D1538*G1538","v":464.40000000000003}]
[null,5214003,"Pintura de setas e zebrados com termoplástico por aspersão - espessura de 1,5 mm",9,"m²",null,56.89,null,null,{"$f":"D1539*G1539","v":512.01}]
[null,null,null,"Custo total de atividades auxiliares",{"$nulls":5},{"$f":"SUM(J1537:J1539)","v":3322.71}]
[{"$nulls":7},"Subtotal",null,{"$f":"J1528+J1535+J1540+J1529+J1530","v":6306.1566823699995}]
[null,"E - TEMPO FIXO",null,"Código","Quantidade","Unidade",null,"Custo Unitário","Custo Unitário"]
[null,"-",0,"-",null,"t",null,0,null,{"$f":"ROUNDDOWN(E1543*H1543,4)","v":0}]
[null,"-",0,"-",null,"t",null,0,null,{"$f":"ROUNDDOWN(E1544*H1544,4)","v":0}]
[null,null,null,"Custo unitário total de tempo fixo",{"$nulls":5},{"$f":"SUM(J1543:J1544)","v":0}]
[null,"F - MOMENTO DE TRANSPORTE",null,"Quantidade","Unidade","DMT",null,null,null,"Custo Unitário"]
[{"$nulls":5},"LN","RP","P"]
[null,"-",0,null,"tkm"]
[null,"-",0,null,"tkm"]
[null,null,null,"Custo unitário total de transporte"]
[{"$nulls":5},"Custo unitário direto total",null,null,null,{"$f":"TRUNC(J1541+J1545,2)","v":6306.15}]
[null,"Obs."]
[]
[41,"1ª/GRD",{"$nulls":8},{"$f":"J1590","v":52.63}]
[null,"OBRA:"," DRENAGEM E PAVIMENTAÇÃO - VIAS INTERNAS DO PARQUE DE EXPOSIÇÕES E RUA BOM JARDIM (BAIRRO SANTO ANTÔNIO) - SERRO-MG"]
[null,"Custo Unitário de Referência",null,null,"Minas Gerais"]
[{"$nulls":4}," Outubro/2024 ",null,null,"Produção da equipe ",0.4,{"$f":"VLOOKUP(A1554,ORÇAMENTO!$A$10:$L$69,7,1)","v":"M3"}]
[null,4805751,"ESCAVAÇÃO MANUAL DE VALAS EM MATERIAL DE 1ª CATEGORIA",{"$nulls":5},"Valores em reais (R$)"]
[null,"A - EQUIPAMENTOS",null,"Quantidade","Utilização",null,"Custo Horário",null,null,"Custo"]
[{"$nulls":4},"Operativa","Improdutiva","Produtivo","Improdutivo",null,"Horário Total"]
[null,"-",0,null,null,null,0,0,null,{"$f":"D1561*(E1561*G1561+F1561*H1561)","v":0}]
[null,"-",0,null,null,null,0,0,null,{"$f":"D1562*(E1562*G1562+F1562*H1562)","v":0}]
[{"$nulls":7},"Custo horário total de equipamentos",null,{"$f":"SUM(J1561:J1562)","v":0}]
[null,"B - MÃO DE OBRA",null,"Quantidade","Unidade",null,"Custo Horário","Custo Horário Total"]
[null,"P9824","Servente",1,"h",null,20.631399999999999,null,null,{"$f":"D1565*G1565","v":20.631399999999999}]
[null,"-",0,null,0,null,0,null,null,{"$f":"D1566*G1566","v":0}]
[null,null,null,"Custo horário total de mão de obra",{"$nulls":5},{"$f":"SUM(J1565:J1566)","v":20.631399999999999}]
[null,null,null,"Custo horário total de execução",{"$nulls":5},{"$f":"J1563+J1567","v":20.631399999999999}]
[null,null,null,"Custo unitário de execução",{"$nulls":5},{"$f":"J1568/I1557","v":51.578499999999998}]
[{"$nulls":7},"Custo do FIC",null,1.0537000000000001]
[{"$nulls":7},"Custo do FIT",null,0]
[null,"C - MATERIAL",null,"Quantidade","Unidade",null,"Preço Unitário","Custo Unitário"]
[null,"-",0,null,0,null,0,null,null,{"$f":"D1573*G1573","v":0}]
[null,"-",0,null,0,null,0,null,null,{"$f":"D1574*G1574","v":0}]
[null,null,null,"Custo unitário total de material",{"$nulls":5},{"$f":"SUM(J1573:J1574)","v":0}]
[null,"D - ATIVIDADES AUXILIARES",null,"Quantidade","Unidade",null,"Custo Unitário","Custo Unitário"]
[null,"-",0,null,0,null,0,null,null,{"$f":"D1577*G1577","v":0}]
[null,"-",0,null,0,null,0,null,null,{"$f":"D1578*G1578","v":0}]
[null,null,null,"Custo total de atividades auxiliares",{"$nulls":5},{"$f":"SUM(J1577:J1578)","v":0}]
[{"$nulls":7},"Subtotal",null,{"$f":"J1569+J1575+J1579+J1570+J1571","v":52.632199999999997}]
[null,"E - TEMPO FIXO",null,"Código","Quantidade","Unidade",null,"Custo Unitário","Custo Unitário"]
[null,"-",0,"-",null,"t",null,0,null,{"$f":"ROUNDDOWN(E1582*H1582,4)","v":0}]
[null,"-",0,"-",null,"t",null,0,null,{"$f":"ROUNDDOWN(E1583*H1583,4)","v":0}]
[null,null,null,"Custo unitário total de tempo fixo",{"$nulls":5},{"$f":"SUM(J1582:J1583)","v":0}]
[null,"F - MOMENTO DE TRANSPORTE",null,"Quantidade","Unidade","DMT",null,null,null,"Custo Unitário"]
[{"$nulls":5},"LN","RP","P"]
[null,"-",0,null,"tkm"]
[null,"-",0,null,"tkm"]
[null,null,null,"Custo unitário total de transporte"]
[{"$nulls":5},"Custo unitário direto total",null,null,null,{"$f":"TRUNC(J1580+J1584,2)","v":52.63}]
[null,"Obs."]
[]
[42,"1ª/GRD",{"$nulls":8},{"$f":"J1640","v":483.33}]
[null,"OBRA:"," DRENAGEM E PAVIMENTAÇÃO - VIAS INTERNAS DO PARQUE DE EXPOSIÇÕES E RUA BOM JARDIM (BAIRRO SANTO ANTÔNIO) - SERRO-MG"]
[null,"Custo Unitário de Referência",null,null,"Minas Gerais"]
[{"$nulls":4}," Outubro/2024 ",null,null,"Produção da equipe ",3.9289900000000002,{"$f":"VLOOKUP(A1593,ORÇAMENTO!$A$10:$L$69,7,1)","v":"M3"}]
[null,1107892,"CONCRETO FCK = 20MPA, CONFECÇÃO EM BETONEIRA E LANÇAMENTO MANUAL - AREIA E BRITA COMERCIAIS",{"$nulls":5},"Valores em reais (R$)"]
[null,"A - EQUIPAMENTOS",null,"Quantidade","Utilização",null,"Custo Horário",null,null,"Custo"]
[{"$nulls":4},"Operativa","Improdutiva","Produtivo","Improdutivo",null,"Horário Total"]
[null,"E9010","Balança plataforma digital à bateria, com mesa de 75 x 75 cm e capacidade de 500 kg",1,1,0,1.0037,0.67430000000000001,null,{"$f":"D1600*(E1600*G1600+F1600*H1600)","v":1.0037}]
[null,"E9519","Betoneira com motor a gasolina com capacidade de 600 l - 10 kW",1,1,0,48.447800000000001,28.0122,null,{"$f":"D1601*(E1601*G1601+F1601*H1601)","v":48.447800000000001}]
[null,"E9071","Transportador manual carrinho de mão com capacidade de 80 l",4,0.9,0.1,0.66869999999999996,0.4546,null,2.5891599999999997]
[null,"E9064","Transportador manual gerica com capacidade de 180 l",3,0.41,0.59,1.5044,1.0226999999999999,null,{"$f":"D1603*(E1603*G1603+F1603*H1603)","v":3.6605909999999993}]
[{"$nulls":7},"Custo horário total de equipamentos",null,{"$f":"SUM(J1600:J1603)","v":55.701250999999999}]
[null,"B - MÃO DE OBRA",null,"Quantidade","Unidade",null,"Custo Horário","Custo Horário Total"]
[null,"P9821","Pedreiro",1,"h",null,26.1035,null,null,{"$f":"D1606*G1606","v":26.1035}]
[null,"P9824","Servente",9,"h",null,20.631399999999999,null,null,{"$f":"D1607*G1607","v":185.68259999999998}]
[null,null,null,"Custo horário total de mão de obra",{"$nulls":5},{"$f":"SUM(J1606:J1607)","v":211.78609999999998}]
[null,null,null,"Custo horário total de execução",{"$nulls":5},{"$f":"J1604+J1608","v":267.48735099999999}]
[null,null,null,"Custo unitário de execução",{"$nulls":5},{"$f":"J1609/I1596","v":68.080435684488876}]
[{"$nulls":7},"Custo do FIC",null,0]
[{"$nulls":7},"Custo do FIT",null,0]
[null,"C - MATERIAL",null,"Quantidade","Unidade",null,"Preço Unitário","Custo Unitário"]
[null,"M0030","Aditivo plastificante e retardador de pega para concreto e argamassa",0.84645999999999999,"kg",null,6.6337999999999999,null,null,{"$f":"D1614*G1614","v":5.6152463479999994}]
[null,"M0082","Areia média lavada",0.63334000000000001,"m³",null,165.2723,null,null,{"$f":"D1615*G1615","v":104.673558482}]
[null,"M0191","Brita 1",0.36753999999999998,"m³",null,175.32830000000001,null,null,64.440163381999994]
[null,"M0192","Brita 2",0.36753999999999998,"m³",null,172.0985,null,null,63.253082689999999]
[null,"M0424","Cimento Portland CP II - 32 - saco",282.15206999999998,"kg",null,0.58350000000000002,null,null,{"$f":"D1618*G1618","v":164.63573284500001}]
[null,null,null,"Custo unitário total de material",{"$nulls":5},{"$f":"SUM(J1614:J1618)","v":402.61778374699998}]
[null,"D - ATIVIDADES AUXILIARES",null,"Quantidade","Unidade",null,"Custo Unitário","Custo Unitário"]
[null,"-",0,null,0,null,0,null,null,{"$f":"D1621*G1621","v":0}]
[null,"-",0,null,0,null,0,null,null,{"$f":"D1622*G1622","v":0}]
[null,null,null,"Custo total de atividades auxiliares",{"$nulls":5},{"$f":"SUM(J1621:J1622)","v":0}]
[{"$nulls":7},"Subtotal",null,{"$f":"J1610+J1619+J1623+J1611+J1612","v":470.69821943148884}]
[null,"E - TEMPO FIXO",null,"Código","Quantidade","Unidade",null,"Custo Unitário","Custo Unitário"]
[null,"M0030","Aditivo plastificante e retardador de pega para concreto e argamassa",5914655,8.4999999999999995E-4,"t",null,31.73,null,{"$f":"ROUNDDOWN(E1626*H1626,4)","v":2.69E-2}]
[null,"M0082","Areia média lavada",5914647,0.95001000000000002,"t",null,1.78,null,{"$f":"ROUNDDOWN(E1627*H1627,4)","v":1.6910000000000001}]
[null,"M0191","Brita 1",5914647,0.55130999999999997,"t",null,1.78,null,0.98129999999999995]
[null,"M0192","Brita 2",5914647,0.55130999999999997,"t",null,1.78,null,0.98129999999999995]
[null,"M0424","Cimento Portland CP II - 32 - saco",5914655,0.28215000000000001,"t",null,31.73,null,8.9526000000000003]
[null,null,null,"Custo unitário total de tempo fixo",{"$nulls":5},{"$f":"SUM(J1626:J1630)","v":12.633100000000001}]
[null,"F - MOMENTO DE TRANSPORTE",null,"Quantidade","Unidade","DMT",null,null,null,"Custo Unitário"]
[{"$nulls":5},"LN","RP","P"]
[null,"M0030","Aditivo plastificante e retardador de pega para concreto e argamassa",8.4999999999999995E-4,"tkm"]
[null,"M0082","Areia média lavada",0.95001000000000002,"tkm"]
[null,"M0191","Brita 1",0.55130999999999997,"tkm"]
[null,"M0192","Brita 2",0.55130999999999997,"tkm"]
[null,"M0424","Cimento Portland CP II - 32 - saco",0.28215000000000001,"tkm"]
[null,null,null,"Custo unitário total de transporte"]
[{"$nulls":5},"Custo unitário direto total",null,null,null,{"$f":"TRUNC(J1624+J1631,2)","v":483.33}]
[null,"Obs."]
[]
[43,"1ª/GRD",{"$nulls":8},{"$f":"J1694","v":69.430000000000007}]
[null,"OBRA:"," DRENAGEM E PAVIMENTAÇÃO - VIAS INTERNAS DO PARQUE DE EXPOSIÇÕES E RUA BOM JARDIM (BAIRRO SANTO ANTÔNIO) - SERRO-MG"]
[null,"Custo Unitário de Referência",null,null,"Minas Gerais"]
[{"$nulls":4}," Outubro/2024 ",null,null,"Produção da equipe ",1,{"$f":"VLOOKUP(A1643,ORÇAMENTO!$A$10:$L$69,7,1)","v":"M2"}]
[null,3107997,"FÔRMA EM COMPENSADO DE MADEIRA, USO GERAL - CONFECÇÃO, INSTALAÇÃO E RETIRADA",{"$nulls":5},"Valores em reais (R$)"]
[null,"A - EQUIPAMENTOS",null,"Quantidade","Utilização",null,"Custo Horário",null,null,"Custo"]
[{"$nulls":4},"Operativa","Improdutiva","Produtivo","Improdutivo",null,"Horário Total"]
[null,"E9066","Grupo gerador - 14 kVA",4.0160000000000001E-2,1,0,18.274100000000001,4.6045999999999996,null,{"$f":"D1650*(E1650*G1650+F1650*H1650)","v":0.73388785600000006}]
[null,"E9535","Serra circular com bancada - D = 30 cm - 4 kW",4.0160000000000001E-2,1,0,25.5639,25.221399999999999,null,{"$f":"D1651*(E1651*G1651+F1651*H1651)","v":1.0266462240000001}]
[{"$nulls":7},"Custo horário total de equipamentos",null,{"$f":"SUM(J1650:J1651)","v":1.7605340800000002}]
[null,"B - MÃO DE OBRA",null,"Quantidade","Unidade",null,"Custo Horário","Custo Horário Total"]
[null,"P9801","Ajudante",0.7,"h",null,22.636700000000001,null,null,{"$f":"D1654*G1654","v":15.845689999999999}]
[null,"P9808","Carpinteiro",0.7,"h",null,25.901299999999999,null,null,{"$f":"D1655*G1655","v":18.130909999999997}]
[null,null,null,"Custo horário total de mão de obra",{"$nulls":5},{"$f":"SUM(J1654:J1655)","v":33.976599999999998}]
[null,null,null,"Custo horário total de execução",{"$nulls":5},{"$f":"J1652+J1656","v":35.737134079999997}]
[null,null,null,"Custo unitário de execução",{"$nulls":5},{"$f":"J1657/I1646","v":35.737134079999997}]
[{"$nulls":7},"Custo do FIC",null,0]
[{"$nulls":7},"Custo do FIT",null,0]
[null,"C - MATERIAL",null,"Quantidade","Unidade",null,"Preço Unitário","Custo Unitário"]
[null,"M0284","Caibro de pinho - L = 7,5 cm e E = 7,5 cm",0.44922000000000001,"m",null,8.6898,null,null,{"$f":"D1662*G1662","v":3.9036319559999999}]
[null,"M0446","Compensado resinado - E = 10 mm",0.40429999999999999,"m²",null,26.212399999999999,null,null,{"$f":"D1663*G1663","v":10.59767332}]
[null,"M0560","Desmoldante para fôrmas de madeira",1.8519999999999998E-2,"l",null,12.43,null,null,0.23020359999999998]
[null,"M0310","Peça de madeira - L = 7,5 cm e E = 2,5 cm",0.19908000000000001,"m",null,3.2947000000000002,null,null,0.65590887600000003]
[null,"M1205","Prego de ferro",0.20394999999999999,"kg",null,16.54,null,null,3.3733329999999997]
[null,"M0290","Tábua - E = 2,5 cm e L = 10 cm",2.0900300000000001,"m",null,4.3109999999999999,null,null,9.0101193300000002]
[null,"M0286","Tábua - E = 2,5 cm e L = 30 cm",0.35937999999999998,"m",null,15.1739,null,null,{"$f":"D1668*G1668","v":5.4531961819999992}]
[null,null,null,"Custo unitário total de material",{"$nulls":5},{"$f":"SUM(J1662:J1668)","v":33.224066264000001}]
[null,"D - ATIVIDADES AUXILIARES",null,"Quantidade","Unidade",null,"Custo Unitário","Custo Unitário"]
[null,"-",0,null,0,null,0,null,null,{"$f":"D1671*G1671","v":0}]
[null,"-",0,null,0,null,0,null,null,{"$f":"D1672*G1672","v":0}]
[null,null,null,"Custo total de atividades auxiliares",{"$nulls":5},{"$f":"SUM(J1671:J1672)","v":0}]
[{"$nulls":7},"Subtotal",null,{"$f":"J1658+J1669+J1673+J1659+J1660","v":68.961200343999991}]
[null,"E - TEMPO FIXO",null,"Código","Quantidade","Unidade",null,"Custo Unitário","Custo Unitário"]
[null,"M0284","Caibro de pinho - L = 7,5 cm e E = 7,5 cm",5914655,2.5300000000000001E-3,"t",null,31.73,null,{"$f":"ROUNDDOWN(E1676*H1676,4)","v":8.0199999999999994E-2}]
[null,"M0446","Compensado resinado - E = 10 mm",5914655,4.0400000000000002E-3,"t",null,31.73,null,{"$f":"ROUNDDOWN(E1677*H1677,4)","v":0.12809999999999999}]
[null,"M0560","Desmoldante para fôrmas de madeira",5914655,2.0000000000000002E-5,"t",null,31.73,null,5.9999999999999995E-4]
[null,"M0310","Peça de madeira - L = 7,5 cm e E = 2,5 cm",5914655,3.6999999999999999E-4,"t",null,31.73,null,1.17E-2]
[null,"M1205","Prego de ferro",5914655,2.0000000000000001E-4,"t",null,31.73,null,6.3E-3]
[null,"M0290","Tábua - E = 2,5 cm e L = 10 cm",5914655,5.2300000000000003E-3,"t",null,31.73,null,0.16589999999999999]
[null,"M0286","Tábua - E = 2,5 cm e L = 30 cm",5914655,2.7000000000000001E-3,"t",null,31.73,null,8.5599999999999996E-2]
[null,null,null,"Custo unitário total de tempo fixo",{"$nulls":5},{"$f":"SUM(J1676:J1682)","v":0.47839999999999994}]
[null,"F - MOMENTO DE TRANSPORTE",null,"Quantidade","Unidade","DMT",null,null,null,"Custo Unitário"]
[{"$nulls":5},"LN","RP","P"]
[null,"M0284","Caibro de pinho - L = 7,5 cm e E = 7,5 cm",2.5300000000000001E-3,"tkm"]
[null,"M0446","Compensado resinado - E = 10 mm",4.0400000000000002E-3,"tkm"]
[null,"M0560","Desmoldante para fôrmas de madeira",2.0000000000000002E-5,"tkm"]
[null,"M0310","Peça de madeira - L = 7,5 cm e E = 2,5 cm",3.6999999999999999E-4,"tkm"]
[null,"M1205","Prego de ferro",2.0000000000000001E-4,"tkm"]
[null,"M0290","Tábua - E = 2,5 cm e L = 10 cm",5.2300000000000003E-3,"tkm"]
[null,"M0286","Tábua - E = 2,5 cm e L = 30 cm",2.7000000000000001E-3,"tkm"]
[null,null,null,"Custo unitário total de transporte"]
[{"$nulls":5},"Custo unitário direto total",null,null,null,{"$f":"TRUNC(J1674+J1683,2)","v":69.430000000000007}]
[null,"Obs."]
[]
[44,"1ª/GRD",{"$nulls":8},{"$f":"J1733","v":11.84}]
[null,"OBRA:"," DRENAGEM E PAVIMENTAÇÃO - VIAS INTERNAS DO PARQUE DE EXPOSIÇÕES E RUA BOM JARDIM (BAIRRO SANTO ANTÔNIO) - SERRO-MG"]
[null,"Custo Unitário de Referência",null,null,"Minas Gerais"]
[{"$nulls":4}," Outubro/2024 ",null,null,"Produção da equipe ",1,{"$f":"VLOOKUP(A1697,ORÇAMENTO!$A$10:$L$69,7,1)","v":"KG"}]
[null,407819,"ARMAÇÃO EM AÇO CA-50 - FORNECIMENTO, PREPARO E COLOCAÇÃO",{"$nulls":5},"Valores em reais (R$)"]
[null,"A - EQUIPAMENTOS",null,"Quantidade","Utilização",null,"Custo Horário",null,null,"Custo"]
[{"$nulls":4},"Operativa","Improdutiva","Produtivo","Improdutivo",null,"Horário Total"]
[null,"-",0,null,null,null,0,0,null,{"$f":"D1704*(E1704*G1704+F1704*H1704)","v":0}]
[null,"-",0,null,null,null,0,0,null,{"$f":"D1705*(E1705*G1705+F1705*H1705)","v":0}]
[{"$nulls":7},"Custo horário total de equipamentos",null,{"$f":"SUM(J1704:J1705)","v":0}]
[null,"B - MÃO DE OBRA",null,"Quantidade","Unidade",null,"Custo Horário","Custo Horário Total"]
[null,"P9801","Ajudante",0.09,"h",null,22.636700000000001,null,null,{"$f":"D1708*G1708","v":2.0373030000000001}]
[null,"P9805","Armador",0.09,"h",null,33.4054,null,null,{"$f":"D1709*G1709","v":3.0064859999999998}]
[null,null,null,"Custo horário total de mão de obra",{"$nulls":5},{"$f":"SUM(J1708:J1709)","v":5.0437890000000003}]
[null,null,null,"Custo horário total de execução",{"$nulls":5},{"$f":"J1706+J1710","v":5.0437890000000003}]
[null,null,null,"Custo unitário de execução",{"$nulls":5},{"$f":"J1711/I1700","v":5.0437890000000003}]
[{"$nulls":7},"Custo do FIC",null,0]
[{"$nulls":7},"Custo do FIT",null,0]
[null,"C - MATERIAL",null,"Quantidade","Unidade",null,"Preço Unitário","Custo Unitário"]
[null,"M0004","Aço CA 50",1.1000000000000001,"kg",null,6.0308000000000002,null,null,{"$f":"D1716*G1716","v":6.6338800000000004}]
[null,"M0075","Arame liso recozido em aço-carbono - D = 1,24 mm (18 BWG)",1.4999999999999999E-2,"kg",null,8.7863000000000007,null,null,{"$f":"D1717*G1717","v":0.13179450000000001}]
[null,null,null,"Custo unitário total de material",{"$nulls":5},{"$f":"SUM(J1716:J1717)","v":6.7656745000000003}]
[null,"D - ATIVIDADES AUXILIARES",null,"Quantidade","Unidade",null,"Custo Unitário","Custo Unitário"]
[null,"-",0,null,0,null,0,null,null,{"$f":"D1720*G1720","v":0}]
[null,"-",0,null,0,null,0,null,null,{"$f":"D1721*G1721","v":0}]
[null,null,null,"Custo total de atividades auxiliares",{"$nulls":5},{"$f":"SUM(J1720:J1721)","v":0}]
[{"$nulls":7},"Subtotal",null,{"$f":"J1712+J1718+J1722+J1713+J1714","v":11.8094635}]
[null,"E - TEMPO FIXO",null,"Código","Quantidade","Unidade",null,"Custo Unitário","Custo Unitário"]
[null,"M0004","Aço CA 50",5914655,1.1000000000000001E-3,"t",null,31.73,null,{"$f":"ROUNDDOWN(E1725*H1725,4)","v":3.49E-2}]
[null,"M0075","Arame liso recozido em aço-carbono - D = 1,24 mm (18 BWG)",5914655,2.0000000000000002E-5,"t",null,31.73,null,{"$f":"ROUNDDOWN(E1726*H1726,4)","v":5.9999999999999995E-4}]
[null,null,null,"Custo unitário total de tempo fixo",{"$nulls":5},{"$f":"SUM(J1725:J1726)","v":3.5500000000000004E-2}]
[null,"F - MOMENTO DE TRANSPORTE",null,"Quantidade","Unidade","DMT",null,null,null,"Custo Unitário"]
[{"$nulls":5},"LN","RP","P"]
[null,"M0004","Aço CA 50",1.1000000000000001E-3,"tkm"]
[null,"M0075","Arame liso recozido em aço-carbono - D = 1,24 mm (18 BWG)",2.0000000000000002E-5,"tkm"]
[null,null,null,"Custo unitário total de transporte"]
[{"$nulls":5},"Custo unitário direto total",null,null,null,{"$f":"TRUNC(J1723+J1727,2)","v":11.84}]
[null,"Obs."]
[]
[45,"1ª/GRD",{"$nulls":8},{"$f":"J1772","v":117.51}]
[null,"OBRA:"," DRENAGEM E PAVIMENTAÇÃO - VIAS INTERNAS DO PARQUE DE EXPOSIÇÕES E RUA BOM JARDIM (BAIRRO SANTO ANTÔNIO) - SERRO-MG"]
[null,"Custo Unitário de Referência",null,null,"Minas Gerais"]
[{"$nulls":4}," Outubro/2024 ",null,null,"Produção da equipe ",1,{"$f":"VLOOKUP(A1736,ORÇAMENTO!$A$10:$L$69,7,1)","v":"M2"}]
[null,909620,"ALVENARIA COM BLOCOS DE CONCRETO 19X19X39, COM ESPESSURA DE 20CM",{"$nulls":5},"Valores em reais (R$)"]
[null,"A - EQUIPAMENTOS",null,"Quantidade","Utilização",null,"Custo Horário",null,null,"Custo"]
[{"$nulls":4},"Operativa","Improdutiva","Produtivo","Improdutivo",null,"Horário Total"]
[null,"-",0,null,null,null,0,0,null,{"$f":"D1743*(E1743*G1743+F1743*H1743)","v":0}]
[null,"-",0,null,null,null,0,0,null,{"$f":"D1744*(E1744*G1744+F1744*H1744)","v":0}]
[{"$nulls":7},"Custo horário total de equipamentos",null,{"$f":"SUM(J1743:J1744)","v":0}]
[null,"B - MÃO DE OBRA",null,"Quantidade","Unidade",null,"Custo Horário","Custo Horário Total"]
[null,"P9821","Pedreiro",1,"h",null,26.1035,null,null,{"$f":"D1747*G1747","v":26.1035}]
[null,"P9824","Servente",1,"h",null,20.631399999999999,null,null,{"$f":"D1748*G1748","v":20.631399999999999}]
[null,null,null,"Custo horário total de mão de obra",{"$nulls":5},{"$f":"SUM(J1747:J1748)","v":46.734899999999996}]
[null,null,null,"Custo horário total de execução",{"$nulls":5},{"$f":"J1745+J1749","v":46.734899999999996}]
[null,null,null,"Custo unitário de execução",{"$nulls":5},{"$f":"J1750/I1739","v":46.734899999999996}]
[{"$nulls":7},"Custo do FIC",null,0]
[{"$nulls":7},"Custo do FIT",null,0]
[null,"C - MATERIAL",null,"Quantidade","Unidade",null,"Preço Unitário","Custo Unitário"]
[null,"M0156","Bloco de concreto - L = 19 cm, A = 19 cm e C = 39 cm",13,"un",null,4.4000000000000004,null,null,{"$f":"D1755*G1755","v":57.2}]
[null,"-",0,null,0,null,0,null,null,{"$f":"D1756*G1756","v":0}]
[null,null,null,"Custo unitário total de material",{"$nulls":5},{"$f":"SUM(J1755:J1756)","v":57.2}]
[null,"D - ATIVIDADES AUXILIARES",null,"Quantidade","Unidade",null,"Custo Unitário","Custo Unitário"]
[null,1109622,"Argamassa de cimento, cal hidratada e areia 1:0,5:3,5 - confecção em betoneira e lançamento manual - areia comercial",1.4999999999999999E-2,"m³",null,460.02,null,null,{"$f":"D1759*G1759","v":6.9002999999999997}]
[null,"-",0,null,0,null,0,null,null,{"$f":"D1760*G1760","v":0}]
[null,null,null,"Custo total de atividades auxiliares",{"$nulls":5},{"$f":"SUM(J1759:J1760)","v":6.9002999999999997}]
[{"$nulls":7},"Subtotal",null,{"$f":"J1751+J1757+J1761+J1752+J1753","v":110.8352}]
[null,"E - TEMPO FIXO",null,"Código","Quantidade","Unidade",null,"Custo Unitário","Custo Unitário"]
[null,"M0156","Bloco de concreto - L = 19 cm, A = 19 cm e C = 39 cm",5914655,0.21060000000000001,"t",null,31.73,null,{"$f":"ROUNDDOWN(E1764*H1764,4)","v":6.6822999999999997}]
[null,"-",0,"-",null,"t",null,0,null,{"$f":"ROUNDDOWN(E1765*H1765,4)","v":0}]
[null,null,null,"Custo unitário total de tempo fixo",{"$nulls":5},{"$f":"SUM(J1764:J1765)","v":6.6822999999999997}]
[null,"F - MOMENTO DE TRANSPORTE",null,"Quantidade","Unidade","DMT",null,null,null,"Custo Unitário"]
[{"$nulls":5},"LN","RP","P"]
[null,"M0156","Bloco de concreto - L = 19 cm, A = 19 cm e C = 39 cm",0.21060000000000001,"tkm"]
[null,"-",0,null,"tkm"]
[null,null,null,"Custo unitário total de transporte"]
[{"$nulls":5},"Custo unitário direto total",null,null,null,{"$f":"TRUNC(J1762+J1766,2)","v":117.51}]
[null,"Obs."]
[]
[46,"1ª/GRD",{"$nulls":8},{"$f":"J1811","v":165.66}]
[null,"OBRA:"," DRENAGEM E PAVIMENTAÇÃO - VIAS INTERNAS DO PARQUE DE EXPOSIÇÕES E RUA BOM JARDIM (BAIRRO SANTO ANTÔNIO) - SERRO-MG"]
[null,"Custo Unitário de Referência",null,null,"Minas Gerais"]
[{"$nulls":4}," Outubro/2024 ",null,null,"Produção da equipe ",1,{"$f":"VLOOKUP(A1775,ORÇAMENTO!$A$10:$L$69,7,1)","v":"M2"}]
[null,"909620a","ALVENARIA COM BLOCOS DE CONCRETO 19X19X39, COM ESPESSURA DE 20CM, INCLUSIVE ENCHIMENTO DE CONCRETO",{"$nulls":5},"Valores em reais (R$)"]
[null,"A - EQUIPAMENTOS",null,"Quantidade","Utilização",null,"Custo Horário",null,null,"Custo"]
[{"$nulls":4},"Operativa","Improdutiva","Produtivo","Improdutivo",null,"Horário Total"]
[null,"-",0,null,null,null,0,0,null,{"$f":"D1782*(E1782*G1782+F1782*H1782)","v":0}]
[null,"-",0,null,null,null,0,0,null,{"$f":"D1783*(E1783*G1783+F1783*H1783)","v":0}]
[{"$nulls":7},"Custo horário total de equipamentos",null,{"$f":"SUM(J1782:J1783)","v":0}]
[null,"B - MÃO DE OBRA",null,"Quantidade","Unidade",null,"Custo Horário","Custo Horário Total"]
[null,"P9821","Pedreiro",1,"h",null,26.1035,null,null,{"$f":"D1786*G1786","v":26.1035}]
[null,"P9824","Servente",1,"h",null,20.631399999999999,null,null,{"$f":"D1787*G1787","v":20.631399999999999}]
[null,null,null,"Custo horário total de mão de obra",{"$nulls":5},{"$f":"SUM(J1786:J1787)","v":46.734899999999996}]
[null,null,null,"Custo horário total de execução",{"$nulls":5},{"$f":"J1784+J1788","v":46.734899999999996}]
[null,null,null,"Custo unitário de execução",{"$nulls":5},{"$f":"J1789/I1778","v":46.734899999999996}]
[{"$nulls":7},"Custo do FIC",null,0]
[{"$nulls":7},"Custo do FIT",null,0]
[null,"C - MATERIAL",null,"Quantidade","Unidade",null,"Preço Unitário","Custo Unitário"]
[null,"M0156","Bloco de concreto - L = 19 cm, A = 19 cm e C = 39 cm",13,"un",null,4.4000000000000004,null,null,{"$f":"D1794*G1794","v":57.2}]
[null,"-",0,null,0,null,0,null,null,{"$f":"D1795*G1795","v":0}]
[null,null,null,"Custo unitário total de material",{"$nulls":5},{"$f":"SUM(J1794:J1795)","v":57.2}]
[null,"D - ATIVIDADES AUXILIARES",null,"Quantidade","Unidade",null,"Custo Unitário","Custo Unitário"]
[null,1109622,"Argamassa de cimento, cal hidratada e areia 1:0,5:3,5 - confecção em betoneira e lançamento manual - areia comercial",1.4999999999999999E-2,"m³",null,460.02,null,null,{"$f":"D1798*G1798","v":6.9002999999999997}]
[null,1107892,"Concreto fck = 20 MPa - confecção em betoneira e lançamento manual - areia e brita comerciais",9.9610159999999989E-2,"m³",null,483.33,null,null,{"$f":"D1799*G1799","v":48.144578632799991}]
[null,null,null,"Custo total de atividades auxiliares",{"$nulls":5},{"$f":"SUM(J1798:J1799)","v":55.044878632799993}]
[{"$nulls":7},"Subtotal",null,{"$f":"J1790+J1796+J1800+J1791+J1792","v":158.97977863279999}]
[null,"E - TEMPO FIXO",null,"Código","Quantidade","Unidade",null,"Custo Unitário","Custo Unitário"]
[null,"M0156","Bloco de concreto - L = 19 cm, A = 19 cm e C = 39 cm",5914655,0.21060000000000001,"t",null,31.73,null,{"$f":"ROUNDDOWN(E1803*H1803,4)","v":6.6822999999999997}]
[null,"-",0,"-",null,"t",null,0,null,{"$f":"ROUNDDOWN(E1804*H1804,4)","v":0}]
[null,null,null,"Custo unitário total de tempo fixo",{"$nulls":5},{"$f":"SUM(J1803:J1804)","v":6.6822999999999997}]
[null,"F - MOMENTO DE TRANSPORTE",null,"Quantidade","Unidade","DMT",null,null,null,"Custo Unitário"]
[{"$nulls":5},"LN","RP","P"]
[null,"M0156","Bloco de concreto - L = 19 cm, A = 19 cm e C = 39 cm",0.21060000000000001,"tkm"]
[null,"-",0,null,"tkm"]
[null,null,null,"Custo unitário total de transporte"]
[{"$nulls":5},"Custo unitário direto total",null,null,null,{"$f":"TRUNC(J1801+J1805,2)","v":165.66}]
[null,"Obs."]
[]
[47,"1ª/GRD",{"$nulls":8},{"$f":"J1853","v":21.53}]
[null,"OBRA:"," DRENAGEM E PAVIMENTAÇÃO - VIAS INTERNAS DO PARQUE DE EXPOSIÇÕES E RUA BOM JARDIM (BAIRRO SANTO ANTÔNIO) - SERRO-MG"]
[null,"Custo Unitário de Referência",null,null,"Minas Gerais"]
[{"$nulls":4}," Outubro/2024 ",null,null,"Produção da equipe ",1,{"$f":"VLOOKUP(A1814,ORÇAMENTO!$A$10:$L$69,7,1)","v":"UN."}]
[null,"2003821a","DRENO TIPO BARBACÃ - D = 50MM, EM ESTRUTURA DE CONTENÇÃO DE ENCOSTAS (DRB 02) - INCLUSIVE TUBO DE DRENAGEM",{"$nulls":5},"Valores em reais (R$)"]
[null,"A - EQUIPAMENTOS",null,"Quantidade","Utilização",null,"Custo Horário",null,null,"Custo"]
[{"$nulls":4},"Operativa","Improdutiva","Produtivo","Improdutivo",null,"Horário Total"]
[null,"-",0,null,null,null,0,0,null,{"$f":"D1821*(E1821*G1821+F1821*H1821)","v":0}]
[null,"-",0,null,null,null,0,0,null,{"$f":"D1822*(E1822*G1822+F1822*H1822)","v":0}]
[{"$nulls":7},"Custo horário total de equipamentos",null,{"$f":"SUM(J1821:J1822)","v":0}]
[null,"B - MÃO DE OBRA",null,"Quantidade","Unidade",null,"Custo Horário","Custo Horário Total"]
[null,"P9824","Servente",0.4,"h",null,20.631399999999999,null,null,{"$f":"D1825*G1825","v":8.2525600000000008}]
[null,"-",0,null,0,null,0,null,null,{"$f":"D1826*G1826","v":0}]
[null,null,null,"Custo horário total de mão de obra",{"$nulls":5},{"$f":"SUM(J1825:J1826)","v":8.2525600000000008}]
[null,null,null,"Custo horário total de execução",{"$nulls":5},{"$f":"J1823+J1827","v":8.2525600000000008}]
[null,null,null,"Custo unitário de execução",{"$nulls":5},{"$f":"J1828/I1817","v":8.2525600000000008}]
[{"$nulls":7},"Custo do FIC",null,0]
[{"$nulls":7},"Custo do FIT",null,0]
[null,"C - MATERIAL",null,"Quantidade","Unidade",null,"Preço Unitário","Custo Unitário"]
[null,"M3089","Arame liso em aço galvanizado - D = 1,24 mm (18 BWG)",3.7299999999999998E-3,"kg",null,20.7,null,null,{"$f":"D1833*G1833","v":7.7210999999999988E-2}]
[null,"M2137","Tubo de PVC soldável para água fria - D = 50 mm (2\")",0.4,"m",null,11.966699999999999,null,null,{"$f":"D1834*G1834","v":4.7866799999999996}]
[null,"M0005","Brita 0",2.6610000000000002E-2,"m³",null,181.11600000000001,null,null,{"$f":"D1835*G1835","v":4.8194967600000007}]
[null,"M2050","Geotêxtil não-tecido agulhado em poliéster - resistência à tração longitudinal de 9 kN/m",0.54,"m²",null,5.1281999999999996,null,null,2.769228]
[null,"M3093","Tela de poliamida - malha de 60 fios/cm",4.0059999999999998E-2,"m²",null,18.988499999999998,null,null,0.76067930999999989]
[null,null,null,"Custo unitário total de material",{"$nulls":5},{"$f":"SUM(J1833:J1837)","v":13.213295070000001}]
[null,"D - ATIVIDADES AUXILIARES",null,"Quantidade","Unidade",null,"Custo Unitário","Custo Unitário"]
[null,"-",0,null,0,null,0,null,null,{"$f":"D1840*G1840","v":0}]
[null,"-",0,null,0,null,0,null,null,{"$f":"D1841*G1841","v":0}]
[null,null,null,"Custo total de atividades auxiliares",{"$nulls":5},{"$f":"SUM(J1840:J1841)","v":0}]
[{"$nulls":7},"Subtotal",null,{"$f":"J1829+J1838+J1842+J1830+J1831","v":21.465855070000003}]
[null,"E - TEMPO FIXO",null,"Código","Quantidade","Unidade",null,"Custo Unitário","Custo Unitário"]
[null,"M0005","Brita 0",5914647,3.9919999999999997E-2,"t",null,1.78,null,{"$f":"ROUNDDOWN(E1845*H1845,4)","v":7.0999999999999994E-2}]
[null,"M2050","Geotêxtil não-tecido agulhado em poliéster - resistência à tração longitudinal de 9 kN/m",5914655,1E-4,"t",null,31.73,null,{"$f":"ROUNDDOWN(E1846*H1846,4)","v":3.0999999999999999E-3}]
[null,null,null,"Custo unitário total de tempo fixo",{"$nulls":5},{"$f":"SUM(J1845:J1846)","v":7.4099999999999999E-2}]
[null,"F - MOMENTO DE TRANSPORTE",null,"Quantidade","Unidade","DMT",null,null,null,"Custo Unitário"]
[{"$nulls":5},"LN","RP","P"]
[null,"M0005","Brita 0",3.9919999999999997E-2,"tkm"]
[null,"M2050","Geotêxtil não-tecido agulhado em poliéster - resistência à tração longitudinal de 9 kN/m",1E-4,"tkm"]
[null,null,null,"Custo unitário total de transporte"]
[{"$nulls":5},"Custo unitário direto total",null,null,null,{"$f":"TRUNC(J1843+J1847,2)","v":21.53}]
[null,"Obs."]
[]
[48,"1ª/GRD",{"$nulls":8},{"$f":"J1892","v":31.09}]
[null,"OBRA:"," DRENAGEM E PAVIMENTAÇÃO - VIAS INTERNAS DO PARQUE DE EXPOSIÇÕES E RUA BOM JARDIM (BAIRRO SANTO ANTÔNIO) - SERRO-MG"]
[null,"Custo Unitário de Referência",null,null,"Minas Gerais"]
[{"$nulls":4}," Outubro/2024 ",null,null,"Produção da equipe ",1,{"$f":"VLOOKUP(A1856,ORÇAMENTO!$A$10:$L$69,7,1)","v":"M2"}]
[null,903789,"EMBOÇO COM ARGAMASSA TRAÇO 1:2:8, APLICADO MANUALMENTE",{"$nulls":5},"Valores em reais (R$)"]
[null,"A - EQUIPAMENTOS",null,"Quantidade","Utilização",null,"Custo Horário",null,null,"Custo"]
[{"$nulls":4},"Operativa","Improdutiva","Produtivo","Improdutivo",null,"Horário Total"]
[null,"-",0,null,null,null,0,0,null,{"$f":"D1863*(E1863*G1863+F1863*H1863)","v":0}]
[null,"-",0,null,null,null,0,0,null,{"$f":"D1864*(E1864*G1864+F1864*H1864)","v":0}]
[{"$nulls":7},"Custo horário total de equipamentos",null,{"$f":"SUM(J1863:J1864)","v":0}]
[null,"B - MÃO DE OBRA",null,"Quantidade","Unidade",null,"Custo Horário","Custo Horário Total"]
[null,"P9821","Pedreiro",0.47,"h",null,26.1035,null,null,{"$f":"D1867*G1867","v":12.268644999999999}]
[null,"P9824","Servente",0.17100000000000001,"h",null,20.631399999999999,null,null,{"$f":"D1868*G1868","v":3.5279694000000004}]
[null,null,null,"Custo horário total de mão de obra",{"$nulls":5},{"$f":"SUM(J1867:J1868)","v":15.796614399999999}]
[null,null,null,"Custo horário total de execução",{"$nulls":5},{"$f":"J1865+J1869","v":15.796614399999999}]
[null,null,null,"Custo unitário de execução",{"$nulls":5},{"$f":"J1870/I1859","v":15.796614399999999}]
[{"$nulls":7},"Custo do FIC",null,0]
[{"$nulls":7},"Custo do FIT",null,0]
[null,"C - MATERIAL",null,"Quantidade","Unidade",null,"Preço Unitário","Custo Unitário"]
[null,"-",0,null,0,null,0,null,null,{"$f":"D1875*G1875","v":0}]
[null,"-",0,null,0,null,0,null,null,{"$f":"D1876*G1876","v":0}]
[null,null,null,"Custo unitário total de material",{"$nulls":5},{"$f":"SUM(J1875:J1876)","v":0}]
[null,"D - ATIVIDADES AUXILIARES",null,"Quantidade","Unidade",null,"Custo Unitário","Custo Unitário"]
[null,1109675,"Argamassa de cimento, cal hidratada e areia 1:2:8 - confecção em betoneira e lançamento manual - areia comercial",3.7600000000000001E-2,"m³",null,406.79,null,null,{"$f":"D1879*G1879","v":15.295304000000002}]
[null,"-",0,null,0,null,0,null,null,{"$f":"D1880*G1880","v":0}]
[null,null,null,"Custo total de atividades auxiliares",{"$nulls":5},{"$f":"SUM(J1879:J1880)","v":15.295304000000002}]
[{"$nulls":7},"Subtotal",null,{"$f":"J1871+J1877+J1881+J1872+J1873","v":31.091918400000001}]
[null,"E - TEMPO FIXO",null,"Código","Quantidade","Unidade",null,"Custo Unitário","Custo Unitário"]
[null,"-",0,"-",null,"t",null,0,null,{"$f":"ROUNDDOWN(E1884*H1884,4)","v":0}]
[null,"-",0,"-",null,"t",null,0,null,{"$f":"ROUNDDOWN(E1885*H1885,4)","v":0}]
[null,null,null,"Custo unitário total de tempo fixo",{"$nulls":5},{"$f":"SUM(J1884:J1885)","v":0}]
[null,"F - MOMENTO DE TRANSPORTE",null,"Quantidade","Unidade","DMT",null,null,null,"Custo Unitário"]
[{"$nulls":5},"LN","RP","P"]
[null,"-",0,null,"tkm"]
[null,"-",0,null,"tkm"]
[null,null,null,"Custo unitário total de transporte"]
[{"$nulls":5},"Custo unitário direto total",null,null,null,{"$f":"TRUNC(J1882+J1886,2)","v":31.09}]
[null,"Obs."]
[]
[49,"1ª/GRD",{"$nulls":8},{"$f":"J1931","v":256.2}]
[null,"OBRA:"," DRENAGEM E PAVIMENTAÇÃO - VIAS INTERNAS DO PARQUE DE EXPOSIÇÕES E RUA BOM JARDIM (BAIRRO SANTO ANTÔNIO) - SERRO-MG"]
[null,"Custo Unitário de Referência",null,null,"Minas Gerais"]
[{"$nulls":4}," Outubro/2024 ",null,null,"Produção da equipe ",3,{"$f":"VLOOKUP(A1895,ORÇAMENTO!$A$10:$L$69,7,1)","v":"UN."}]
[null,5213440,"PLACA DE REGULAMENTAÇÃO EM AÇO, D=60CM - PELÍCULA RETRORREFLETIVA - FORNECIMENTO E INSTALAÇÃO, INCLUSIVE  SUPORTE",{"$nulls":5},"Valores em reais (R$)"]
[null,"A - EQUIPAMENTOS",null,"Quantidade","Utilização",null,"Custo Horário",null,null,"Custo"]
[{"$nulls":4},"Operativa","Improdutiva","Produtivo","Improdutivo",null,"Horário Total"]
[null,"E9687","Caminhão carroceria com capacidade de 5 t - 115 kW",1,0.3,0.7,142.93629999999999,55.767499999999998,null,{"$f":"D1902*(E1902*G1902+F1902*H1902)","v":81.918139999999994}]
[null,"-",0,null,null,null,0,0,null,{"$f":"D1903*(E1903*G1903+F1903*H1903)","v":0}]
[{"$nulls":7},"Custo horário total de equipamentos",null,{"$f":"SUM(J1902:J1903)","v":81.918139999999994}]
[null,"B - MÃO DE OBRA",null,"Quantidade","Unidade",null,"Custo Horário","Custo Horário Total"]
[null,"P9830","Montador",1,"h",null,36.365400000000001,null,null,{"$f":"D1906*G1906","v":36.365400000000001}]
[null,"P9824","Servente",2,"h",null,20.631399999999999,null,null,{"$f":"D1907*G1907","v":41.262799999999999}]
[null,null,null,"Custo horário total de mão de obra",{"$nulls":5},{"$f":"SUM(J1906:J1907)","v":77.628199999999993}]
[null,null,null,"Custo horário total de execução",{"$nulls":5},{"$f":"J1904+J1908","v":159.54633999999999}]
[null,null,null,"Custo unitário de execução",{"$nulls":5},{"$f":"J1909/I1898","v":53.182113333333326}]
[{"$nulls":7},"Custo do FIC",null,0]
[{"$nulls":7},"Custo do FIT",null,0]
[null,"C - MATERIAL",null,"Quantidade","Unidade",null,"Preço Unitário","Custo Unitário"]
[null,"-",0,null,0,null,0,null,null,{"$f":"D1914*G1914","v":0}]
[null,"-",0,null,0,null,0,null,null,{"$f":"D1915*G1915","v":0}]
[null,null,null,"Custo unitário total de material",{"$nulls":5},{"$f":"SUM(J1914:J1915)","v":0}]
[null,"D - ATIVIDADES AUXILIARES",null,"Quantidade","Unidade",null,"Custo Unitário","Custo Unitário"]
[null,5213414,"Placa em aço nº 16 galvanizado com película retrorrefletiva tipo I + SI - confecção",0.35993999999999998,"m²",null,564.05999999999995,null,null,{"$f":"D1918*G1918","v":203.02775639999996}]
[null,"-",0,null,0,null,0,null,null,{"$f":"D1919*G1919","v":0}]
[null,null,null,"Custo total de atividades auxiliares",{"$nulls":5},{"$f":"SUM(J1918:J1919)","v":203.02775639999996}]
[{"$nulls":7},"Subtotal",null,{"$f":"J1910+J1916+J1920+J1911+J1912","v":256.20986973333328}]
[null,"E - TEMPO FIXO",null,"Código","Quantidade","Unidade",null,"Custo Unitário","Custo Unitário"]
[null,"-",0,"-",null,"t",null,0,null,{"$f":"ROUNDDOWN(E1923*H1923,4)","v":0}]
[null,"-",0,"-",null,"t",null,0,null,{"$f":"ROUNDDOWN(E1924*H1924,4)","v":0}]
[null,null,null,"Custo unitário total de tempo fixo",{"$nulls":5},{"$f":"SUM(J1923:J1924)","v":0}]
[null,"F - MOMENTO DE TRANSPORTE",null,"Quantidade","Unidade","DMT",null,null,null,"Custo Unitário"]
[{"$nulls":5},"LN","RP","P"]
[null,"-",0,null,"tkm"]
[null,"-",0,null,"tkm"]
[null,null,null,"Custo unitário total de transporte"]
[{"$nulls":5},"Custo unitário direto total",null,null,null,{"$f":"TRUNC(J1921+J1925,2)","v":256.2}]
[null,"Obs."]
[]
[50,"1ª/GRD",{"$nulls":8},{"$f":"J1977","v":32.409999999999997}]
[null,"OBRA:"," DRENAGEM E PAVIMENTAÇÃO - VIAS INTERNAS DO PARQUE DE EXPOSIÇÕES E RUA BOM JARDIM (BAIRRO SANTO ANTÔNIO) - SERRO-MG"]
[null,"Custo Unitário de Referência",null,null,"Minas Gerais"]
[{"$nulls":4}," Outubro/2024 ",null,null,"Produção da equipe ",149.4,{"$f":"VLOOKUP(A1934,ORÇAMENTO!$A$10:$L$69,7,1)","v":"M2"}]
[null,5213401,"PINTURA DE EIXO VIÁRIO SOBRE ASFALTO COM TINTA RETRORREFLETIVA A BASE DE RESINA ACRÍLICA COM MICROESFERAS DE VIDRO, APLICAÇÃO MECÂNICA COM DEMARCADORA AUTOPROPELIDA",{"$nulls":5},"Valores em reais (R$)"]
[null,"A - EQUIPAMENTOS",null,"Quantidade","Utilização",null,"Custo Horário",null,null,"Custo"]
[{"$nulls":4},"Operativa","Improdutiva","Produtivo","Improdutivo",null,"Horário Total"]
[null,"E9644","Caminhão demarcador de faixas com sistema de pintura a frio - 28 kW/115 kW",1,1,0,366.9502,152.35400000000001,null,{"$f":"D1941*(E1941*G1941+F1941*H1941)","v":366.9502}]
[null,"-",0,null,null,null,0,0,null,{"$f":"D1942*(E1942*G1942+F1942*H1942)","v":0}]
[{"$nulls":7},"Custo horário total de equipamentos",null,{"$f":"SUM(J1941:J1942)","v":366.9502}]
[null,"B - MÃO DE OBRA",null,"Quantidade","Unidade",null,"Custo Horário","Custo Horário Total"]
[null,"P9853","Pré-marcador",1,"h",null,22.472100000000001,null,null,{"$f":"D1945*G1945","v":22.472100000000001}]
[null,"P9824","Servente",4,"h",null,20.631399999999999,null,null,{"$f":"D1946*G1946","v":82.525599999999997}]
[null,null,null,"Custo horário total de mão de obra",{"$nulls":5},{"$f":"SUM(J1945:J1946)","v":104.99769999999999}]
[null,null,null,"Custo horário total de execução",{"$nulls":5},{"$f":"J1943+J1947","v":471.9479}]
[null,null,null,"Custo unitário de execução",{"$nulls":5},{"$f":"J1948/I1937","v":3.1589551539491296}]
[{"$nulls":7},"Custo do FIC",null,0]
[{"$nulls":7},"Custo do FIT",null,0]
[null,"C - MATERIAL",null,"Quantidade","Unidade",null,"Preço Unitário","Custo Unitário"]
[null,"M2037","Microesferas refletivas de vidro tipo I-B",0.12,"kg",null,9.0991,null,null,{"$f":"D1953*G1953","v":1.0918919999999999}]
[null,"M2038","Microesferas refletivas de vidro tipo II-A",0.35,"kg",null,9.2805999999999997,null,null,{"$f":"D1954*G1954","v":3.2482099999999998}]
[null,"M2034","Solvente para tinta à base de resina acrílica",0.03,"l",null,16.705500000000001,null,null,{"$f":"D1955*G1955","v":0.50116499999999997}]
[null,"M2044","Tinta à base de resina acrílica emulsionada em água para pré-marcação viária",9.7000000000000005E-4,"l",null,21.940899999999999,null,null,{"$f":"D1956*G1956","v":2.1282673000000002E-2}]
[null,"M2027","Tinta à base de resina acrílica estirenada para demarcação viária",0.6,"l",null,40.589599999999997,null,null,{"$f":"D1957*G1957","v":24.353759999999998}]
[null,null,null,"Custo unitário total de material",{"$nulls":5},{"$f":"SUM(J1953:J1957)","v":29.216309672999998}]
[null,"D - ATIVIDADES AUXILIARES",null,"Quantidade","Unidade",null,"Custo Unitário","Custo Unitário"]
[null,"-",0,null,0,null,0,null,null,{"$f":"D1960*G1960","v":0}]
[null,"-",0,null,0,null,0,null,null,{"$f":"D1961*G1961","v":0}]
[null,null,null,"Custo total de atividades auxiliares",{"$nulls":5},{"$f":"SUM(J1960:J1961)","v":0}]
[{"$nulls":7},"Subtotal",null,{"$f":"J1949+J1958+J1962+J1950+J1951","v":32.375264826949127}]
[null,"E - TEMPO FIXO",null,"Código","Quantidade","Unidade",null,"Custo Unitário","Custo Unitário"]
[null,"M2037","Microesferas refletivas de vidro tipo I-B",5914655,1.2E-4,"t",null,31.73,null,{"$f":"ROUNDDOWN(E1965*H1965,4)","v":3.8E-3}]
[null,"M2038","Microesferas refletivas de vidro tipo II-A",5914655,3.5E-4,"t",null,31.73,null,{"$f":"ROUNDDOWN(E1966*H1966,4)","v":1.11E-2}]
[null,"M2034","Solvente para tinta à base de resina acrílica",5914655,3.0000000000000001E-5,"t",null,31.73,null,{"$f":"ROUNDDOWN(E1967*H1967,4)","v":8.9999999999999998E-4}]
[null,"M2027","Tinta à base de resina acrílica estirenada para demarcação viária",5914655,8.3000000000000001E-4,"t",null,31.73,null,{"$f":"ROUNDDOWN(E1968*H1968,4)","v":2.63E-2}]
[null,null,null,"Custo unitário total de tempo fixo",{"$nulls":5},{"$f":"SUM(J1965:J1968)","v":4.2099999999999999E-2}]
[null,"F - MOMENTO DE TRANSPORTE",null,"Quantidade","Unidade","DMT",null,null,null,"Custo Unitário"]
[{"$nulls":5},"LN","RP","P"]
[null,"M2037","Microesferas refletivas de vidro tipo I-B",1.2E-4,"tkm"]
[null,"M2038","Microesferas refletivas de vidro tipo II-A",3.5E-4,"tkm"]
[null,"M2034","Solvente para tinta à base de resina acrílica",3.0000000000000001E-5,"tkm"]
[null,"M2027","Tinta à base de resina acrílica estirenada para demarcação viária",8.3000000000000001E-4,"tkm"]
[null,null,null,"Custo unitário total de transporte"]
[{"$nulls":5},"Custo unitário direto total",null,null,null,{"$f":"TRUNC(J1963+J1969,2)","v":32.409999999999997}]
[null,"Obs."]
[]
[51,"1ª/GRD",{"$nulls":8},{"$f":"J2018","v":15.84}]
[null,"OBRA:"," DRENAGEM E PAVIMENTAÇÃO - VIAS INTERNAS DO PARQUE DE EXPOSIÇÕES E RUA BOM JARDIM (BAIRRO SANTO ANTÔNIO) - SERRO-MG"]
[null,"Custo Unitário de Referência",null,null,"Minas Gerais"]
[{"$nulls":4}," Outubro/2024 ",null,null,"Produção da equipe ",1,{"$f":"VLOOKUP(A1980,ORÇAMENTO!$A$10:$L$69,7,1)","v":"M2"}]
[null,903818,"PINTURA COM TINTA LATEX A BASE DE RESINA ACRÍLICA, DUAS CAMADAS COM APLICAÇÃO MANUAL",{"$nulls":5},"Valores em reais (R$)"]
[null,"A - EQUIPAMENTOS",null,"Quantidade","Utilização",null,"Custo Horário",null,null,"Custo"]
[{"$nulls":4},"Operativa","Improdutiva","Produtivo","Improdutivo",null,"Horário Total"]
[null,"-",0,null,null,null,0,0,null,{"$f":"D1987*(E1987*G1987+F1987*H1987)","v":0}]
[null,"-",0,null,null,null,0,0,null,{"$f":"D1988*(E1988*G1988+F1988*H1988)","v":0}]
[{"$nulls":7},"Custo horário total de equipamentos",null,{"$f":"SUM(J1987:J1988)","v":0}]
[null,"B - MÃO DE OBRA",null,"Quantidade","Unidade",null,"Custo Horário","Custo Horário Total"]
[null,"P9822","Pintor",0.34399999999999997,"h",null,33.417999999999999,null,null,{"$f":"D1991*G1991","v":11.495791999999998}]
[null,"P9824","Servente",8.5999999999999993E-2,"h",null,20.631399999999999,null,null,{"$f":"D1992*G1992","v":1.7743003999999998}]
[null,null,null,"Custo horário total de mão de obra",{"$nulls":5},{"$f":"SUM(J1991:J1992)","v":13.270092399999998}]
[null,null,null,"Custo horário total de execução",{"$nulls":5},{"$f":"J1989+J1993","v":13.270092399999998}]
[null,null,null,"Custo unitário de execução",{"$nulls":5},{"$f":"J1994/I1983","v":13.270092399999998}]
[{"$nulls":7},"Custo do FIC",null,0]
[{"$nulls":7},"Custo do FIT",null,0]
[null,"C - MATERIAL",null,"Quantidade","Unidade",null,"Preço Unitário","Custo Unitário"]
[null,"M1575","Tinta látex à base de resina acrílica",0.2,"l",null,12.827299999999999,null,null,{"$f":"D1999*G1999","v":2.5654599999999999}]
[null,"-",0,null,0,null,0,null,null,{"$f":"D2000*G2000","v":0}]
[null,null,null,"Custo unitário total de material",{"$nulls":5},{"$f":"SUM(J1999:J2000)","v":2.5654599999999999}]
[null,"D - ATIVIDADES AUXILIARES",null,"Quantidade","Unidade",null,"Custo Unitário","Custo Unitário"]
[null,"-",0,null,0,null,0,null,null,{"$f":"D2003*G2003","v":0}]
[null,"-",0,null,0,null,0,null,null,{"$f":"D2004*G2004","v":0}]
[null,null,null,"Custo total de atividades auxiliares",{"$nulls":5},{"$f":"SUM(J2003:J2004)","v":0}]
[{"$nulls":7},"Subtotal",null,{"$f":"J1995+J2001+J2005+J1996+J1997","v":15.835552399999997}]
[null,"E - TEMPO FIXO",null,"Código","Quantidade","Unidade",null,"Custo Unitário","Custo Unitário"]
[null,"M1575","Tinta látex à base de resina acrílica",5914655,2.5000000000000001E-4,"t",null,31.73,null,{"$f":"ROUNDDOWN(E2008*H2008,4)","v":7.9000000000000008E-3}]
[null,"-",0,5914655,null,"t",null,31.73,null,{"$f":"ROUNDDOWN(E2009*H2009,4)","v":0}]
[null,null,null,"Custo unitário total de tempo fixo",{"$nulls":5},{"$f":"SUM(J2008:J2009)","v":7.9000000000000008E-3}]
[null,"F - MOMENTO DE TRANSPORTE",null,"Quantidade","Unidade","DMT",null,null,null,"Custo Unitário"]
[{"$nulls":5},"LN","RP","P"]
[null,"M2037","Microesferas refletivas de vidro tipo I-B",1.2E-4,"tkm"]
[null,"M2038","Microesferas refletivas de vidro tipo II-A",3.5E-4,"tkm"]
[null,"M2034","Solvente para tinta à base de resina acrílica",3.0000000000000001E-5,"tkm"]
[null,"M2027","Tinta à base de resina acrílica estirenada para demarcação viária",8.3000000000000001E-4,"tkm"]
[null,null,null,"Custo unitário total de transporte"]
[{"$nulls":5},"Custo unitário direto total",null,null,null,{"$f":"TRUNC(J2006+J2010,2)","v":15.84}]
[null,"Obs."]

{"sheet":"CPU-FORNEC","index":2,"n_rows":92,"n_cols":14,"rows_kept":92,"cut":false,"hidden":false,"merged":[[71,0,80,0],[71,1,71,3],[71,4,71,7],[72,2,72,5],[73,2,73,3],[74,1,74,7],[77,1,77,3],[77,5,77,6],[78,1,78,6],[79,1,79,6],[80,1,80,6],[0,0,26,0],[0,1,0,3],[0,4,0,7],[22,1,22,3],[49,0,58,0],[49,1,49,3],[49,4,49,7],[50,2,50,5],[51,2,51,3],[52,1,52,7],[55,1,55,3],[55,5,55,6],[56,1,56,6],[57,1,57,6],[58,1,58,6],[27,1,27,3],[27,4,27,7],[28,2,28,5],[27,0,36,0],[29,2,29,3],[30,1,30,7],[33,1,33,3],[33,5,33,6],[34,1,34,6],[35,1,35,6],[36,1,36,6],[0,10,0,11],[1,2,1,5],[1,10,1,11],[2,2,2,3],[3,1,3,7],[22,5,22,6],[23,1,23,6],[24,1,24,6],[25,1,25,6],[5,1,5,7],[9,1,9,7],[13,1,13,7],[17,1,17,7],[38,0,47,0],[38,1,38,3],[38,4,38,7],[39,2,39,5],[40,2,40,3],[41,1,41,7],[44,1,44,3],[44,5,44,6],[45,1,45,6],[46,1,46,6],[47,1,47,6],[60,0,69,0],[60,1,60,3],[60,4,60,7],[61,2,61,5],[62,2,62,3],[63,1,63,7],[66,1,66,3],[66,5,66,6],[67,1,67,6],[68,1,68,6],[69,1,69,6],[81,1,81,7],[82,0,91,0],[82,1,82,3],[82,4,82,7],[83,2,83,5],[84,2,84,3],[85,1,85,7],[88,1,88,3],[88,5,88,6],[89,1,89,6],[90,1,90,6],[91,1,91,6]]}
[1,"CODEVASF",null,null," COMPOSIÇÃO DE PREÇO UNITÁRIO",null,null,null,{"$f":"H24","v":0},{"$f":"H26","v":0},"BDI CALCULADO:",null,{"$f":"ORÇAMENTO!L6","v":15}]
[null,"OBRA:  ",{"$f":"ORÇAMENTO!C5","v":" DRENAGEM E PAVIMENTAÇÃO - VIAS INTERNAS DO PARQUE DE EXPOSIÇÕES E RUA BOM JARDIM (BAIRRO SANTO ANTÔNIO) - SERRO-MG"},null,null,null,"DATA: ",{"$f":"ORÇAMENTO!C6","v":" JANEIRO / 2025"},null,null,"BDI DIFERENCIADO:",null,{"$f":"'BDI FORN'!D31/100","v":0.15}]
[null,"SERVIÇO:  ",{"$f":"VLOOKUP(A1,ORÇAMENTO!A11:L32,3)","v":"CPU.1"},null,"Referência:",{"$f":"VLOOKUP(A1,ORÇAMENTO!$A$11:$L$32,4)","v":"CODEVASF"},"UNIDADE: ",{"$f":"VLOOKUP(A1,ORÇAMENTO!A11:L32,5)","v":"MOBILIZAÇÃO E DESMOBILIZAÇÃO"}]
[]
[null,"TIPO ITEM","CODIGO ITEM","DESCRIÇÃO ITEM","UNIDADE ITEM","COEFICIENTE","PRECO UNITARIO","CUSTO TOTAL",null,"distancia =",90,"B.DESPACHO"]
[null,"EQUIPAMENTOS",{"$nulls":7},"Pá carregadeira ",null,null,10.1," ton"]
[null,null,"E9001",{"$f":"VLOOKUP(C7,#REF!,1,2)","v":{"$error":"#REF!"}},{"$f":"VLOOKUP(C7,#REF!,1,3)","v":{"$error":"#REF!"}},null,{"$f":"VLOOKUP(C7,#REF!,1,3)","v":{"$error":"#REF!"}}]
[]
[]
[null,"MÃO DE OBRA"]
[]
[]
[]
[null,"MATERIAIS"]
[]
[]
[{"$nulls":7},{"$f":"ROUNDDOWN(F17*G17,2)","v":0},null,"Motoniveladora ",null,null,12.47," ton"]
[null,"ATIVIDADES AUXILIARES",{"$nulls":7},"Trator de pneus",null,null,2.8," ton"]
[{"$nulls":7},{"$f":"ROUNDDOWN(F19*G19,2)","v":0}]
[{"$nulls":7},{"$f":"ROUNDDOWN(F20*G20,2)","v":0}]
[{"$nulls":7},{"$f":"ROUNDDOWN(F21*G21,2)","v":0}]
[{"$nulls":7},{"$f":"ROUNDDOWN(F22*G22,2)","v":0},null,"Rolo Compactador ",null,null,15.33," ton"]
[null,"PRODUÇÃO DA EQUIPE",null,null,1,"CUSTO ",null,{"$f":"SUM(H6:H22)","v":0},null,"Grade de disco",null,null,1," ton"]
[null,"TOTAL",{"$nulls":5},{"$f":"H23/E23","v":0},"OK","RETROESCAVADEIRA",null,null,6.67," ton"]
[null,"BDI                %",{"$nulls":5},{"$f":"1+$M$1","v":16}]
[null,"TOTAL DO SERVIÇO - R$",{"$nulls":5},{"$f":"ROUND(H24*H25,2)","v":0}]
[]
["F1","CODEVASF",null,null," COMPOSIÇÃO DE PREÇO UNITÁRIO",null,null,null,{"$f":"H35","v":3275.67},{"$f":"H37","v":3767.02}]
[null,"OBRA:  ",{"$f":"$C$2","v":" DRENAGEM E PAVIMENTAÇÃO - VIAS INTERNAS DO PARQUE DE EXPOSIÇÕES E RUA BOM JARDIM (BAIRRO SANTO ANTÔNIO) - SERRO-MG"},null,null,null,"DATA: ",{"$f":"$H$2","v":" JANEIRO / 2025"}]
[null,"SERVIÇO:  ",{"$f":"VLOOKUP(A28,ORÇAMENTO!$A$11:$L$72,5)","v":"AQUISIÇÃO DE EMULSÃO ASFÁLTICA PARA IMPRIMAÇÃO (EAI) - EXCLUSIVE TRANSPORTE"},null,"Referência:",{"$f":"VLOOKUP(A28,ORÇAMENTO!$A$11:$L$72,4)","v":"ANP"},"UNIDADE: ",{"$f":"VLOOKUP(A28,ORÇAMENTO!$A$11:$L$72,7)","v":"T"}]
[]
[null,"TIPO ITEM","CODIGO ITEM","DESCRIÇÃO ITEM","UNIDADE ITEM","COEFICIENTE","PRECO UNITARIO","CUSTO TOTAL"]
[null,"INSUMO","ANP","EMULSÃO ASFÁLTICA PARA SERVIÇO DE IMPRIMAÇÃO (MEMÓRIA EM ANEXO)","T",1,{"$f":"MAT.ASF!V21","v":3275.6718076204952},{"$f":"ROUNDDOWN(F33*G33,2)","v":3275.67}]
[null,"PRODUÇÃO DA EQUIPE",null,null,1,"CUSTO ",null,{"$f":"SUM(H33:H33)","v":3275.67}]
[null,"TOTAL",{"$nulls":5},{"$f":"H34/E34","v":3275.67}]
[null,"BDI                %",{"$nulls":5},{"$f":"1+$M$2","v":1.1499999999999999}]
[null,"TOTAL DO SERVIÇO - R$",{"$nulls":5},{"$f":"ROUND(H35*H36,2)","v":3767.02},"OK"]
[]
["F2","CODEVASF",null,null," COMPOSIÇÃO DE PREÇO UNITÁRIO",null,null,null,{"$f":"H46","v":192.78},{"$f":"H48","v":221.7}]
[null,"OBRA:  ",{"$f":"$C$2","v":" DRENAGEM E PAVIMENTAÇÃO - VIAS INTERNAS DO PARQUE DE EXPOSIÇÕES E RUA BOM JARDIM (BAIRRO SANTO ANTÔNIO) - SERRO-MG"},null,null,null,"DATA: ",{"$f":"$H$2","v":" JANEIRO / 2025"}]
[null,"SERVIÇO:  ",{"$f":"VLOOKUP(A39,ORÇAMENTO!$A$11:$L$72,5)","v":"TRANSPORTE DE EMULSÃO ASFÁLTICA PARA IMPRIMAÇÃO (EAI)"},null,"Referência:",{"$f":"VLOOKUP(A39,ORÇAMENTO!$A$11:$L$72,4)","v":"CODEVASF"},"UNIDADE: ",{"$f":"VLOOKUP(A39,ORÇAMENTO!$A$11:$L$72,7)","v":"T"}]
[]
[null,"TIPO ITEM","CODIGO ITEM","DESCRIÇÃO ITEM","UNIDADE ITEM","COEFICIENTE","PRECO UNITARIO","CUSTO TOTAL"]
[null,"INSUMO"," - ","TRANSPORTE DE EMULSÃO ASFÁLTICA PARA IMPRIMAÇÃO (EAI), INCLUINDO CUSTO TOTAL DO TRANSPORTE (COMBUSTÍVEL, PEDÁGIOS, ETC.) E ICMS - MEMÓRIA ANEXA","T",1,{"$f":"MAT.ASF!U21","v":192.78},{"$f":"ROUNDDOWN(F44*G44,2)","v":192.78}]
[null,"PRODUÇÃO DA EQUIPE",null,null,1,"CUSTO ",null,{"$f":"SUM(H44:H44)","v":192.78}]
[null,"TOTAL",{"$nulls":5},{"$f":"H45/E45","v":192.78}]
[null,"BDI                %",{"$nulls":5},{"$f":"1+$M$2","v":1.1499999999999999}]
[null,"TOTAL DO SERVIÇO - R$",{"$nulls":5},{"$f":"ROUND(H46*H47,2)","v":221.7},"OK"]
[]
["F3","CODEVASF",null,null," COMPOSIÇÃO DE PREÇO UNITÁRIO",null,null,null,{"$f":"H57","v":3478},{"$f":"H59","v":3999.7}]
[null,"OBRA:  ",{"$f":"$C$2","v":" DRENAGEM E PAVIMENTAÇÃO - VIAS INTERNAS DO PARQUE DE EXPOSIÇÕES E RUA BOM JARDIM (BAIRRO SANTO ANTÔNIO) - SERRO-MG"},null,null,null,"DATA: ",{"$f":"$H$2","v":" JANEIRO / 2025"}]
[null,"SERVIÇO:  ",{"$f":"VLOOKUP(A50,ORÇAMENTO!$A$11:$L$72,5)","v":"AQUISIÇÃO DE EMULSAO ASFALTICA CATIONICA RR-1C - EXCLUSIVE TRANSPORTE"},null,"Referência:",{"$f":"VLOOKUP(A50,ORÇAMENTO!$A$11:$L$72,4)","v":"ANP"},"UNIDADE: ",{"$f":"VLOOKUP(A50,ORÇAMENTO!$A$11:$L$72,7)","v":"T"}]
[]
[null,"TIPO ITEM","CODIGO ITEM","DESCRIÇÃO ITEM","UNIDADE ITEM","COEFICIENTE","PRECO UNITARIO","CUSTO TOTAL"]
[null,"INSUMO","ANP","EMULSÃO ASFÁLTICA CATIÔNICA RR-1C(MEMÓRIA EM ANEXO)","T",1,{"$f":"MAT.ASF!V28","v":3478.0063919228432},{"$f":"ROUNDDOWN(F55*G55,2)","v":3478}]
[null,"PRODUÇÃO DA EQUIPE",null,null,1,"CUSTO ",null,{"$f":"SUM(H55:H55)","v":3478}]
[null,"TOTAL",{"$nulls":5},{"$f":"H56/E56","v":3478},"OK"]
[null,"BDI                %",{"$nulls":5},{"$f":"1+$M$2","v":1.1499999999999999}]
[null,"TOTAL DO SERVIÇO - R$",{"$nulls":5},{"$f":"ROUND(H57*H58,2)","v":3999.7}]
[]
["F4","CODEVASF",null,null," COMPOSIÇÃO DE PREÇO UNITÁRIO",null,null,null,{"$f":"H68","v":241.41},{"$f":"H70","v":277.62}]
[null,"OBRA:  ",{"$f":"$C$2","v":" DRENAGEM E PAVIMENTAÇÃO - VIAS INTERNAS DO PARQUE DE EXPOSIÇÕES E RUA BOM JARDIM (BAIRRO SANTO ANTÔNIO) - SERRO-MG"},null,null,null,"DATA: ",{"$f":"$H$2","v":" JANEIRO / 2025"}]
[null,"SERVIÇO:  ",{"$f":"VLOOKUP(A61,ORÇAMENTO!$A$11:$L$72,5)","v":"TRANSPORTE DE EMULSÃO ASFÁLTICA CATIONICA RR-1C"},null,"Referência:",{"$f":"VLOOKUP(A61,ORÇAMENTO!$A$11:$L$72,4)","v":"CODEVASF"},"UNIDADE: ",{"$f":"VLOOKUP(A61,ORÇAMENTO!$A$11:$L$72,7)","v":"T"}]
[]
[null,"TIPO ITEM","CODIGO ITEM","DESCRIÇÃO ITEM","UNIDADE ITEM","COEFICIENTE","PRECO UNITARIO","CUSTO TOTAL"]
[null,"INSUMO"," - ","TRANSPORTE DE EMULSÃO ASFÁLTICA CATIONICA TIPO RR-1C, INCLUINDO CUSTO TOTAL DO TRANSPORTE (COMBUSTÍVEL, PEDÁGIOS, ETC.) E ICMS - MEMÓRIA ANEXA","T",1,{"$f":"MAT.ASF!U28","v":241.40999999999997},{"$f":"ROUNDDOWN(F66*G66,2)","v":241.41}]
[null,"PRODUÇÃO DA EQUIPE",null,null,1,"CUSTO ",null,{"$f":"SUM(H66:H66)","v":241.41}]
[null,"TOTAL",{"$nulls":5},{"$f":"H67/E67","v":241.41},"OK"]
[null,"BDI                %",{"$nulls":5},{"$f":"1+$M$2","v":1.1499999999999999}]
[null,"TOTAL DO SERVIÇO - R$",{"$nulls":5},{"$f":"ROUND(H68*H69,2)","v":277.62}]
[]
["F5","CODEVASF",null,null," COMPOSIÇÃO DE PREÇO UNITÁRIO",null,null,null,{"$f":"H79","v":4719.13},{"$f":"H81","v":5427}]
[null,"OBRA:  ",{"$f":"$C$2","v":" DRENAGEM E PAVIMENTAÇÃO - VIAS INTERNAS DO PARQUE DE EXPOSIÇÕES E RUA BOM JARDIM (BAIRRO SANTO ANTÔNIO) - SERRO-MG"},null,null,null,"DATA: ",{"$f":"$H$2","v":" JANEIRO / 2025"}]
[null,"SERVIÇO:  ",{"$f":"VLOOKUP(A72,ORÇAMENTO!$A$11:$L$72,5)","v":"AQUISIÇÃO DE CONCRETO ASFÁLTICO DE PETRÓLEO - CAP 50/70 - EXCLUSIVE TRANSPORTE"},null,"Referência:",{"$f":"VLOOKUP(A72,ORÇAMENTO!$A$11:$L$72,4)","v":"ANP"},"UNIDADE: ",{"$f":"VLOOKUP(A72,ORÇAMENTO!$A$11:$L$72,7)","v":"T"}]
[]
[null,"TIPO ITEM","CODIGO ITEM","DESCRIÇÃO ITEM","UNIDADE ITEM","COEFICIENTE","PRECO UNITARIO","CUSTO TOTAL"]
[null,"INSUMO",1518,"CIMENTOS ASFÁLTICO DE PETRÓLEO TIPO CAP 50/70 (MEMÓRIA EM ANEXO)","T",1,{"$f":"MAT.ASF!V14","v":4719.1340094660791},{"$f":"ROUNDDOWN(F77*G77,2)","v":4719.13}]
[null,"PRODUÇÃO DA EQUIPE",null,null,1,"CUSTO ",null,{"$f":"SUM(H77:H77)","v":4719.13}]
[null,"TOTAL",{"$nulls":5},{"$f":"H78/E78","v":4719.13}]
[null,"BDI                %",{"$nulls":5},{"$f":"1+$M$2","v":1.1499999999999999}]
[null,"TOTAL DO SERVIÇO - R$",{"$nulls":5},{"$f":"ROUND(H79*H80,2)","v":5427}]
[]
["F6","CODEVASF",null,null," COMPOSIÇÃO DE PREÇO UNITÁRIO",null,null,null,{"$f":"H90","v":357.93},{"$f":"H92","v":411.62}]
[null,"OBRA:  ",{"$f":"$C$2","v":" DRENAGEM E PAVIMENTAÇÃO - VIAS INTERNAS DO PARQUE DE EXPOSIÇÕES E RUA BOM JARDIM (BAIRRO SANTO ANTÔNIO) - SERRO-MG"},null,null,null,"DATA: ",{"$f":"$H$2","v":" JANEIRO / 2025"}]
[null,"SERVIÇO:  ",{"$f":"VLOOKUP(A83,ORÇAMENTO!$A$11:$L$72,5)","v":"TRANSPORTE DE CONCRETO ASFÁLTICO DE PETRÓLEO - CAP 50/70"},null,"Referência:",{"$f":"VLOOKUP(A83,ORÇAMENTO!$A$11:$L$72,4)","v":"CODEVASF"},"UNIDADE: ",{"$f":"VLOOKUP(A83,ORÇAMENTO!$A$11:$L$72,7)","v":"T"}]
[]
[null,"TIPO ITEM","CODIGO ITEM","DESCRIÇÃO ITEM","UNIDADE ITEM","COEFICIENTE","PRECO UNITARIO","CUSTO TOTAL"]
[null,"INSUMO"," - ","TRANSPORTE DE CIMENTO ASFÁLTICO DE PETRÓLEO TIPO CAP 50-70, INCLUINDO CUSTO TOTAL DO TRANSPORTE (COMBUSTÍVEL, PEDÁGIOS, ETC.) E ICMS - MEMÓRIA ANEXA","T",1,{"$f":"MAT.ASF!U14","v":357.93},{"$f":"ROUNDDOWN(F88*G88,2)","v":357.93}]
[null,"PRODUÇÃO DA EQUIPE",null,null,1,"CUSTO ",null,{"$f":"SUM(H88:H88)","v":357.93}]
[null,"TOTAL",{"$nulls":5},{"$f":"H89/E89","v":357.93}]
[null,"BDI                %",{"$nulls":5},{"$f":"1+$M$2","v":1.1499999999999999}]
[null,"TOTAL DO SERVIÇO - R$",{"$nulls":5},{"$f":"ROUND(H90*H91,2)","v":411.62}]

{"sheet":"BDI SERV","index":3,"n_rows":60,"n_cols":5,"rows_kept":60,"cut":false,"hidden":false,"merged":[[0,1,2,4],[25,1,25,3],[26,1,26,2],[26,3,26,4],[27,3,27,4],[28,7,28,15],[35,0,35,5],[36,0,36,5],[38,1,38,4],[39,2,39,3]]}
[null,"DETALHAMENTO DO BDI - SERVIÇOS"]
[]
[]
[null,"Item","Descrição dos Serviços","% - PV","% - CD"]
[]
[null,1,"ADMINISTRAÇÃO CENTRAL"," ",{"$f":"SUM(E7:E9)","v":4.01}]
[null,"1.1","ESCRITÓRIO CENTRAL",null,4.01]
[null,"1.2","VIAGENS"]
[null,"1.3","OUTROS"]
[null," "," "," "," "]
[null,2,"IMPOSTOS E TAXAS",{"$f":"SUM(D12:D15)","v":7.65},{"$f":"SUM(E12:E15)","v":0}]
[null,"2.1","ISS - Proposta",{"$f":"D34*100","v":4}]
[null,"2.2","PIS",0.65]
[null,"2.3","Cofins",3]
[null,"2.4","Contribuição Previdenciaria (CPRB)"]
[]
[null,3,"TAXA DE RISCO",null,{"$f":"SUM(E18:E20)","v":0.96}]
[null,"3.1","SEGURO",null,0.2]
[null,"3.2","RISCO",null,0.56000000000000005]
[null,"3.3","GARANTIA",null,0.2]
[]
[null,4,"DESPESAS FINANCEIRAS",null,1.1100000000000001]
[]
[null,5,"LUCRO",null,7.3]
[]
[null,"BDI APRESENTADO:",null,null,{"$f":"IF($D$41=$C$43,$D$43,IF($D$41=$C$44,$D$44,IF($D$41=$C$44,$D$44,IF($D$41=$C$45,$D$45,0))))","v":23.32}]
[]
[null,null,"Legislação Municipal:","Lei Complementar nº 63/2005"]
[null,null,"Município:","Serro - MG"]
[null,null,"Alíquota ISSQN:",0.04,"Município"]
[null,null,"Base de Cálculo:",1,"Art. 30"]
[null,null,"Valor Serviço:",3510478.96]
[null,null,"Dedução - Material (estimado):",0,{"$f":"D33/D32","v":0}]
[null,null,"ISSQN BDI:",{"$f":"IF(D32=\"\",0,ROUND(IF(D31=D49,((1-(D33/D32))*D30),D30*D31),4))","v":0.04},"(*)"]
[]
["Acórdão nº 2.622/2013 - TCU Plenário"]
["BDI = ARRED((((((1+(AC+TR)/100)*(1+DF/100)*(1+L/100))/(1-IMP/100))-1)*100);2)"]
[]
[null,"(*) É obrigação da licitante a verificação da Legislação Tributária vigente no município, bem como o cálculo dos valores totais de serviços e materiais estimados, para apresentação de sua proposta."]
[]
[null,null,"Forma de Cálculo do BDI:","BDI - Acórdão nº 2.622/2013 - TCU"]
[]
[null,null,"BDI - Digitado",{"$f":"ROUND(E6+E11+E17+E22+E24,2)","v":13.38}]
[null,null,"BDI - Calculado",{"$f":"ROUND((((1+(E6/100+E22/100+E17/100))/(1-(D11/100+E24/100)))-1)*100,2)","v":24.73}]
[null,null,"BDI - Acórdão nº 2.622/2013 - TCU",{"$f":"ROUND((((((1+(E6+E17)/100)*(1+E22/100)*(1+E24/100))/(1-D11/100))-1)*100),2)","v":23.32}]
[]
[]
[]
[null,null,null,"Dedução - Material","Município"]
[null,null,null,0.1,"Simples Nacional"]
[null,null,null,0.2,"Municípios Indefinidos"]
[null,null,null,0.3]
[null,null,null,0.4]
[null,null,null,0.5]
[null,null,null,0.6]
[null,null,null,0.7]
[null,null,null,0.8]
[null,null,null,0.9]
[null,null,null,1]
[null,null,null,{"$f":"E31","v":"Art. 30"}]

{"sheet":"BDI FORN","index":4,"n_rows":37,"n_cols":5,"rows_kept":37,"cut":false,"hidden":false,"merged":[[31,1,31,2],[32,0,34,5],[36,0,36,5],[0,1,2,4],[3,1,4,1],[3,2,4,2],[28,0,28,5],[30,1,30,2]]}
[null,"DETALHAMENTO DO BDI - FORNECIMENTO \n(MATERIAL ASFÁLTICO)"]
[]
[]
[null,"Item","Descrição dos Serviços","%","%"]
[null,null,null,"PV","CD"]
[]
[null,1,"ADMINISTRAÇÃO CENTRAL"," ",3.45]
[null,"1.1","ESCRITÓRIO CENTRAL"," "," "]
[null,"1.2","VIAGENS"," "," "]
[null,"1.3","OUTROS"," "," "]
[null," "," "," "," "]
[null,2,"IMPOSTOS E TAXAS",{"$f":"SUM(D13:D16)","v":3.65},{"$f":"SUM(E13:E16)","v":4.5600000000000005}]
[null,"2.1","ISS (*)",null,{"$f":"ROUND(D13*1.2515,2)","v":0}]
[null,"2.2","PIS",0.65,{"$f":"ROUND(D14*1.2515,2)","v":0.81}]
[null,"2.3","Cofins",3,{"$f":"ROUND(D15*1.2515,2)","v":3.75}]
[null,"2.4","CONTRIBUIÇÃO PREVIDENCIÁRIA SOBRE A RENDA BRUTA",0,{"$f":"ROUND(D16*1.2515,2)","v":0}]
[]
[null,3,"TAXA DE RISCO"," ",{"$f":"SUM(E19:E22)","v":1.08}]
[null,"3.1","SEGURO",null,0.24]
[null,"3.2","RISCO",null,0.6]
[null,"3.3","GARANTIA",null,0.24]
[]
[null,4,"DESPESAS FINANCEIRAS"," ",0.85]
[]
[null,5,"LUCRO",null,5.1100000000000003]
[]
[null," ","BDI - CALCULADO"," ",{"$f":"ROUND((((1+(E7+E18)/100)*(1+E23/100)*(1+E25/100)/(1-D12/100)-1)*100),2)","v":15}]
[]
["BDI = ((1+((AC+S+R+G)/100))x(1+DF/100)x(1+L/100)/(1-I/100)-1)*100"]
[]
[null,"BDI (CALCULADO):",null,{"$f":"ROUND((((1+((E7+E18)/100))*(1+E23/100)*(1+E25/100))/(1-D12/100)-1)*100,2)","v":15},"%"]
[null," "]
[]
[]
[]
[]
["BDI EM CONFORMIDADE COM OS ACÓRDÃOS Nº 2369/2011 e ACÓRDÃO Nº 2.622/2013 - TCU - PLENÁRIO"]

{"sheet":"CRONOGRAMA","index":5,"n_rows":19,"n_cols":15,"rows_kept":19,"cut":false,"hidden":false,"merged":[[15,1,16,2],[18,1,22,14],[11,0,12,0],[11,1,12,1],[11,2,12,2],[13,0,14,0],[13,1,14,1],[13,2,14,2],[9,0,10,0],[9,1,10,1],[9,2,10,2],[3,1,3,13],[5,0,6,0],[5,1,6,1],[5,2,6,2],[7,0,8,0],[7,1,8,1],[7,2,8,2],[0,1,0,14],[1,1,2,1],[1,2,2,4],[1,6,1,14],[2,6,2,14]]}
[null,"CRONOGRAMA FÍSICO-FINANCEIRO"]
[null,"OBRA: ",{"$f":"ORÇAMENTO!C5","v":" DRENAGEM E PAVIMENTAÇÃO - VIAS INTERNAS DO PARQUE DE EXPOSIÇÕES E RUA BOM JARDIM (BAIRRO SANTO ANTÔNIO) - SERRO-MG"},null,null,"VALOR:",{"$f":"ORÇAMENTO!L69","v":4598888.0299999993}]
[{"$nulls":5},"PRAZO: ","270 DIAS "]
[]
[null,"ITEM","ETAPAS/DESCRIÇAO","FISICO/  FINANCEIRO","TOTAL    ETAPAS","MÊS 1","MÊS 2","MÊS 3","MÊS 4","MÊS 5","MÊS 6","MÊS 7","MÊS 8","MÊS 9","TOTAL"]
["A",{"$f":"VLOOKUP(A6,ORÇAMENTO!$A$10:$L$69,2)","v":1},{"$f":"VLOOKUP(A6,ORÇAMENTO!$A$10:$L$69,5)","v":"SERVIÇOS PRELIMINARES "},"FISICO ",{"$f":"ROUND(E7/$G$2,4)","v":6.9599999999999995E-2},0.2,0.1,0.1,0.1,0.1,0.1,0.1,0.1,0.1,{"$f":"SUM(F6:N6)","v":0.99999999999999989}]
[null,null,null,"FINANCEIRO",{"$f":"ORÇAMENTO!L10","v":320197.95},{"$f":"ROUND($E$7*F6,2)","v":64039.59},32019.8,32019.8,32019.8,32019.8,{"$f":"ROUND($E$7*K6,2)","v":32019.8},32019.8,32019.8,32019.8,{"$f":"SUM(F7:N7)","v":320197.98999999993}]
["B",{"$f":"VLOOKUP(A8,ORÇAMENTO!$A$10:$L$69,2)","v":2},{"$f":"VLOOKUP(A8,ORÇAMENTO!$A$10:$L$69,5)","v":"TERRAPLANAGEM E PAVIMENTAÇÃO"},"FISICO ",{"$f":"ROUND(E9/$G$2,4)","v":0.42809999999999998},0.05,0.1,0.15,0.2,0.2,0.15,0.1,0.05,null,{"$f":"SUM(F8:N8)","v":1}]
[null,null,null,"FINANCEIRO",{"$f":"ORÇAMENTO!L16","v":1968813.3499999999},{"$f":"ROUND($E$9*F8,2)","v":98440.67},196881.34,295322,393762.67,393762.67,{"$f":"ROUND($E$9*K8,2)","v":295322},196881.34,98440.67,0,{"$f":"SUM(F9:N9)","v":1968813.3599999999}]
["C",{"$f":"VLOOKUP(A10,ORÇAMENTO!$A$10:$L$69,2)","v":3},{"$f":"VLOOKUP(A10,ORÇAMENTO!$A$10:$L$69,5)","v":"TRANSPORTE DE MATERIAIS"},"FISICO ",{"$f":"ROUND(E11/$G$2,4)","v":3.44E-2},0.05,0.1,0.15,0.2,0.2,0.15,0.1,0.05,null,{"$f":"SUM(F10:N10)","v":1}]
[null,null,null,"FINANCEIRO",{"$f":"ORÇAMENTO!L25","v":158227.99},{"$f":"ROUND($E$11*F10,2)","v":7911.4},15822.8,23734.2,31645.599999999999,31645.599999999999,{"$f":"ROUND($E$11*K10,2)","v":23734.2},15822.8,7911.4,0,{"$f":"SUM(F11:N11)-0.04","v":158227.96}]
["E",{"$f":"VLOOKUP(A12,ORÇAMENTO!$A$10:$L$69,2)","v":4},{"$f":"VLOOKUP(A12,ORÇAMENTO!$A$10:$L$69,5)","v":"DRENAGEM E OBRAS COMPLEMENTARES"},"FISICO ",{"$f":"ROUND(E13/$G$2,4)","v":0.40899999999999997},0.1,0.2,0.2,0.1,0.1,0.1,0.1,0.05,0.05,{"$f":"SUM(F12:N12)","v":1}]
[null,null,null,"FINANCEIRO",{"$f":"ORÇAMENTO!L31","v":1880746.9},{"$f":"ROUND($E$13*F12,2)","v":188074.69},376149.38,376149.38,188074.69,188074.69,{"$f":"ROUND($E$13*K12,2)","v":188074.69},188074.69,94037.35,94037.35,{"$f":"SUM(F13:N13)-0.02","v":1880746.8900000001}]
["F",{"$f":"VLOOKUP(A14,ORÇAMENTO!$A$10:$L$69,2)","v":5},{"$f":"VLOOKUP(A14,ORÇAMENTO!$A$10:$L$69,5)","v":"FORNECIMENTOS - MATERIAL ASFÁLTICO (BDI DIFERENCIADO)"},"FISICO ",{"$f":"ROUND(E15/$G$2,4)","v":5.8900000000000001E-2},null,0.2,0.2,0.2,0.2,0.2,null,null,null,{"$f":"SUM(F14:N14)","v":1}]
[null,null,null,"FINANCEIRO",{"$f":"ORÇAMENTO!L62","v":270901.84000000003},{"$f":"ROUND($E$15*F14,2)","v":0},54180.37,54180.37,54180.37,54180.37,{"$f":"ROUND($E$15*K14,2)","v":54180.37},0,0,0,{"$f":"SUM(F15:N15)-0.02","v":270901.83}]
[null,"TOTAL",null,"FISICO ",{"$f":"SUM(F16:N16)","v":1.0000000173955095},{"$f":"F17/$E$17","v":7.7946309556051543E-2},0.14678628520555653,0.16991188846143751,0.15214180589650059,0.15214180589650059,0.12901620046618098,9.4109408008352852E-2,5.0535959667624274E-2,2.7410354237304625E-2,{"$f":"SUM(F16:N16)","v":1.0000000173955095}]
[null,null,null,"FINANCEIRO",{"$f":"E11+E9+E7+E15+E13","v":4598888.0299999993},358466.35,675053.69,781405.75,699683.12999999989,699683.12999999989,{"$f":"K11+K9+K7+K15+K13","v":593331.06000000006},432798.63,232409.22,126057.15000000001,{"$f":"SUM(F17:N17)-0.08","v":4598888.03}]
[]
[null,"OBSERVAÇÕES:"]

{"sheet":"EAI","index":6,"n_rows":90,"n_cols":34,"rows_kept":90,"cut":false,"hidden":false,"merged":[[12,3,24,3],[1,2,3,26],[5,2,7,2],[5,12,7,12],[6,6,7,6],[6,19,6,20],[10,4,10,8],[10,9,10,10],[10,22,10,23],[5,6,5,7],[5,8,5,9],[6,21,6,24],[7,21,7,24]]}
[]
[null,null,"MEMÓRIA DE CÁLCULO"]
[]
[]
[]
[{"$nulls":6},"TIPOLOGIA DO MATERIAL",null,"Emulsão Asfáltica para Serviço de Imprimação",null,null,null,"IMPOSTOS","COFINS",6.4999999999999997E-3,6.4999999999999997E-3]
[{"$nulls":6},"ÍNDICE DE PAVIMENTAÇÃO DNIT","2014-07-01","ÍNDICE INICIAL",270.23700000000002,null,null,null,"PIS",0.03,0.03,null,null,null,"LEGENDA",{"$nulls":8},"As empresas tributadas pelo Lucro Presumido pagam 0,65% de PIS e 3% de COFINS"]
[{"$nulls":7},{"$f":"H9","v":"2024-12-01"},"ÍNDICE FINAL",583.33399999999995,null,null,null," ICMS",0.18,0.18,{"$f":"1-(O8/1)","v":0.82000000000000006},{"$f":"1-(P8/1)","v":0.82000000000000006},{"$f":"1-(Q8/1)","v":0.17999999999999994},"ENTRADA DE DADOS",null,"QUANT.ESTIMADA DE EMULSÃO ASFÁLTICA PARA IMPRIMAÇÃO (TON.):",null,null,null,{"$f":"ORÇAMENTO!H63","v":10.004},"TONELADAS",null,"As empresas tributadas pelo Lucro Real pagam 1,65% de PIS e 7,60% de COFINS"]
[{"$nulls":6},"Data ANP","2024-12-01"]
[]
[null,null,"DATA-BASE","PRODUTOS","LOCALIDADES",{"$nulls":4},"CUSTO ANP (R$/Kg)",null,"CUSTO ANP","IMPOSTOS DO PRODUTO","CUSTO DO PRODUTO COM IMPOSTOS","DMT's","DMT's FLUVIAL","CUSTO DO TRANSPORTE RODOVIA PAVIMENTADA","CUSTO DO TRANSPORTE FLUVIAL","CUSTO DO TRANSPORTE TOTAL","ICMS","ATUALIZAÇÃO DO CUSTO DE TRANSPORTE","CUSTO DO TRANSPORTE RODOVIA PAVIMENTADA COM IMPOSTOS E ATUALIZAÇÃO MONETÁRIA","PEDÁGIO ",null,"TOTAL TRANSPORTE","AQUISIÇÃO DO PRODUTO","TOTAL GERAL ( TRANSP + AQUISIÇÃO)",null,1,2,3]
[null,null,{"$f":"H8","v":"2024-12-01"},null,"REFINARIAS","ENDEREÇO","ESTADO","CIDADE","DESTINO","ESTADO","REGIÃO","R$/t","R$/t","R$/t","KM","KM","R$/t","R$/t","R$/t","R$/t","R$/t","R$/t","CUSTO ","R$/t","R$/t","R$/t","R$/t",null,"TOTAL GERAL ( TRANSP + AQUISIÇÃO)","TOTAL TRANSPORTE","AQUISIÇÃO DO PRODUTO"]
[null,{"$f":"AA13","v":4784.8004836774462},1,{"$f":"I6","v":"Emulsão Asfáltica para Serviço de Imprimação"},"Refinaria Abreu e Lima","Rodovia PE 60, Km 10 - Ipojuca - PE CEP:55590-000","Pernambuco","IPOJUCA - PE","Serro - MG","-",2.6664351178237875,{"$f":"IF(AND(J13=\"-\",K13=\"-\"),\"\",IF(AND(J13<>0,K13=\"-\"),J13*1000,IF(AND(J13=\"-\",K13<>0),K13*1000,IF(AND(J13<>0,K13<>0),J13*1000,\"\"))))","v":2666.4351178237876},{"$f":"ROUND(((L13/(1-$O$6-$O$7-$O$8))-L13),2)","v":736.8},{"$f":"L13+M13","v":3403.2351178237877},1913,null,{"$f":"ROUND((26.939+0.253*O13),2)","v":510.93},null,{"$f":"Q13+R13","v":510.93},{"$f":"TRUNC(S13*($O$8/(1-$O$8)),2)","v":112.15},{"$f":"TRUNC(IF($J$7=\"\",\"\",(($J$8-$J$7)/$J$7)*(S13+T13)),2)","v":721.9},{"$f":"S13+T13+U13","v":1344.98},183,{"$f":"EVEN($Z$8*2/28)*W13/$Z$8","v":36.585365853658537},{"$f":"IF(AND(S13=\"\",T13=\"\"),\"\",V13+X13)","v":1381.5653658536585},{"$f":"IF(OR(L13=\"\",M13=\"\"),\"\",L13+M13)","v":3403.2351178237877},{"$f":"IF(OR(Y13=\"\",Z13=\"\"),\"\",Y13+Z13)","v":4784.8004836774462},null,{"$f":"AA13","v":4784.8004836774462},{"$f":"Y13","v":1381.5653658536585},{"$f":"Z13","v":3403.2351178237877},null,null,{"$f":"IF(OR(G13=$D$50,G13=$D$51,G13=$D$53,G13=$D$59,G13=$D$43,G13=$D$39,G13=$D$35,G13=$D$48,G13=$D$38),\"NORDESTE\",IF(OR(G13=$D$34,G13=$D$36,G13=$D$37,G13=$D$47,G13=$D$55,G13=$D$56,G13=$D$60),\"NORTE\",IF(OR(G13=$D$40,G13=$D$42,G13=$D$44,G13=$D$45),\"CENTRO-OESTE\",IF(OR(G13=$D$58,G13=$D$52,G13=$D$46,G13=$D$41),\"SUDESTE\",IF(OR(G13=$D$57,G13=$D$49,G13=$D$54),\"SUL\",\"\")))))","v":"NORDESTE"}]
[null,{"$f":"AA14","v":4969.2704836774465},2,null,"Refinaria Potiguar Clara Camarão","Rodovia RN 221, KM 25 - Guamaré - RN CEP:59598-000","Rio Grande do Norte","GUAMARÉ - RN",{"$f":"I13","v":"Serro - MG"},"-",2.6664351178237875,{"$f":"IF(AND(J14=\"-\",K14=\"\"),\"\",IF(AND(J14<>0,K14=\"\"),J14*1000,IF(AND(J14=\"-\",K14<>0),K14*1000,IF(AND(J14<>0,K14<>0),J14*1000,\"\"))))","v":2666.4351178237876},{"$f":"ROUND(((L14/(1-$O$6-$O$7-$O$8))-L14),2)","v":736.8},{"$f":"L14+M14","v":3403.2351178237877},2190,null,{"$f":"ROUND((26.939+0.253*O14),2)","v":581.01},null,{"$f":"Q14+R14","v":581.01},{"$f":"TRUNC(S14*($O$8/(1-$O$8)),2)","v":127.53},{"$f":"TRUNC(IF($J$7=\"\",\"\",(($J$8-$J$7)/$J$7)*(S14+T14)),2)","v":820.91},{"$f":"S14+T14+U14","v":1529.4499999999998},183,{"$f":"EVEN($Z$8*2/28)*W14/$Z$8","v":36.585365853658537},{"$f":"IF(AND(S14=\"\",T14=\"\"),\"\",V14+X14)","v":1566.0353658536583},3403.2351178237877,{"$f":"IF(OR(Y14=\"\",Z14=\"\"),\"\",Y14+Z14)","v":4969.2704836774465},null,{"$f":"AA14","v":4969.2704836774465},{"$f":"Y14","v":1566.0353658536583},3403.2351178237877,null,null,"NORDESTE"]
[null,4332.1088043491773,3,null,"Refinaria Landulpho Alves (RLAM)","Rodovia BA 523, KM 4 – Mataripe São Francisco do Conde - BA CEP:43900-000","Bahia","SÃO FRANCISCO DO CONDE - BA",{"$f":"I14","v":"Serro - MG"},"-",2.6664351178237875,2666.4351178237876,{"$f":"ROUND(((L15/(1-$O$6-$O$7-$O$8))-L15),2)","v":736.8},3403.2351178237877,1227,null,{"$f":"ROUND((26.939+0.253*O15),2)","v":337.37},null,337.37,74.05,476.67,888.09,204,40.783686525389847,928.87368652538987,3403.2351178237877,4332.1088043491773,null,4332.1088043491773,928.87368652538987,3403.2351178237877,null,null,"NORDESTE"]
[2403,4919.9807256887671,4,null,"Refinaria Lubrificantes e Derivados do Nordeste (Lubnor)","Av. Leite Barbosa, s/nº - Mucuripe Fortaleza - Ceará CEP:60180-420","Ceará","FORTALEZA - CE","Serro - MG",2.6043453598351083,2.6664351178237875,{"$f":"IF(AND(J16=\"-\",K16=\"\"),\"\",IF(AND(J16<>0,K16=\"\"),J16*1000,IF(AND(J16=\"-\",K16<>0),K16*1000,IF(AND(J16<>0,K16<>0),J16*1000,\"\"))))","v":2604.3453598351084},{"$f":"ROUND(((L16/(1-$O$6-$O$7-$O$8))-L16),2)","v":719.64},3323.9853598351083,2235,null,592.39,null,592.39,130.03,836.99,1559.4099999999999,183,36.585365853658537,1595.9953658536583,3323.9853598351083,4919.9807256887671,null,4919.9807256887671,1595.9953658536583,3323.9853598351083,null,null,"NORDESTE"]
[null,4118.5659897349942,5,null,"Refinaria Capuava (Recap)","Av. Alberto Soares Sampaio, 2122-A Capuava – Mauá - SP","São Paulo","MAUÁ - SP","Serro - MG",2.7498271212823746,2.5664918076204954,2749.8271212823747,{"$f":"ROUND(((L17/(1-$O$6-$O$7-$O$8))-L17),2)","v":759.84},3509.6671212823749,766,null,220.74,null,220.74,48.45,311.88,581.06999999999994,139.19999999999999,27.828868452618952,608.8988684526189,3509.6671212823749,4118.5659897349942,null,4118.5659897349942,608.8988684526189,3509.6671212823749,null,null,"SUDESTE"]
[null,3812.3718675965047,6,null,"Refinaria Duque de Caxias (Reduc)","Rodovia Washington Luiz, km 113,7 Campos Elíseos – Duque de Caxias - RJ CEP:25213-005","Rio de Janeiro","DUQUE DE CAXIAS - RJ","Serro - MG","-",2.5664918076204954,2566.4918076204954,709.18,3275.6718076204952,587,null,175.45,null,175.45,38.51,247.89,461.84999999999997,374.4,74.850059976009589,536.70005997600958,3275.6718076204952,3812.3718675965047,null,3812.3718675965047,536.70005997600958,3275.6718076204952,null,null,"SUDESTE"]
[null,5155.5385404619628,7,null,"Refinaria Alberto Pasqualini (Refap)","Avenida Getúlio Vargas, 11001 - Bairro Brigadeira Canoas - RS - Brasil CEP:92420-221","Rio Grande do Sul","CANOAS - RS","Serro - MG",2.8817002237886329,2.9098050592270743,2881.7002237886327,796.28,3677.9802237886324,1843,null,493.22,null,493.22,108.26,696.87,1298.3499999999999,896.4,179.20831667333067,1477.5583166733306,3677.9802237886324,5155.5385404619628,null,5155.5385404619628,1477.5583166733306,3677.9802237886324,null,null,"SUL"]
[null,4784.6871934705196,8,null,"Unidade de Industrialização do Xisto (SIX)","Rodovia do Xisto, BR 476, km 153 São Mateus do Sul – PR CEP 83900-000","Paraná","SÃO MATEUS DO SUL - PR","Serro - MG",2.9341262978287759,2.9098050592270743,2934.1262978287759,810.77,3744.8962978287759,1308,null,357.86,null,357.86,78.55,505.62,942.03,489,97.760895641743303,1039.7908956417432,3744.8962978287759,4784.6871934705196,null,4784.6871934705196,1039.7908956417432,3744.8962978287759,null,null,"SUL"]
[null,3468.4518076204954,9,null,"Refinaria Gabriel Passos (Regap)","Av. Refinaria Gabriel Passos, 690 Distrito Industrial Paulo Camilo Sul Betim - MG CEP:32669-205","Minas Gerais","BETIM - MG","Serro - MG","-",2.5664918076204954,2566.4918076204954,709.18,3275.6718076204952,183,null,73.239999999999995,null,73.239999999999995,16.07,103.47,192.78,0,0,192.78,3275.6718076204952,{"$f":"IF(OR(Y21=\"\",Z21=\"\"),\"\",Y21+Z21)","v":3468.4518076204954},null,3468.4518076204954,192.78,3275.6718076204952,null,null,"SUDESTE"]
[null,4690.312711263402,10,null,"Refinaria Presidente Getúlio Vargas (Repar)","Rodovia do Xisto, BR 476, km 16 Araucária - PR CEP:83707-440","Paraná","ARAUCÁRIA - PR","Serro - MG",2.9341262978287759,2.9098050592270743,2934.1262978287759,810.77,3744.8962978287759,1187,null,327.25,null,327.25,71.83,462.37,861.45,420,83.966413434626148,945.41641343462618,3744.8962978287759,4690.312711263402,null,4690.312711263402,945.41641343462618,3744.8962978287759,null,null,"SUL"]
[null,4143.1959897349934,11,null,"Refinaria Presidente Bernardes (RPBC)","Av. 9 de abril, 777 - Jardim das Indústrias Cubatão - SP CEP:11505-000","São Paulo","CUBATÃO - SP","Serro - MG",2.7498271212823746,2.5664918076204954,2749.8271212823747,759.84,3509.6671212823749,803,null,230.1,null,230.1,50.5,325.10000000000002,605.70000000000005,139.19999999999999,27.828868452618952,633.52886845261901,3509.6671212823749,4143.1959897349934,null,4143.1959897349934,633.52886845261901,3509.6671212823749,null,null,"SUDESTE"]
[null,4142.6558178037667,12,null,"Refinaria de Paulínia (Replan)","Rodovia SP 332 - Km. 130 Bonfim - Paulínia – SP CEP:13140-000","São Paulo","PAULÍNIA - SP","Serro - MG",2.7498271212823746,2.5664918076204954,2749.8271212823747,759.84,3509.6671212823749,764,null,220.23,null,220.23,48.34,311.16000000000003,579.73,266.39999999999998,53.258696521391443,632.98869652139149,3509.6671212823749,4142.6558178037667,null,4142.6558178037667,632.98869652139149,3509.6671212823749,null,null,"SUDESTE"]
[null,4092.901335596649,13,null,"Refinaria Henrique Lage (Revap)","Rodovia Presidente Dutra, KM 143, S/N Bairro Jardim Diamante - São José dos Campos – SP CEP:12223-900","São Paulo","SÃO JOSÉ DOS CAMPOS - SP","Serro - MG",2.7498271212823746,2.5664918076204954,2749.8271212823747,759.84,3509.6671212823749,710,null,206.57,null,206.57,45.34,291.86,543.77,197.4,39.464214314274294,583.23421431427425,3509.6671212823749,4092.901335596649,null,4092.901335596649,583.23421431427425,3509.6671212823749,null,null,"SUDESTE"]
{"$rows_empty":8}
[null,null,null,"Acre"]
[null,null,null,"Alagoas"]
[null,null,null,"Amapá"]
[null,null,null,"Amazonas"]
[null,null,null,"Bahia"]
[null,null,null,"Ceará"]
[null,null,null,"Distrito Federal"]
[null,null,null,"Espírito Santo"]
[null,null,null,"Goiás"]
[null,null,null,"Maranhão"]
[null,null,null,"Mato Grosso"]
[null,null,null,"Mato Grosso do Sul"]
[null,null,null,"Minas Gerais"]
[null,null,null,"Pará"]
[null,null,null,"Paraíba"]
[null,null,null,"Paraná"]
[null,null,null,"Pernambuco"]
[null,null,null,"Piauí"]
[null,null,null,"Rio de Janeiro"]
[null,null,null,"Rio Grande do Norte"]
[null,null,null,"Rio Grande do Sul"]
[null,null,null,"Rondônia"]
[null,null,null,"Roraima"]
[null,null,null,"Santa Catarina"]
[null,null,null,"São Paulo"]
[null,null,null,"Sergipe"]
[null,null,null,"Tocantins"]
[]
[]
[]
[null,null,null,"ASFALTOS DILUÍDOS CM-30"]
[null,null,null,"ASFALTOS DILUÍDOS CM-70"]
[null,null,null,"ASFALTOS DILUÍDOS CR-250"]
[null,null,null,"ASFALTOS DILUÍDOS CR-70"]
[null,null,null,"CAP MODIFICADO POR BORRACHA DE PNEU AB22"]
[null,null,null,"CAP MODIFICADO POR BORRACHA DE PNEU AB8"]
[null,null,null,"CAP MODIFICADO POR POLÍMERO 55-75-E"]
[null,null,null,"CAP MODIFICADO POR POLÍMERO 60-85-E"]
[null,null,null,"CAP MODIFICADO POR POLÍMERO 65-90-E"]
[null,null,null,"CIMENTOS ASFÁLTICOS CAP-150-200"]
[null,null,null,"CIMENTOS ASFÁLTICOS CAP-30-45"]
[null,null,null,"CIMENTOS ASFÁLTICOS CAP-50-70"]
[null,null,null,"CIMENTOS ASFÁLTICOS CAP-85-100"]
[null,null,null,"EMULSÃO ASFÁLTICA CATIÔNICA DE RUPTURA CONTROLADA PARA SERVIÇO DE LAMA ASFÁLTICA"]
[null,null,null,"EMULSÃO ASFÁLTICA DE RUPTURA LENTA CATIÔNICA PARA SERVIÇO DE LAMA ASFÁLTICA"]
[null,null,null,"EMULSÃO ASFÁLTICA DE RUPTURA LENTA DE CARGA NEUTRA PARA SERVIÇO DE LAMA ASFÁLTICA"]
[null,null,null,"EMULSÃO ASFÁLTICA PARA SERVIÇO DE IMPRIMAÇÃO"]
[null,null,null,"EMULSÕES ASF. MOD. POR POLÍMEROS RC1C-E"]
[null,null,null,"EMULSÕES ASF. MOD. POR POLÍMEROS RL1C-E"]
[null,null,null,"EMULSÕES ASF. MOD. POR POLÍMEROS RM1C-E"]
[null,null,null,"EMULSÕES ASF. MOD. POR POLÍMEROS RR1C-E"]
[null,null,null,"EMULSÕES ASF. MOD. POR POLÍMEROS RR2C-E"]
[null,null,null,"EMULSÕES ASFÁLTICAS RL-1C"]
[null,null,null,"EMULSÕES ASFÁLTICAS RM-1C"]
[null,null,null,"EMULSÕES ASFÁLTICAS RM-2C"]
[null,null,null,"EMULSÕES ASFÁLTICAS RR-1C"]
[null,null,null,"EMULSÕES ASFÁLTICAS RR-2C"]

{"sheet":"RR-1C","index":7,"n_rows":92,"n_cols":34,"rows_kept":92,"cut":false,"hidden":false,"merged":[[1,2,3,26],[5,2,7,2],[10,4,10,8],[10,9,10,10],[10,22,10,23],[6,21,6,24],[7,21,7,24],[12,3,26,3],[6,19,6,20],[6,6,7,6],[5,12,7,12],[5,6,5,7],[5,8,5,9]]}
[]
[null,null,"MEMÓRIA DE CÁLCULO"]
[]
[]
[]
[{"$nulls":6},"TIPOLOGIA DO MATERIAL",null,"EMULSÕES ASFÁLTICAS RR-1C",null,null,null,"IMPOSTOS","COFINS",6.4999999999999997E-3,6.4999999999999997E-3]
[{"$nulls":6},"ÍNDICE DE PAVIMENTAÇÃO DNIT","2014-07-01","ÍNDICE INICIAL",270.23700000000002,null,null,null,"PIS",0.03,0.03,null,null,null,"LEGENDA",{"$nulls":8},"As empresas tributadas pelo Lucro Presumido pagam 0,65% de PIS e 3% de COFINS"]
[{"$nulls":7},"2023-10-01","ÍNDICE FINAL",{"$f":"EAI!J8","v":583.33399999999995},null,null,null," ICMS",0.18,0.18,{"$f":"1-(O8/1)","v":0.82000000000000006},{"$f":"1-(P8/1)","v":0.82000000000000006},{"$f":"1-(Q8/1)","v":0.17999999999999994},"ENTRADA DE DADOS",null,"QUANT.ESTIMADA DE RR-1C (TON.):",null,null,null,{"$f":"ORÇAMENTO!H65","v":3.4999980714285721},"TONELADAS",null,"As empresas tributadas pelo Lucro Real pagam 1,65% de PIS e 7,60% de COFINS"]
[{"$nulls":6},"Data ANP",{"$f":"EAI!H9","v":"2024-12-01"}]
[]
[null,null,"DATA-BASE","PRODUTOS","LOCALIDADES",{"$nulls":4},"CUSTO ANP (R$/Kg)",null,"CUSTO ANP","IMPOSTOS DO PRODUTO","CUSTO DO PRODUTO COM IMPOSTOS","DMT's","DMT'S FLUVIAL","CUSTO DO TRANSPORTE RODOVIA PAVIMENTADA","CUSTO DO TRANSPORTE FLUVIAL","CUSTO DO TRANSPORTE TOTAL","ICMS","ATUALIZAÇÃO DO CUSTO DE TRANSPORTE","CUSTO DO TRANSPORTE RODOVIA PAVIMENTADA COM IMPOSTOS E ATUALIZAÇÃO MONETÁRIA","PEDÁGIO ",null,"TOTAL TRANSPORTE","AQUISIÇÃO DO PRODUTO","TOTAL GERAL ( TRANSP + AQUISIÇÃO)",null,1,2,3]
[null,null,{"$f":"H8","v":"2023-10-01"},null,"REFINARIAS","ENDEREÇO","ESTADO","CIDADE","DESTINO","ESTADO","REGIÃO","R$/t","R$/t","R$/t","KM","KM","R$/t","R$/t","R$/t","R$/t","R$/t","R$/t","CUSTO ","R$/t","R$/t","R$/t","R$/t",null,"TOTAL GERAL ( TRANSP + AQUISIÇÃO)","TOTAL TRANSPORTE","AQUISIÇÃO DO PRODUTO"]
[null,{"$f":"AA13","v":4860.5571575880294},1,{"$f":"I6","v":"EMULSÕES ASFÁLTICAS RR-1C"},"'CENTRO OESTE ASFALTOS LTDA.","SETOR DE INFLAMÁVEIS, S/N TRECHO 02 - LOTE 1.100 - GUARÁ - CEP:71225-000","Distrito Federal","BRASÍLIA - DF",{"$f":"EAI!I13","v":"Serro - MG"},"-",3.2575370861757449,{"$f":"IF(AND(J13=\"-\",K13=\"-\"),\"\",IF(AND(J13<>0,K13=\"-\"),J13*1000,IF(AND(J13=\"-\",K13<>0),K13*1000,IF(AND(J13<>0,K13<>0),J13*1000,\"\"))))","v":3257.5370861757447},{"$f":"ROUND(((L13/(1-$O$6-$O$7-$O$8))-L13),2)","v":900.14},{"$f":"L13+M13","v":4157.677086175745},754.3,null,{"$f":"ROUND((26.939+0.253*O13),2)","v":217.78},null,{"$f":"Q13+R13","v":217.78},{"$f":"TRUNC(S13*($O$8/(1-$O$8)),2)","v":47.8},{"$f":"TRUNC(IF($J$7=\"\",\"\",(($J$8-$J$7)/$J$7)*(S13+T13)),2)","v":307.7},{"$f":"S13+T13+U13","v":573.28},226.8,{"$f":"EVEN($Z$8*2/28)*W13/$Z$8","v":129.60007141228422},{"$f":"IF(AND(Q13=\"\",T13=\"\"),\"\",V13+X13)","v":702.88007141228422},{"$f":"IF(OR(L13=\"\",M13=\"\"),\"\",L13+M13)","v":4157.677086175745},{"$f":"IF(OR(Y13=\"\",Z13=\"\"),\"\",Y13+Z13)","v":4860.5571575880294},null,{"$f":"AA13","v":4860.5571575880294},{"$f":"Y13","v":702.88007141228422},{"$f":"Z13","v":4157.677086175745},null,null,{"$f":"IF(OR(G13=$D$52,G13=$D$53,G13=$D$55,G13=$D$61,G13=$D$45,G13=$D$41,G13=$D$37,G13=$D$50,G13=$D$40),\"NORDESTE\",IF(OR(G13=$D$36,G13=$D$38,G13=$D$39,G13=$D$49,G13=$D$57,G13=$D$58,G13=$D$62),\"NORTE\",IF(OR(G13=$D$42,G13=$D$44,G13=$D$46,G13=$D$47),\"CENTRO-OESTE\",IF(OR(G13=$D$60,G13=$D$54,G13=$D$48,G13=$D$43),\"SUDESTE\",IF(OR(G13=$D$59,G13=$D$51,G13=$D$56),\"SUL\",\"\")))))","v":"CENTRO-OESTE"}]
[null,{"$f":"AA14","v":4852.9884162274921},2,null,"STRATURA ASFALTOS S/A","AVENIDA PRESIDENTE WILSON, 08  - JUNDIAÍ - CEP:75115-100","Goiás","ANÁPOLIS - GO",{"$f":"I13","v":"Serro - MG"},3.178431188922489,3.2575370861757449,{"$f":"IF(AND(J14=\"-\",K14=\"-\"),\"\",IF(AND(J14<>0,K14=\"-\"),J14*1000,IF(AND(J14=\"-\",K14<>0),K14*1000,IF(AND(J14<>0,K14<>0),J14*1000,\"\"))))","v":3178.4311889224891},{"$f":"ROUND(((L14/(1-$O$6-$O$7-$O$8))-L14),2)","v":878.28},{"$f":"L14+M14","v":4056.7111889224889},859,null,{"$f":"ROUND((26.939+0.253*O14),2)","v":244.27},null,{"$f":"Q14+R14","v":244.27},{"$f":"TRUNC(S14*($O$8/(1-$O$8)),2)","v":53.62},{"$f":"TRUNC(IF($J$7=\"\",\"\",(($J$8-$J$7)/$J$7)*(S14+T14)),2)","v":345.13},{"$f":"S14+T14+U14","v":643.02},268.2,{"$f":"EVEN($Z$8*2/28)*W14/$Z$8","v":153.25722730500277},796.27722730500273,4056.7111889224889,{"$f":"IF(OR(Y14=\"\",Z14=\"\"),\"\",Y14+Z14)","v":4852.9884162274921},null,{"$f":"AA14","v":4852.9884162274921},{"$f":"Y14","v":796.27722730500273},4056.7111889224889,null,null,"CENTRO-OESTE"]
[null,4865.9412603347728,3,null,"DISTRIBUIDORA BRASILEIRA DE ASFALTO SA - DISBRAL","VIA PRIMARIA 8, S/N QD-18, MODS. 24/47 - DAIAG - CEP:74980-970","Goiás","APARECIDA DE GOIANIA - GO",{"$f":"I14","v":"Serro - MG"},3.178431188922489,3.2575370861757449,3178.4311889224891,878.28,4056.7111889224889,914,null,258.18,null,258.18,56.67,364.78,679.63,226.8,129.60007141228422,809.23007141228425,4056.7111889224889,4865.9412603347728,null,4865.9412603347728,809.23007141228425,4056.7111889224889,null,null,"CENTRO-OESTE"]
[2403,4875.9412603347728,4,null,"INDÚSTRIA NACIONAL DE ASFALTOS LTDA.","VIA PRIMEIRA E SEGUNDA 3, S/N.º LOTES 01 A 10 - DISTRITO AGROINDUSTRIAL - CEP:75370-000","Goiás","GOIANIRA - GO","Serro - MG",3.178431188922489,3.2575370861757449,3178.4311889224891,878.28,4056.7111889224889,929,null,261.98,null,261.98,57.5,370.15,689.63,226.8,129.60007141228422,819.23007141228425,4056.7111889224889,4875.9412603347728,null,4875.9412603347728,819.23007141228425,4056.7111889224889,null,null,"CENTRO-OESTE"]
[null,4136.7321779986851,5,null,"STRATURA ASFALTOS S/A","RUA VICTOR RODRIGUES RESENDE, 333  - DISTRITO IND. DE UBERLÂNDIA - CEP:38405-440","Minas Gerais","UBERLANDIA - MG","Serro - MG",2.7250163919228432,2.7734975034562561,2725.016391922843,752.99,3478.0063919228432,687,null,200.75,null,200.75,44.06,283.63,528.44000000000005,228,130.28578607584129,658.72578607584137,3478.0063919228432,4136.7321779986851,null,4136.7321779986851,658.72578607584137,3478.0063919228432,null,null,"SUDESTE"]
[null,5846.9419337265763,6,null,"ARAPETRO DISTRIBUIDORA DE PETRÓLEO LTDA.","RUA 04, S/N° LOTES 17 A 20. - DISTRITO INDUSTRIAL 1/8 - CEP:78600-000","Mato Grosso","BARRA DO GARCAS - MT",{"$f":"I17","v":"Serro - MG"},3.7550018623142916,3.2575370861757449,{"$f":"IF(AND(J18=\"-\",K18=\"-\"),\"\",IF(AND(J18<>0,K18=\"-\"),J18*1000,IF(AND(J18=\"-\",K18<>0),K18*1000,IF(AND(J18<>0,K18<>0),J18*1000,\"\"))))","v":3755.0018623142914},{"$f":"ROUND(((L18/(1-$O$6-$O$7-$O$8))-L18),2)","v":1037.5999999999999},4792.6018623142918,1282,null,351.29,null,351.29,77.11,496.34,924.74,226.8,129.60007141228422,1054.3400714122843,4792.6018623142918,5846.9419337265763,{"$nulls":6},"CENTRO-OESTE"]
[null,3719.4163919228431,7,null,"DISTRIBUIDORA BRASILEIRA DE ASFALTO SA - DISBRAL","SÃO JUDAS TADEU, 288  - DISTRITO INDUSTRIAL - CEP:32450-000","Minas Gerais","SARZEDO - MG","Serro - MG",2.7250163919228432,2.7734975034562561,2725.016391922843,752.99,3478.0063919228432,256,null,91.71,null,91.71,20.13,129.57,241.40999999999997,0,0,241.40999999999997,3478.0063919228432,3719.4163919228431,{"$nulls":6},"SUDESTE"]
[null,6083.0367161942722,8,null,"'INDÚSTRIA NACIONAL DE ASFALTOS LTDA.","INDÚSTRIA NACIONAL DE ASFALTOS LTDA - CEP:77053-080","Tocantins"," PALMAS - TO","Serro - MG","-",3.6084565125370163,3608.4565125370164,997.1,4605.5565125370167,1557,null,420.86,null,420.86,92.38,594.64,1107.8800000000001,646.79999999999995,369.60020365725495,1477.4802036572551,4605.5565125370167,6083.0367161942722,{"$nulls":6},"NORTE"]
[null,4471.4107291083183,9,null,"'NTA - NOVAS TÉCNICAS DE ASFALTOS S/A","RUA SOFIA ATAURI FADIN, 150 SALA A - B. SANTA TEREZINHA - CEP:13140-000","São Paulo","PAULINIA - SP","Serro - MG",2.9298620737986507,2.7734975034562561,2929.8620737986507,{"$f":"ROUND(((L21/(1-$O$6-$O$7-$O$8))-L21),2)","v":809.59},3739.4520737986509,{"$f":"EAI!O24","v":764},null,220.23,null,220.23,48.34,311.16000000000003,579.73,{"$f":"EAI!W24","v":266.39999999999998},152.22865530966718,731.95865530966717,3739.4520737986509,4471.4107291083183,null,4471.4107291083183,731.95865530966717,3739.4520737986509,null,null,"SUDESTE"]
[null,4412.7621121496923,10,null,"COMPANHIA BRASILEIRA DE ASFALTOS DA AMAZÔNIA - IMPORTAÇÃO E EXPORTAÇÃO","Avenida Doutor Olindo Dártora 2451, Galpão 02, Morro Grande - CEP:07726-555","São Paulo","CAIEIRAS - SP","Serro - MG",2.9298620737986507,2.7734975034562561,2929.8620737986507,809.59,3739.4520737986509,800,null,229.34,null,229.34,50.34,324.02999999999997,603.71,121.8,69.600038351041519,673.31003835104161,3739.4520737986509,4412.7621121496923,{"$nulls":6},"SUDESTE"]
[null,5758.248793217298,11,null,"BETUNEL INDÚSTRIA E COMÉRCIO LTDA.","R 16 , 82, Vila Nova Campo Grande - CEP:79.103-834","Mato Grosso do Sul","CAMPO GRANDE - MS","Serro - MG","-",3.2575370861757449,3257.5370861757447,900.14,4157.677086175745,1538,null,416.05,null,416.05,91.32,587.83000000000004,1095.2,884.4,505.37170704155272,1600.5717070415528,4157.677086175745,5758.248793217298,{"$nulls":6},"CENTRO-OESTE"]
[null,6278.3233974373825,12,null,"BETUNEL INDÚSTRIA E COMÉRCIO LTDA.","RUA N ESQUINA COM RUA X, S/N QD. IND. 7 L 01/08 - DIST. IND. - CEP:78015-285","Mato Grosso","CUIABA - MT",{"$f":"I23","v":"Serro - MG"},3.7550018623142916,3.2575370861757449,3755.0018623142914,1037.5999999999999,4792.6018623142918,1834,null,490.94,null,490.94,107.76,693.65,1292.3499999999999,338.4,193.37153512309072,1485.7215351230907,4792.6018623142918,6278.3233974373825,{"$nulls":6},"CENTRO-OESTE"]
[null,4423.3221359537874,13,null,"VIAPOL LTDA.","VITO ARDITO, 6401 KM 118,5 - JARDIM CAMPO GRANDE - CEP:12282-535","São Paulo","CACAPAVA - SP",{"$f":"I24","v":"Serro - MG"},2.9298620737986507,2.7734975034562561,2929.8620737986507,809.59,3739.4520737986509,751,null,216.94,null,216.94,47.62,306.51,571.06999999999994,197.4,112.80006215513627,683.87006215513622,3739.4520737986509,4423.3221359537874,null,4423.3221359537874,683.87006215513622,3739.4520737986509,null,null,"SUDESTE"]
[null,4215.6704784860585,14,null,"STRATURA ASFALTOS S/A","RUA LUIS DE CAMÕES, 26  - CAMPOS ELÍSEOS - CEP:25225-030","Rio de Janeiro","DUQUE DE CAXIAS - RJ","Serro - MG","-",2.7734975034562561,2773.4975034562563,766.38,3539.8775034562564,{"$f":"EAI!O18","v":587},null,175.45,null,175.45,38.51,247.89,461.84999999999997,{"$f":"EAI!W18","v":374.4},213.94297502980251,675.79297502980251,3539.8775034562564,4215.6704784860585,null,4215.6704784860585,675.79297502980251,3539.8775034562564,null,null,"SUDESTE"]
[null,4865.3679968403194,15,null,"CASA DO ASFALTO DISTRIBUIDORA, INDÚSTRIA E COMÉRCIO DE ASFALTO LTDA.","BR 376, PARQUE INDUSTRIAL, S/N LOTE 6/7/7-A-3-1 - GL.PATR.MARIALVA - CEP:86990-000","Paraná","MARIALVA - PR",{"$f":"I26","v":"Serro - MG"},2.6974877614442714,2.7074316133253515,2697.4877614442712,745.38,3442.8677614442713,1388,null,378.1,null,378.1,82.99,534.21,995.30000000000007,747.6,427.20023539604801,1422.5002353960481,3442.8677614442713,4865.3679968403194,null,4865.3679968403194,1422.5002353960481,3442.8677614442713,null,null,"SUL"]
{"$rows_empty":8}
[null,null,null,"Acre"]
[null,null,null,"Alagoas"]
[null,null,null,"Amapá"]
[null,null,null,"Amazonas"]
[null,null,null,"Bahia"]
[null,null,null,"Ceará"]
[null,null,null,"Distrito Federal"]
[null,null,null,"Espírito Santo"]
[null,null,null,"Goiás"]
[null,null,null,"Maranhão"]
[null,null,null,"Mato Grosso"]
[null,null,null,"Mato Grosso do Sul"]
[null,null,null,"Minas Gerais"]
[null,null,null,"Pará"]
[null,null,null,"Paraíba"]
[null,null,null,"Paraná"]
[null,null,null,"Pernambuco"]
[null,null,null,"Piauí"]
[null,null,null,"Rio de Janeiro"]
[null,null,null,"Rio Grande do Norte"]
[null,null,null,"Rio Grande do Sul"]
[null,null,null,"Rondônia"]
[null,null,null,"Roraima"]
[null,null,null,"Santa Catarina"]
[null,null,null,"São Paulo"]
[null,null,null,"Sergipe"]
[null,null,null,"Tocantins"]
[]
[]
[]
[null,null,null,"ASFALTOS DILUÍDOS CM-30"]
[null,null,null,"ASFALTOS DILUÍDOS CM-70"]
[null,null,null,"ASFALTOS DILUÍDOS CR-250"]
[null,null,null,"ASFALTOS DILUÍDOS CR-70"]
[null,null,null,"CAP MODIFICADO POR BORRACHA DE PNEU AB22"]
[null,null,null,"CAP MODIFICADO POR BORRACHA DE PNEU AB8"]
[null,null,null,"CAP MODIFICADO POR POLÍMERO 55-75-E"]
[null,null,null,"CAP MODIFICADO POR POLÍMERO 60-85-E"]
[null,null,null,"CAP MODIFICADO POR POLÍMERO 65-90-E"]
[null,null,null,"CIMENTOS ASFÁLTICOS CAP-150-200"]
[null,null,null,"CIMENTOS ASFÁLTICOS CAP-30-45"]
[null,null,null,"CIMENTOS ASFÁLTICOS CAP-50-70"]
[null,null,null,"CIMENTOS ASFÁLTICOS CAP-85-100"]
[null,null,null,"EMULSÃO ASFÁLTICA CATIÔNICA DE RUPTURA CONTROLADA PARA SERVIÇO DE LAMA ASFÁLTICA"]
[null,null,null,"EMULSÃO ASFÁLTICA DE RUPTURA LENTA CATIÔNICA PARA SERVIÇO DE LAMA ASFÁLTICA"]
[null,null,null,"EMULSÃO ASFÁLTICA DE RUPTURA LENTA DE CARGA NEUTRA PARA SERVIÇO DE LAMA ASFÁLTICA"]
[null,null,null,"EMULSÃO ASFÁLTICA PARA SERVIÇO DE IMPRIMAÇÃO"]
[null,null,null,"EMULSÕES ASF. MOD. POR POLÍMEROS RC1C-E"]
[null,null,null,"EMULSÕES ASF. MOD. POR POLÍMEROS RL1C-E"]
[null,null,null,"EMULSÕES ASF. MOD. POR POLÍMEROS RM1C-E"]
[null,null,null,"EMULSÕES ASF. MOD. POR POLÍMEROS RR1C-E"]
[null,null,null,"EMULSÕES ASF. MOD. POR POLÍMEROS RR2C-E"]
[null,null,null,"EMULSÕES ASFÁLTICAS RL-1C"]
[null,null,null,"EMULSÕES ASFÁLTICAS RM-1C"]
[null,null,null,"EMULSÕES ASFÁLTICAS RM-2C"]
[null,null,null,"EMULSÕES ASFÁLTICAS RR-1C"]
[null,null,null,"EMULSÕES ASFÁLTICAS RR-2C"]

{"sheet":"CAP","index":8,"n_rows":91,"n_cols":34,"rows_kept":91,"cut":false,"hidden":false,"merged":[[10,4,10,8],[10,9,10,10],[10,22,10,23],[12,3,24,3],[1,2,3,26],[5,2,7,2],[5,12,7,12],[6,6,7,6],[6,19,6,20],[6,21,6,24],[7,21,7,24],[5,6,5,7],[5,8,5,9]]}
[]
[null,null,"MEMÓRIA DE CÁLCULO"]
[]
[]
[]
[{"$nulls":6},"TIPOLOGIA DO MATERIAL",null,"CIMENTOS ASFÁLTICOS CAP-50-70",null,null,null,"IMPOSTOS","COFINS",6.4999999999999997E-3,6.4999999999999997E-3]
[{"$nulls":6},"ÍNDICE DE PAVIMENTAÇÃO DNIT","2014-07-01","ÍNDICE INICIAL",270.23700000000002,null,null,null,"PIS",0.03,0.03,null,null,null,"LEGENDA",null,"QUANT.ESTIMADA DE MASSA ASFÁLTICA (TON.):",null,null,null,{"$f":"ORÇAMENTO!H24","v":670.00000000000011},"TONELADAS",null,"As empresas tributadas pelo Lucro Presumido pagam 0,65% de PIS e 3% de COFINS"]
[{"$nulls":7},"2023-10-01","ÍNDICE FINAL",{"$f":"EAI!J8","v":583.33399999999995},null,null,null," ICMS",0.18,0.18,{"$f":"1-(O8/1)","v":0.82000000000000006},{"$f":"1-(P8/1)","v":0.82000000000000006},{"$f":"1-(Q8/1)","v":0.17999999999999994},"ENTRADA DE DADOS",null,"QUANT.ESTIMADA DE CAP 50/70 (TON.):",null,null,null,{"$f":"ORÇAMENTO!H67","v":37.000000000000007},"TONELADAS",null,"As empresas tributadas pelo Lucro Real pagam 1,65% de PIS e 7,60% de COFINS"]
[{"$nulls":6},"Data ANP",{"$f":"EAI!H9","v":"2024-12-01"}]
[]
[null,null,"DATA-BASE","PRODUTOS","LOCALIDADES",{"$nulls":4},"CUSTO ANP (R$/Kg)",null,"CUSTO ANP","IMPOSTOS DO PRODUTO","CUSTO DO PRODUTO COM IMPOSTOS","DMT's","DMT's FLUVIAL","CUSTO DO TRANSPORTE RODOVIA PAVIMENTADA","CUSTO DO TRANSPORTE FLUVIAL","CUSTO DO TRANSPORTE TOTAL","ICMS","ATUALIZAÇÃO DO CUSTO DE TRANSPORTE","CUSTO DO TRANSPORTE RODOVIA PAVIMENTADA COM IMPOSTOS E ATUALIZAÇÃO MONETÁRIA","PEDÁGIO ",null,"TOTAL TRANSPORTE","AQUISIÇÃO DO PRODUTO","TOTAL GERAL ( TRANSP + AQUISIÇÃO)",null,1,2,3]
[null,null,{"$f":"H8","v":"2023-10-01"},null,"REFINARIAS","ENDEREÇO","ESTADO","CIDADE","DESTINO","ESTADO","REGIÃO","R$/t","R$/t","R$/t","KM","KM","R$/t","R$/t","R$/t","R$/t","R$/t","R$/t","CUSTO ","R$/t","R$/t","R$/t","R$/t",null,"TOTAL GERAL ( TRANSP + AQUISIÇÃO)","TOTAL TRANSPORTE","AQUISIÇÃO DO PRODUTO"]
[null,{"$f":"AA13","v":6210.9708229914941},1,{"$f":"I6","v":"CIMENTOS ASFÁLTICOS CAP-50-70"},"Refinaria Abreu e Lima","Rodovia PE 60, Km 10 - Ipojuca - PE CEP:55590-000","Pernambuco","IPOJUCA - PE","Conceição do Mato Dentro - MG","-",3.9441570392077105,{"$f":"IF(AND(J13=\"-\",K13=\"-\"),\"\",IF(AND(J13<>0,K13=\"-\"),J13*1000,IF(AND(J13=\"-\",K13<>0),K13*1000,IF(AND(J13<>0,K13<>0),J13*1000,\"\"))))","v":3944.1570392077106},{"$f":"ROUND(((L13/(1-$O$6-$O$7-$O$8))-L13),2)","v":1089.8699999999999},{"$f":"L13+M13","v":5034.0270392077109},1631,null,{"$f":"ROUND((26.939+0.253*O13),2)","v":439.58},null,{"$f":"Q13+R13","v":439.58},{"$f":"TRUNC(S13*($O$8/(1-$O$8)),2)","v":96.49},{"$f":"TRUNC(IF($J$7=\"\",\"\",(($J$8-$J$7)/$J$7)*(S13+T13)),2)","v":621.09},{"$f":"S13+T13+U13","v":1157.1599999999999},{"$f":"EAI!W13","v":183},{"$f":"EVEN($Z$8*2/28)*W13/$Z$8","v":19.783783783783779},{"$f":"IF(AND(Q13=\"\",T13=\"\"),\"\",V13+X13)","v":1176.9437837837836},{"$f":"IF(OR(L13=\"\",M13=\"\"),\"\",L13+M13)","v":5034.0270392077109},{"$f":"IF(OR(Y13=\"\",Z13=\"\"),\"\",Y13+Z13)","v":6210.9708229914941},null,{"$f":"AA13","v":6210.9708229914941},{"$f":"Y13","v":1176.9437837837836},{"$f":"Z13","v":5034.0270392077109},null,null,{"$f":"IF(OR(G13=$D$51,G13=$D$52,G13=$D$54,G13=$D$60,G13=$D$44,G13=$D$40,G13=$D$36,G13=$D$49,G13=$D$39),\"NORDESTE\",IF(OR(G13=$D$35,G13=$D$37,G13=$D$38,G13=$D$48,G13=$D$56,G13=$D$57,G13=$D$61),\"NORTE\",IF(OR(G13=$D$41,G13=$D$43,G13=$D$45,G13=$D$46),\"CENTRO-OESTE\",IF(OR(G13=$D$59,G13=$D$53,G13=$D$47,G13=$D$42),\"SUDESTE\",IF(OR(G13=$D$58,G13=$D$50,G13=$D$55),\"SUL\",\"\")))))","v":"NORDESTE"}]
[null,{"$f":"AA14","v":6405.4608229914948},3,null,"Refinaria Potiguar Clara Camarão","Rodovia RN 221, KM 25 - Guamaré - RN CEP:59598-000","Rio Grande do Norte","GUAMARÉ - RN",{"$f":"I13","v":"Conceição do Mato Dentro - MG"},"-",3.9441570392077105,3944.1570392077106,{"$f":"ROUND(((L14/(1-$O$6-$O$7-$O$8))-L14),2)","v":1089.8699999999999},{"$f":"L14+M14","v":5034.0270392077109},1923,null,{"$f":"ROUND((26.939+0.253*O14),2)","v":513.46},null,{"$f":"Q14+R14","v":513.46},{"$f":"TRUNC(S14*($O$8/(1-$O$8)),2)","v":112.71},{"$f":"TRUNC(IF($J$7=\"\",\"\",(($J$8-$J$7)/$J$7)*(S14+T14)),2)","v":725.48},{"$f":"S14+T14+U14","v":1351.65},{"$f":"EAI!W14","v":183},{"$f":"EVEN($Z$8*2/28)*W14/$Z$8","v":19.783783783783779},1371.4337837837838,5034.0270392077109,{"$f":"IF(OR(Y14=\"\",Z14=\"\"),\"\",Y14+Z14)","v":6405.4608229914948},null,{"$f":"AA14","v":6405.4608229914948},{"$f":"Y14","v":1371.4337837837838},5034.0270392077109,null,null,"NORDESTE"]
[null,5865.0036445622327,4,null,"Refinaria Landulpho Alves (RLAM)","Rodovia BA 523, KM 4 – Mataripe São Francisco do Conde - BA CEP:43900-000","Bahia","SÃO FRANCISCO DO CONDE - BA",{"$f":"I14","v":"Conceição do Mato Dentro - MG"},4.0261595905081782,3.9441570392077105,4026.1595905081781,{"$f":"ROUND(((L15/(1-$O$6-$O$7-$O$8))-L15),2)","v":1112.53},5138.6895905081783,951,null,{"$f":"ROUND((26.939+0.253*O15),2)","v":267.54000000000002},null,267.54000000000002,58.72,378,704.26,{"$f":"EAI!W15","v":204},22.054054054054049,726.31405405405405,5138.6895905081783,5865.0036445622327,null,5865.0036445622327,726.31405405405405,5138.6895905081783,null,null,"NORDESTE"]
[2403,6352.3114378328246,5,null,"Refinaria Lubrificantes e Derivados do Nordeste (Lubnor)","Av. Leite Barbosa, s/nº - Mucuripe Fortaleza - Ceará CEP:60180-420","Ceará","FORTALEZA - CE","Conceição do Mato Dentro - MG",3.8806176540490416,3.9441570392077105,3880.6176540490414,{"$f":"ROUND(((L16/(1-$O$6-$O$7-$O$8))-L16),2)","v":1072.31},4952.9276540490409,1965,null,524.08000000000004,null,524.08000000000004,115.04,740.48,1379.6,{"$f":"EAI!W16","v":183},19.783783783783779,1399.3837837837837,4952.9276540490409,6352.3114378328246,null,6352.3114378328246,1399.3837837837837,4952.9276540490409,null,null,"NORDESTE"]
[null,5403.4841797306944,6,null,"Refinaria Capuava (Recap)","Av. Alberto Soares Sampaio, 2122-A Capuava – Mauá - SP","São Paulo","MAUÁ - SP","Conceição do Mato Dentro - MG",3.6434155310820451,3.64899976895637,3643.4155310820452,{"$f":"ROUND(((L17/(1-$O$6-$O$7-$O$8))-L17),2)","v":1006.76},4650.1755310820454,1002,null,280.45,null,280.45,61.56,396.25,738.26,{"$f":"EAI!W17","v":139.19999999999999},15.048648648648644,753.30864864864861,4650.1755310820454,5403.4841797306944,null,5403.4841797306944,753.30864864864861,4650.1755310820454,null,null,"SUDESTE"]
[null,5139.7022383837884,7,null,"Refinaria Duque de Caxias (Reduc)","Rodovia Washington Luiz, km 113,7 Campos Elíseos – Duque de Caxias - RJ CEP:25213-005","Rio de Janeiro","DUQUE DE CAXIAS - RJ","Conceição do Mato Dentro - MG",3.5081465627081125,3.64899976895637,3508.1465627081125,969.39,4477.5365627081128,827,null,236.17,null,236.17,51.84,333.68,621.69000000000005,{"$f":"EAI!W18","v":374.4},40.475675675675667,662.16567567567574,4477.5365627081128,5139.7022383837884,null,5139.7022383837884,662.16567567567574,4477.5365627081128,null,null,"SUDESTE"]
[null,6409.2470329920025,8,null,"Refinaria Alberto Pasqualini (Refap)","Avenida Getúlio Vargas, 11001 - Bairro Brigadeira Canoas - RS - Brasil CEP:92420-221","Rio Grande do Sul","CANOAS - RS","Conceição do Mato Dentro - MG",3.7766189248838939,3.7886056179558163,3776.6189248838941,1043.57,4820.1889248838943,2134,null,566.84,null,566.84,124.42,800.89,1492.15,{"$f":"EAI!W19","v":896.4},96.908108108108081,1589.0581081081082,4820.1889248838943,6409.2470329920025,null,6409.2470329920025,1589.0581081081082,4820.1889248838943,null,null,"SUL"]
[null,5998.2732272822459,9,null,"Unidade de Industrialização do Xisto (SIX)","Rodovia do Xisto, BR 476, km 153 São Mateus do Sul – PR CEP 83900-000","Paraná","SÃO MATEUS DO SUL - PR","Conceição do Mato Dentro - MG",3.799588362417381,3.7886056179558163,3799.5883624173812,1049.92,4849.5083624173812,1539,null,416.31,null,416.31,91.38,588.21,1095.9000000000001,{"$f":"EAI!W20","v":489},52.864864864864856,1148.7648648648649,4849.5083624173812,5998.2732272822459,null,5998.2732272822459,1148.7648648648649,4849.5083624173812,null,null,"SUL"]
[null,5077.0640094660794,10,null,"Refinaria Gabriel Passos (Regap)","Av. Refinaria Gabriel Passos, 690 Distrito Industrial Paulo Camilo Sul Betim - MG CEP:32669-205","Minas Gerais","BETIM - MG","Conceição do Mato Dentro - MG",3.697444009466079,3.64899976895637,3697.444009466079,1021.69,4719.1340094660791,431,null,135.97999999999999,null,135.97999999999999,29.84,192.11,357.93,{"$f":"EAI!W21","v":0},0,357.93,4719.1340094660791,{"$f":"IF(OR(Y21=\"\",Z21=\"\"),\"\",Y21+Z21)","v":5077.0640094660794},null,5077.0640094660794,357.93,4719.1340094660791,null,null,"SUDESTE"]
[null,5924.863767822786,11,null,"Refinaria Presidente Getúlio Vargas (Repar)","Rodovia do Xisto, BR 476, km 16 Araucária - PR CEP:83707-440","Paraná","ARAUCÁRIA - PR","Conceição do Mato Dentro - MG",3.799588362417381,3.7886056179558163,3799.5883624173812,1049.92,4849.5083624173812,1440,null,391.26,null,391.26,85.88,552.80999999999995,1029.9499999999998,{"$f":"EAI!W22","v":420},45.405405405405396,1075.3554054054052,4849.5083624173812,5924.863767822786,null,5924.863767822786,1075.3554054054052,4849.5083624173812,null,null,"SUL"]
[null,5429.424179730694,12,null,"Refinaria Presidente Bernardes (RPBC)","Av. 9 de abril, 777 - Jardim das Indústrias Cubatão - SP CEP:11505-000","São Paulo","CUBATÃO - SP","Conceição do Mato Dentro - MG",3.6434155310820451,3.64899976895637,3643.4155310820452,1006.76,4650.1755310820454,1041,null,290.31,null,290.31,63.72,410.17,764.2,{"$f":"EAI!W23","v":139.19999999999999},15.048648648648644,779.24864864864867,4650.1755310820454,5429.424179730694,null,5429.424179730694,779.24864864864867,4650.1755310820454,null,null,"SUDESTE"]
[null,5429.865531082045,13,null,"Refinaria de Paulínia (Replan)","Rodovia SP 332 - Km. 130 Bonfim - Paulínia – SP CEP:13140-000","São Paulo","PAULÍNIA - SP","Conceição do Mato Dentro - MG",3.6434155310820451,3.64899976895637,3643.4155310820452,1006.76,4650.1755310820454,1021,null,285.25,null,285.25,62.61,403.03,750.89,{"$f":"EAI!W24","v":266.39999999999998},28.799999999999994,779.68999999999994,4650.1755310820454,5429.865531082045,null,5429.865531082045,779.68999999999994,4650.1755310820454,null,null,"SUDESTE"]
[null,5377.1360716225863,14,null,"Refinaria Henrique Lage (Revap)","Rodovia Presidente Dutra, KM 143, S/N Bairro Jardim Diamante - São José dos Campos – SP CEP:12223-900","São Paulo","SÃO JOSÉ DOS CAMPOS - SP","Conceição do Mato Dentro - MG",3.6434155310820451,3.64899976895637,3643.4155310820452,1006.76,4650.1755310820454,953,null,268.05,null,268.05,58.84,378.73,705.62,{"$f":"EAI!W25","v":197.4},21.340540540540538,726.96054054054059,4650.1755310820454,5377.1360716225863,null,5377.1360716225863,726.96054054054059,4650.1755310820454,null,null,"SUDESTE"]
{"$rows_empty":9}
[null,null,null,"Acre"]
[null,null,null,"Alagoas"]
[null,null,null,"Amapá"]
[null,null,null,"Amazonas"]
[null,null,null,"Bahia"]
[null,null,null,"Ceará"]
[null,null,null,"Distrito Federal"]
[null,null,null,"Espírito Santo"]
[null,null,null,"Goiás"]
[null,null,null,"Maranhão"]
[null,null,null,"Mato Grosso"]
[null,null,null,"Mato Grosso do Sul"]
[null,null,null,"Minas Gerais"]
[null,null,null,"Pará"]
[null,null,null,"Paraíba"]
[null,null,null,"Paraná"]
[null,null,null,"Pernambuco"]
[null,null,null,"Piauí"]
[null,null,null,"Rio de Janeiro"]
[null,null,null,"Rio Grande do Norte"]
[null,null,null,"Rio Grande do Sul"]
[null,null,null,"Rondônia"]
[null,null,null,"Roraima"]
[null,null,null,"Santa Catarina"]
[null,null,null,"São Paulo"]
[null,null,null,"Sergipe"]
[null,null,null,"Tocantins"]
[]
[]
[]
[null,null,null,"ASFALTOS DILUÍDOS CM-30"]
[null,null,null,"ASFALTOS DILUÍDOS CM-70"]
[null,null,null,"ASFALTOS DILUÍDOS CR-250"]
[null,null,null,"ASFALTOS DILUÍDOS CR-70"]
[null,null,null,"CAP MODIFICADO POR BORRACHA DE PNEU AB22"]
[null,null,null,"CAP MODIFICADO POR BORRACHA DE PNEU AB8"]
[null,null,null,"CAP MODIFICADO POR POLÍMERO 55-75-E"]
[null,null,null,"CAP MODIFICADO POR POLÍMERO 60-85-E"]
[null,null,null,"CAP MODIFICADO POR POLÍMERO 65-90-E"]
[null,null,null,"CIMENTOS ASFÁLTICOS CAP-150-200"]
[null,null,null,"CIMENTOS ASFÁLTICOS CAP-30-45"]
[null,null,null,"CIMENTOS ASFÁLTICOS CAP-50-70"]
[null,null,null,"CIMENTOS ASFÁLTICOS CAP-85-100"]
[null,null,null,"EMULSÃO ASFÁLTICA CATIÔNICA DE RUPTURA CONTROLADA PARA SERVIÇO DE LAMA ASFÁLTICA"]
[null,null,null,"EMULSÃO ASFÁLTICA DE RUPTURA LENTA CATIÔNICA PARA SERVIÇO DE LAMA ASFÁLTICA"]
[null,null,null,"EMULSÃO ASFÁLTICA DE RUPTURA LENTA DE CARGA NEUTRA PARA SERVIÇO DE LAMA ASFÁLTICA"]
[null,null,null,"EMULSÃO ASFÁLTICA PARA SERVIÇO DE IMPRIMAÇÃO"]
[null,null,null,"EMULSÕES ASF. MOD. POR POLÍMEROS RC1C-E"]
[null,null,null,"EMULSÕES ASF. MOD. POR POLÍMEROS RL1C-E"]
[null,null,null,"EMULSÕES ASF. MOD. POR POLÍMEROS RM1C-E"]
[null,null,null,"EMULSÕES ASF. MOD. POR POLÍMEROS RR1C-E"]
[null,null,null,"EMULSÕES ASF. MOD. POR POLÍMEROS RR2C-E"]
[null,null,null,"EMULSÕES ASFÁLTICAS RL-1C"]
[null,null,null,"EMULSÕES ASFÁLTICAS RM-1C"]
[null,null,null,"EMULSÕES ASFÁLTICAS RM-2C"]
[null,null,null,"EMULSÕES ASFÁLTICAS RR-1C"]
[null,null,null,"EMULSÕES ASFÁLTICAS RR-2C"]

{"sheet":"MAT.ASF","index":9,"n_rows":33,"n_cols":23,"rows_kept":33,"cut":false,"hidden":false,"merged":[[7,1,7,19],[8,1,10,22],[2,1,2,8],[3,1,3,8],[4,1,4,8],[5,1,5,8],[6,1,6,22],[20,2,25,2],[27,2,32,2],[19,1,19,22],[26,1,26,22],[11,2,12,2],[11,3,11,6],[11,7,11,8],[11,18,11,19],[13,2,18,2]]}
{"$rows_empty":8}
[null,"PLANILHA RESUMO - MATERIAIS ASFÁLTICOS"]
[]
[]
[null,"DATA-BASE","PRODUTOS","LOCALIDADES",null,null,null,"CUSTO ANP (R$/Kg)",null,"CUSTO ANP","IMPOSTOS DO PRODUTO","CUSTO DO PRODUTO COM IMPOSTOS","DMT's","DMT's","CUSTO DO TRANSPORTE TOTAL","ICMS","ATUALIZAÇÃO DO CUSTO DE TRANSPORTE","CUSTO DO TRANSPORTE RODOVIA PAVIMENTADA COM IMPOSTOS E ATUALIZAÇÃO MONETÁRIA","PEDÁGIO ",null,"TOTAL TRANSPORTE","TOTAL PRODUTO","TOTAL GERAL"]
[null,{"$f":"CAP!H9","v":"2024-12-01"},null,"REFINARIAS","ENDEREÇO","ORIGEM - REFINARIAS / DISTRIBUIDORAS","DESTINO","ESTADO","REGIÃO","R$/t","R$/t","R$/t","KM","KM","R$/t","R$/t","R$/t","R$/t","CUSTO POR EIXO","R$/t","R$/t","R$/t","R$/t"]
[null,1,"CAP 50/70","Refinaria Abreu e Lima","Rodovia PE 60, Km 10 - Ipojuca - PE CEP:55590-000",{"$f":"VLOOKUP($W14,CAP!$B:$AA,7,FALSE)","v":"BETIM - MG"},{"$f":"VLOOKUP($W14,CAP!$B:$AA,8,FALSE)","v":"Conceição do Mato Dentro - MG"},{"$f":"VLOOKUP($W14,CAP!$B:$AA,9,FALSE)","v":3.697444009466079},{"$f":"VLOOKUP($W14,CAP!$B:$AA,10,FALSE)","v":3.64899976895637},{"$f":"VLOOKUP($W14,CAP!$B:$AA,11,FALSE)","v":3697.444009466079},{"$f":"VLOOKUP($W14,CAP!$B:$AA,12,FALSE)","v":1021.69},{"$f":"VLOOKUP($W14,CAP!$B:$AA,13,FALSE)","v":4719.1340094660791},{"$f":"VLOOKUP($W14,CAP!$B$13:$AA$25,14,FALSE)","v":431},{"$f":"VLOOKUP($W14,'[2]Transporte Cap 50-70'!$B:$AA,15,FALSE)","v":{"$error":"#N/A"}},{"$f":"VLOOKUP($W14,CAP!$B:$AA,18,FALSE)","v":135.97999999999999},{"$f":"VLOOKUP($W14,CAP!$B:$AA,19,FALSE)","v":29.84},{"$f":"VLOOKUP($W14,CAP!$B:$AA,20,FALSE)","v":192.11},{"$f":"VLOOKUP($W14,CAP!$B:$AA,21,FALSE)","v":357.93},{"$f":"VLOOKUP($W14,CAP!$B:$AA,22,FALSE)","v":0},{"$f":"VLOOKUP($W14,CAP!$B:$AA,23,FALSE)","v":0},{"$f":"VLOOKUP($W14,CAP!$B:$AA,24,FALSE)","v":357.93},{"$f":"VLOOKUP($W14,CAP!$B:$AA,25,FALSE)","v":4719.1340094660791},{"$f":"SMALL(CAP!$AA$13:$AA$25,1)","v":5077.0640094660794}]
[null,2,null,"Refinaria Potiguar Clara Camarão","Rodovia RN 221, KM 25 - Guamaré - RN CEP:59598-000",{"$f":"VLOOKUP($W15,CAP!$B:$AA,7,FALSE)","v":"DUQUE DE CAXIAS - RJ"},{"$f":"VLOOKUP($W15,CAP!$B:$AA,8,FALSE)","v":"Conceição do Mato Dentro - MG"},{"$f":"VLOOKUP($W15,CAP!$B:$AA,9,FALSE)","v":3.5081465627081125},{"$f":"VLOOKUP($W15,CAP!$B:$AA,10,FALSE)","v":3.64899976895637},{"$f":"VLOOKUP($W15,CAP!$B:$AA,11,FALSE)","v":3508.1465627081125},{"$f":"VLOOKUP($W15,CAP!$B:$AA,12,FALSE)","v":969.39},{"$f":"VLOOKUP($W15,CAP!$B:$AA,13,FALSE)","v":4477.5365627081128},{"$f":"VLOOKUP($W15,CAP!$B$13:$AA$25,14,FALSE)","v":827},{"$f":"VLOOKUP($W15,'[2]Transporte Cap 50-70'!$B:$AA,15,FALSE)","v":{"$error":"#N/A"}},{"$f":"VLOOKUP($W15,CAP!$B:$AA,18,FALSE)","v":236.17},{"$f":"VLOOKUP($W15,CAP!$B:$AA,19,FALSE)","v":51.84},{"$f":"VLOOKUP($W15,CAP!$B:$AA,20,FALSE)","v":333.68},{"$f":"VLOOKUP($W15,CAP!$B:$AA,21,FALSE)","v":621.69000000000005},{"$f":"VLOOKUP($W15,CAP!$B:$AA,22,FALSE)","v":374.4},{"$f":"VLOOKUP($W15,CAP!$B:$AA,23,FALSE)","v":40.475675675675667},{"$f":"VLOOKUP($W15,CAP!$B:$AA,24,FALSE)","v":662.16567567567574},{"$f":"VLOOKUP($W15,CAP!$B:$AA,25,FALSE)","v":4477.5365627081128},{"$f":"SMALL(CAP!$AA$13:$AA$25,2)","v":5139.7022383837884}]
[null,3,null,"Complexo Petroquímico do Rio de Janeiro (Comperj)","Rodovia Estadual RJ-116 - Km 5,2 - Acesso A-1, s/n, Complemento Sambaetiba - Zona Urbana do 4º Distrito de Itaboraí - RJ CEP:24841-203",{"$f":"VLOOKUP($W16,CAP!$B:$AA,7,FALSE)","v":"SÃO JOSÉ DOS CAMPOS - SP"},{"$f":"VLOOKUP($W16,CAP!$B:$AA,8,FALSE)","v":"Conceição do Mato Dentro - MG"},{"$f":"VLOOKUP($W16,CAP!$B:$AA,9,FALSE)","v":3.6434155310820451},{"$f":"VLOOKUP($W16,CAP!$B:$AA,10,FALSE)","v":3.64899976895637},{"$f":"VLOOKUP($W16,CAP!$B:$AA,11,FALSE)","v":3643.4155310820452},{"$f":"VLOOKUP($W16,CAP!$B:$AA,12,FALSE)","v":1006.76},{"$f":"VLOOKUP($W16,CAP!$B:$AA,13,FALSE)","v":4650.1755310820454},{"$f":"VLOOKUP($W16,CAP!$B$13:$AA$25,14,FALSE)","v":953},{"$f":"VLOOKUP($W16,'[2]Transporte Cap 50-70'!$B:$AA,15,FALSE)","v":{"$error":"#N/A"}},{"$f":"VLOOKUP($W16,CAP!$B:$AA,18,FALSE)","v":268.05},{"$f":"VLOOKUP($W16,CAP!$B:$AA,19,FALSE)","v":58.84},{"$f":"VLOOKUP($W16,CAP!$B:$AA,20,FALSE)","v":378.73},{"$f":"VLOOKUP($W16,CAP!$B:$AA,21,FALSE)","v":705.62},{"$f":"VLOOKUP($W16,CAP!$B:$AA,22,FALSE)","v":197.4},{"$f":"VLOOKUP($W16,CAP!$B:$AA,23,FALSE)","v":21.340540540540538},{"$f":"VLOOKUP($W16,CAP!$B:$AA,24,FALSE)","v":726.96054054054059},{"$f":"VLOOKUP($W16,CAP!$B:$AA,25,FALSE)","v":4650.1755310820454},{"$f":"SMALL(CAP!$AA$13:$AA$25,3)","v":5377.1360716225863}]
[null,4,null,null,null,{"$f":"VLOOKUP($W17,CAP!$B:$AA,7,FALSE)","v":"MAUÁ - SP"},{"$f":"VLOOKUP($W17,CAP!$B:$AA,8,FALSE)","v":"Conceição do Mato Dentro - MG"},{"$f":"VLOOKUP($W17,CAP!$B:$AA,9,FALSE)","v":3.6434155310820451},{"$f":"VLOOKUP($W17,CAP!$B:$AA,10,FALSE)","v":3.64899976895637},{"$f":"VLOOKUP($W17,CAP!$B:$AA,11,FALSE)","v":3643.4155310820452},{"$f":"VLOOKUP($W17,CAP!$B:$AA,12,FALSE)","v":1006.76},{"$f":"VLOOKUP($W17,CAP!$B:$AA,13,FALSE)","v":4650.1755310820454},{"$f":"VLOOKUP($W17,CAP!$B$13:$AA$25,14,FALSE)","v":1002},{"$f":"VLOOKUP($W17,'[2]Transporte Cap 50-70'!$B:$AA,15,FALSE)","v":{"$error":"#N/A"}},{"$f":"VLOOKUP($W17,CAP!$B:$AA,18,FALSE)","v":280.45},{"$f":"VLOOKUP($W17,CAP!$B:$AA,19,FALSE)","v":61.56},{"$f":"VLOOKUP($W17,CAP!$B:$AA,20,FALSE)","v":396.25},{"$f":"VLOOKUP($W17,CAP!$B:$AA,21,FALSE)","v":738.26},{"$f":"VLOOKUP($W17,CAP!$B:$AA,22,FALSE)","v":139.19999999999999},{"$f":"VLOOKUP($W17,CAP!$B:$AA,23,FALSE)","v":15.048648648648644},{"$f":"VLOOKUP($W17,CAP!$B:$AA,24,FALSE)","v":753.30864864864861},{"$f":"VLOOKUP($W17,CAP!$B:$AA,25,FALSE)","v":4650.1755310820454},{"$f":"SMALL(CAP!$AA$13:$AA$25,4)","v":5403.4841797306944}]
[null,5,null,null,null,{"$f":"VLOOKUP($W18,CAP!$B:$AA,7,FALSE)","v":"CUBATÃO - SP"},{"$f":"VLOOKUP($W18,CAP!$B:$AA,8,FALSE)","v":"Conceição do Mato Dentro - MG"},{"$f":"VLOOKUP($W18,CAP!$B:$AA,9,FALSE)","v":3.6434155310820451},{"$f":"VLOOKUP($W18,CAP!$B:$AA,10,FALSE)","v":3.64899976895637},{"$f":"VLOOKUP($W18,CAP!$B:$AA,11,FALSE)","v":3643.4155310820452},{"$f":"VLOOKUP($W18,CAP!$B:$AA,12,FALSE)","v":1006.76},{"$f":"VLOOKUP($W18,CAP!$B:$AA,13,FALSE)","v":4650.1755310820454},{"$f":"VLOOKUP($W18,CAP!$B$13:$AA$25,14,FALSE)","v":1041},{"$f":"VLOOKUP($W18,'[2]Transporte Cap 50-70'!$B:$AA,15,FALSE)","v":{"$error":"#N/A"}},{"$f":"VLOOKUP($W18,CAP!$B:$AA,18,FALSE)","v":290.31},{"$f":"VLOOKUP($W18,CAP!$B:$AA,19,FALSE)","v":63.72},{"$f":"VLOOKUP($W18,CAP!$B:$AA,20,FALSE)","v":410.17},{"$f":"VLOOKUP($W18,CAP!$B:$AA,21,FALSE)","v":764.2},{"$f":"VLOOKUP($W18,CAP!$B:$AA,22,FALSE)","v":139.19999999999999},{"$f":"VLOOKUP($W18,CAP!$B:$AA,23,FALSE)","v":15.048648648648644},{"$f":"VLOOKUP($W18,CAP!$B:$AA,24,FALSE)","v":779.24864864864867},{"$f":"VLOOKUP($W18,CAP!$B:$AA,25,FALSE)","v":4650.1755310820454},{"$f":"SMALL(CAP!$AA$13:$AA$25,5)","v":5429.424179730694}]
[null,6,null,null,null,{"$f":"VLOOKUP($W19,CAP!$B:$AA,7,FALSE)","v":"PAULÍNIA - SP"},{"$f":"VLOOKUP($W19,CAP!$B:$AA,8,FALSE)","v":"Conceição do Mato Dentro - MG"},{"$f":"VLOOKUP($W19,CAP!$B:$AA,9,FALSE)","v":3.6434155310820451},{"$f":"VLOOKUP($W19,CAP!$B:$AA,10,FALSE)","v":3.64899976895637},{"$f":"VLOOKUP($W19,CAP!$B:$AA,11,FALSE)","v":3643.4155310820452},{"$f":"VLOOKUP($W19,CAP!$B:$AA,12,FALSE)","v":1006.76},{"$f":"VLOOKUP($W19,CAP!$B:$AA,13,FALSE)","v":4650.1755310820454},{"$f":"VLOOKUP($W19,CAP!$B$13:$AA$25,14,FALSE)","v":1021},{"$f":"VLOOKUP($W19,'[2]Transporte Cap 50-70'!$B:$AA,15,FALSE)","v":{"$error":"#N/A"}},{"$f":"VLOOKUP($W19,CAP!$B:$AA,18,FALSE)","v":285.25},{"$f":"VLOOKUP($W19,CAP!$B:$AA,19,FALSE)","v":62.61},{"$f":"VLOOKUP($W19,CAP!$B:$AA,20,FALSE)","v":403.03},{"$f":"VLOOKUP($W19,CAP!$B:$AA,21,FALSE)","v":750.89},{"$f":"VLOOKUP($W19,CAP!$B:$AA,22,FALSE)","v":266.39999999999998},{"$f":"VLOOKUP($W19,CAP!$B:$AA,23,FALSE)","v":28.799999999999994},{"$f":"VLOOKUP($W19,CAP!$B:$AA,24,FALSE)","v":779.68999999999994},{"$f":"VLOOKUP($W19,CAP!$B:$AA,25,FALSE)","v":4650.1755310820454},{"$f":"SMALL(CAP!$AA$13:$AA$25,6)","v":5429.865531082045}]
[]
[null,1,"EMULSÃO ASFÁLTICA PARA IMPRIMAÇÃO (EAI)","Refinaria Abreu e Lima","Rodovia PE 60, Km 10 - Ipojuca - PE CEP:55590-000",{"$f":"VLOOKUP($W21,EAI!$B$13:$AA$24,7,FALSE)","v":"BETIM - MG"},{"$f":"VLOOKUP($W21,EAI!$B$13:$AA$24,8,FALSE)","v":"Serro - MG"},{"$f":"VLOOKUP($W21,EAI!$B$13:$AA$24,9,FALSE)","v":"-"},{"$f":"VLOOKUP($W21,EAI!$B$13:$AA$24,10,FALSE)","v":2.5664918076204954},{"$f":"VLOOKUP($W21,EAI!$B$13:$AA$24,11,FALSE)","v":2566.4918076204954},{"$f":"VLOOKUP($W21,EAI!$B$13:$AA$24,12,FALSE)","v":709.18},{"$f":"VLOOKUP($W21,EAI!$B$13:$AA$24,13,FALSE)","v":3275.6718076204952},{"$f":"VLOOKUP($W21,EAI!$B$13:$AA$24,14,FALSE)","v":183},{"$f":"VLOOKUP($W21,'[2]Transporte CM-30'!$B$13:$AA$25,15,FALSE)","v":{"$error":"#N/A"}},{"$f":"VLOOKUP($W21,EAI!$B$13:$AA$24,18,FALSE)","v":73.239999999999995},{"$f":"VLOOKUP($W21,EAI!$B$13:$AA$24,19,FALSE)","v":16.07},{"$f":"VLOOKUP($W21,EAI!$B$13:$AA$24,20,FALSE)","v":103.47},{"$f":"VLOOKUP($W21,EAI!$B$13:$AA$24,21,FALSE)","v":192.78},{"$f":"VLOOKUP($W21,EAI!$B$13:$AA$24,22,FALSE)","v":0},{"$f":"VLOOKUP($W21,EAI!$B$13:$AA$24,23,FALSE)","v":0},{"$f":"VLOOKUP($W21,EAI!$B$13:$AA$24,24,FALSE)","v":192.78},{"$f":"VLOOKUP($W21,EAI!$B:$AA,25,FALSE)","v":3275.6718076204952},{"$f":"SMALL(EAI!$AA$13:$AA$24,1)","v":3468.4518076204954}]
[null,2,null,"Refinaria Potiguar Clara Camarão","Rodovia RN 221, KM 25 - Guamaré - RN CEP:59598-000",{"$f":"VLOOKUP($W22,EAI!$B$13:$AA$24,7,FALSE)","v":"DUQUE DE CAXIAS - RJ"},{"$f":"VLOOKUP($W22,EAI!$B$13:$AA$24,8,FALSE)","v":"Serro - MG"},{"$f":"VLOOKUP($W22,EAI!$B$13:$AA$24,9,FALSE)","v":"-"},{"$f":"VLOOKUP($W22,EAI!$B$13:$AA$24,10,FALSE)","v":2.5664918076204954},{"$f":"VLOOKUP($W22,EAI!$B$13:$AA$24,11,FALSE)","v":2566.4918076204954},{"$f":"VLOOKUP($W22,EAI!$B$13:$AA$24,12,FALSE)","v":709.18},{"$f":"VLOOKUP($W22,EAI!$B$13:$AA$24,13,FALSE)","v":3275.6718076204952},{"$f":"VLOOKUP($W22,EAI!$B$13:$AA$24,14,FALSE)","v":587},{"$f":"VLOOKUP($W22,'[2]Transporte CM-30'!$B$13:$AA$25,15,FALSE)","v":{"$error":"#N/A"}},{"$f":"VLOOKUP($W22,EAI!$B$13:$AA$24,18,FALSE)","v":175.45},{"$f":"VLOOKUP($W22,EAI!$B$13:$AA$24,19,FALSE)","v":38.51},{"$f":"VLOOKUP($W22,EAI!$B$13:$AA$24,20,FALSE)","v":247.89},{"$f":"VLOOKUP($W22,EAI!$B$13:$AA$24,21,FALSE)","v":461.84999999999997},{"$f":"VLOOKUP($W22,EAI!$B$13:$AA$24,22,FALSE)","v":374.4},{"$f":"VLOOKUP($W22,EAI!$B$13:$AA$24,23,FALSE)","v":74.850059976009589},{"$f":"VLOOKUP($W22,EAI!$B$13:$AA$24,24,FALSE)","v":536.70005997600958},{"$f":"VLOOKUP($W22,EAI!$B:$AA,25,FALSE)","v":3275.6718076204952},{"$f":"SMALL(EAI!$AA$13:$AA$24,2)","v":3812.3718675965047}]
[null,3,null,"Complexo Petroquímico do Rio de Janeiro (Comperj)","Rodovia Estadual RJ-116 - Km 5,2 - Acesso A-1, s/n, Complemento Sambaetiba - Zona Urbana do 4º Distrito de Itaboraí - RJ CEP:24841-203",{"$f":"VLOOKUP($W23,EAI!$B$13:$AA$24,7,FALSE)","v":"MAUÁ - SP"},{"$f":"VLOOKUP($W23,EAI!$B$13:$AA$24,8,FALSE)","v":"Serro - MG"},{"$f":"VLOOKUP($W23,EAI!$B$13:$AA$24,9,FALSE)","v":2.7498271212823746},{"$f":"VLOOKUP($W23,EAI!$B$13:$AA$24,10,FALSE)","v":2.5664918076204954},{"$f":"VLOOKUP($W23,EAI!$B$13:$AA$24,11,FALSE)","v":2749.8271212823747},{"$f":"VLOOKUP($W23,EAI!$B$13:$AA$24,12,FALSE)","v":759.84},{"$f":"VLOOKUP($W23,EAI!$B$13:$AA$24,13,FALSE)","v":3509.6671212823749},{"$f":"VLOOKUP($W23,EAI!$B$13:$AA$24,14,FALSE)","v":766},{"$f":"VLOOKUP($W23,'[2]Transporte CM-30'!$B$13:$AA$25,15,FALSE)","v":{"$error":"#N/A"}},{"$f":"VLOOKUP($W23,EAI!$B$13:$AA$24,18,FALSE)","v":220.74},{"$f":"VLOOKUP($W23,EAI!$B$13:$AA$24,19,FALSE)","v":48.45},{"$f":"VLOOKUP($W23,EAI!$B$13:$AA$24,20,FALSE)","v":311.88},{"$f":"VLOOKUP($W23,EAI!$B$13:$AA$24,21,FALSE)","v":581.06999999999994},{"$f":"VLOOKUP($W23,EAI!$B$13:$AA$24,22,FALSE)","v":139.19999999999999},{"$f":"VLOOKUP($W23,EAI!$B$13:$AA$24,23,FALSE)","v":27.828868452618952},{"$f":"VLOOKUP($W23,EAI!$B$13:$AA$24,24,FALSE)","v":608.8988684526189},{"$f":"VLOOKUP($W23,EAI!$B:$AA,25,FALSE)","v":3509.6671212823749},{"$f":"SMALL(EAI!$AA$13:$AA$24,3)","v":4118.5659897349942}]
[null,4,null,null,null,{"$f":"VLOOKUP($W24,EAI!$B$13:$AA$24,7,FALSE)","v":"PAULÍNIA - SP"},{"$f":"VLOOKUP($W24,EAI!$B$13:$AA$24,8,FALSE)","v":"Serro - MG"},{"$f":"VLOOKUP($W24,EAI!$B$13:$AA$24,9,FALSE)","v":2.7498271212823746},{"$f":"VLOOKUP($W24,EAI!$B$13:$AA$24,10,FALSE)","v":2.5664918076204954},{"$f":"VLOOKUP($W24,EAI!$B$13:$AA$24,11,FALSE)","v":2749.8271212823747},{"$f":"VLOOKUP($W24,EAI!$B$13:$AA$24,12,FALSE)","v":759.84},{"$f":"VLOOKUP($W24,EAI!$B$13:$AA$24,13,FALSE)","v":3509.6671212823749},{"$f":"VLOOKUP($W24,EAI!$B$13:$AA$24,14,FALSE)","v":764},{"$f":"VLOOKUP($W24,'[2]Transporte CM-30'!$B$13:$AA$25,15,FALSE)","v":{"$error":"#N/A"}},{"$f":"VLOOKUP($W24,EAI!$B$13:$AA$24,18,FALSE)","v":220.23},{"$f":"VLOOKUP($W24,EAI!$B$13:$AA$24,19,FALSE)","v":48.34},{"$f":"VLOOKUP($W24,EAI!$B$13:$AA$24,20,FALSE)","v":311.16000000000003},{"$f":"VLOOKUP($W24,EAI!$B$13:$AA$24,21,FALSE)","v":579.73},{"$f":"VLOOKUP($W24,EAI!$B$13:$AA$24,22,FALSE)","v":266.39999999999998},{"$f":"VLOOKUP($W24,EAI!$B$13:$AA$24,23,FALSE)","v":53.258696521391443},{"$f":"VLOOKUP($W24,EAI!$B$13:$AA$24,24,FALSE)","v":632.98869652139149},{"$f":"VLOOKUP($W24,EAI!$B:$AA,25,FALSE)","v":3509.6671212823749},{"$f":"SMALL(EAI!$AA$13:$AA$24,4)","v":4142.6558178037667}]
[null,5,null,null,null,{"$f":"VLOOKUP($W25,EAI!$B$13:$AA$24,7,FALSE)","v":"CUBATÃO - SP"},{"$f":"VLOOKUP($W25,EAI!$B$13:$AA$24,8,FALSE)","v":"Serro - MG"},{"$f":"VLOOKUP($W25,EAI!$B$13:$AA$24,9,FALSE)","v":2.7498271212823746},{"$f":"VLOOKUP($W25,EAI!$B$13:$AA$24,10,FALSE)","v":2.5664918076204954},{"$f":"VLOOKUP($W25,EAI!$B$13:$AA$24,11,FALSE)","v":2749.8271212823747},{"$f":"VLOOKUP($W25,EAI!$B$13:$AA$24,12,FALSE)","v":759.84},{"$f":"VLOOKUP($W25,EAI!$B$13:$AA$24,13,FALSE)","v":3509.6671212823749},{"$f":"VLOOKUP($W25,EAI!$B$13:$AA$24,14,FALSE)","v":803},{"$f":"VLOOKUP($W25,'[2]Transporte CM-30'!$B$13:$AA$25,15,FALSE)","v":{"$error":"#N/A"}},{"$f":"VLOOKUP($W25,EAI!$B$13:$AA$24,18,FALSE)","v":230.1},{"$f":"VLOOKUP($W25,EAI!$B$13:$AA$24,19,FALSE)","v":50.5},{"$f":"VLOOKUP($W25,EAI!$B$13:$AA$24,20,FALSE)","v":325.10000000000002},{"$f":"VLOOKUP($W25,EAI!$B$13:$AA$24,21,FALSE)","v":605.70000000000005},{"$f":"VLOOKUP($W25,EAI!$B$13:$AA$24,22,FALSE)","v":139.19999999999999},{"$f":"VLOOKUP($W25,EAI!$B$13:$AA$24,23,FALSE)","v":27.828868452618952},{"$f":"VLOOKUP($W25,EAI!$B$13:$AA$24,24,FALSE)","v":633.52886845261901},{"$f":"VLOOKUP($W25,EAI!$B:$AA,25,FALSE)","v":3509.6671212823749},{"$f":"SMALL(EAI!$AA$13:$AA$24,5)","v":4143.1959897349934}]
[null,6,null,null,null,{"$f":"VLOOKUP($W26,EAI!$B$13:$AA$24,7,FALSE)","v":"SÃO FRANCISCO DO CONDE - BA"},{"$f":"VLOOKUP($W26,EAI!$B$13:$AA$24,8,FALSE)","v":"Serro - MG"},{"$f":"VLOOKUP($W26,EAI!$B$13:$AA$24,9,FALSE)","v":"-"},{"$f":"VLOOKUP($W26,EAI!$B$13:$AA$24,10,FALSE)","v":2.6664351178237875},{"$f":"VLOOKUP($W26,EAI!$B$13:$AA$24,11,FALSE)","v":2666.4351178237876},{"$f":"VLOOKUP($W26,EAI!$B$13:$AA$24,12,FALSE)","v":736.8},{"$f":"VLOOKUP($W26,EAI!$B$13:$AA$24,13,FALSE)","v":3403.2351178237877},{"$f":"VLOOKUP($W26,EAI!$B$13:$AA$24,14,FALSE)","v":1227},{"$f":"VLOOKUP($W26,'[2]Transporte CM-30'!$B$13:$AA$25,15,FALSE)","v":{"$error":"#N/A"}},{"$f":"VLOOKUP($W26,EAI!$B$13:$AA$24,18,FALSE)","v":337.37},{"$f":"VLOOKUP($W26,EAI!$B$13:$AA$24,19,FALSE)","v":74.05},{"$f":"VLOOKUP($W26,EAI!$B$13:$AA$24,20,FALSE)","v":476.67},{"$f":"VLOOKUP($W26,EAI!$B$13:$AA$24,21,FALSE)","v":888.09},{"$f":"VLOOKUP($W26,EAI!$B$13:$AA$24,22,FALSE)","v":204},{"$f":"VLOOKUP($W26,EAI!$B$13:$AA$24,23,FALSE)","v":40.783686525389847},{"$f":"VLOOKUP($W26,EAI!$B$13:$AA$24,24,FALSE)","v":928.87368652538987},{"$f":"VLOOKUP($W26,EAI!$B:$AA,25,FALSE)","v":3403.2351178237877},{"$f":"SMALL(EAI!$AA$13:$AA$24,6)","v":4332.1088043491773}]
[]
[null,1,"RR1-C","Refinaria Abreu e Lima","Rodovia PE 60, Km 10 - Ipojuca - PE CEP:55590-000",{"$f":"VLOOKUP($W28,'RR-1C'!$B:$AA,7,FALSE)","v":"SARZEDO - MG"},{"$f":"VLOOKUP($W28,'RR-1C'!$B:$AA,8,FALSE)","v":"Serro - MG"},{"$f":"VLOOKUP($W28,'RR-1C'!$B:$AA,9,FALSE)","v":2.7250163919228432},{"$f":"VLOOKUP($W28,'RR-1C'!$B:$AA,10,FALSE)","v":2.7734975034562561},{"$f":"VLOOKUP($W28,'RR-1C'!$B:$AA,11,FALSE)","v":2725.016391922843},{"$f":"VLOOKUP($W28,'RR-1C'!$B:$AA,12,FALSE)","v":752.99},{"$f":"VLOOKUP($W28,'RR-1C'!$B:$AA,13,FALSE)","v":3478.0063919228432},{"$f":"VLOOKUP($W28,'RR-1C'!$B:$AA,14,FALSE)","v":256},{"$f":"VLOOKUP($W28,'[2]Transporte RR-1C'!$B:$AA,15,FALSE)","v":{"$error":"#N/A"}},{"$f":"VLOOKUP($W28,'RR-1C'!$B:$AA,18,FALSE)","v":91.71},{"$f":"VLOOKUP($W28,'RR-1C'!$B:$AA,19,FALSE)","v":20.13},{"$f":"VLOOKUP($W28,'RR-1C'!$B:$AA,20,FALSE)","v":129.57},{"$f":"VLOOKUP($W28,'RR-1C'!$B:$AA,21,FALSE)","v":241.40999999999997},{"$f":"VLOOKUP($W28,'RR-1C'!$B:$AA,22,FALSE)","v":0},{"$f":"VLOOKUP($W28,'RR-1C'!$B:$AA,23,FALSE)","v":0},{"$f":"VLOOKUP($W28,'RR-1C'!$B:$AA,24,FALSE)","v":241.40999999999997},{"$f":"VLOOKUP($W28,'RR-1C'!$B:$AA,25,FALSE)","v":3478.0063919228432},{"$f":"SMALL('RR-1C'!$AA$13:$AA$27,1)","v":3719.4163919228431}]
[null,2,null,"Refinaria Potiguar Clara Camarão","Rodovia RN 221, KM 25 - Guamaré - RN CEP:59598-000",{"$f":"VLOOKUP($W29,'RR-1C'!$B:$AA,7,FALSE)","v":"UBERLANDIA - MG"},{"$f":"VLOOKUP($W29,'RR-1C'!$B:$AA,8,FALSE)","v":"Serro - MG"},{"$f":"VLOOKUP($W29,'RR-1C'!$B:$AA,9,FALSE)","v":2.7250163919228432},{"$f":"VLOOKUP($W29,'RR-1C'!$B:$AA,10,FALSE)","v":2.7734975034562561},{"$f":"VLOOKUP($W29,'RR-1C'!$B:$AA,11,FALSE)","v":2725.016391922843},{"$f":"VLOOKUP($W29,'RR-1C'!$B:$AA,12,FALSE)","v":752.99},{"$f":"VLOOKUP($W29,'RR-1C'!$B:$AA,13,FALSE)","v":3478.0063919228432},{"$f":"VLOOKUP($W29,'RR-1C'!$B:$AA,14,FALSE)","v":687},{"$f":"VLOOKUP($W29,'[2]Transporte RR-1C'!$B:$AA,15,FALSE)","v":{"$error":"#N/A"}},{"$f":"VLOOKUP($W29,'RR-1C'!$B:$AA,18,FALSE)","v":200.75},{"$f":"VLOOKUP($W29,'RR-1C'!$B:$AA,19,FALSE)","v":44.06},{"$f":"VLOOKUP($W29,'RR-1C'!$B:$AA,20,FALSE)","v":283.63},{"$f":"VLOOKUP($W29,'RR-1C'!$B:$AA,21,FALSE)","v":528.44000000000005},{"$f":"VLOOKUP($W29,'RR-1C'!$B:$AA,22,FALSE)","v":228},{"$f":"VLOOKUP($W29,'RR-1C'!$B:$AA,23,FALSE)","v":130.28578607584129},{"$f":"VLOOKUP($W29,'RR-1C'!$B:$AA,24,FALSE)","v":658.72578607584137},{"$f":"VLOOKUP($W29,'RR-1C'!$B:$AA,25,FALSE)","v":3478.0063919228432},{"$f":"SMALL('RR-1C'!$AA$13:$AA$27,2)","v":4136.7321779986851}]
[null,3,null,"Complexo Petroquímico do Rio de Janeiro (Comperj)","Rodovia Estadual RJ-116 - Km 5,2 - Acesso A-1, s/n, Complemento Sambaetiba - Zona Urbana do 4º Distrito de Itaboraí - RJ CEP:24841-203",{"$f":"VLOOKUP($W30,'RR-1C'!$B:$AA,7,FALSE)","v":"DUQUE DE CAXIAS - RJ"},{"$f":"VLOOKUP($W30,'RR-1C'!$B:$AA,8,FALSE)","v":"Serro - MG"},{"$f":"VLOOKUP($W30,'RR-1C'!$B:$AA,9,FALSE)","v":"-"},{"$f":"VLOOKUP($W30,'RR-1C'!$B:$AA,10,FALSE)","v":2.7734975034562561},{"$f":"VLOOKUP($W30,'RR-1C'!$B:$AA,11,FALSE)","v":2773.4975034562563},{"$f":"VLOOKUP($W30,'RR-1C'!$B:$AA,12,FALSE)","v":766.38},{"$f":"VLOOKUP($W30,'RR-1C'!$B:$AA,13,FALSE)","v":3539.8775034562564},{"$f":"VLOOKUP($W30,'RR-1C'!$B:$AA,14,FALSE)","v":587},{"$f":"VLOOKUP($W30,'[2]Transporte RR-1C'!$B:$AA,15,FALSE)","v":{"$error":"#N/A"}},{"$f":"VLOOKUP($W30,'RR-1C'!$B:$AA,18,FALSE)","v":175.45},{"$f":"VLOOKUP($W30,'RR-1C'!$B:$AA,19,FALSE)","v":38.51},{"$f":"VLOOKUP($W30,'RR-1C'!$B:$AA,20,FALSE)","v":247.89},{"$f":"VLOOKUP($W30,'RR-1C'!$B:$AA,21,FALSE)","v":461.84999999999997},{"$f":"VLOOKUP($W30,'RR-1C'!$B:$AA,22,FALSE)","v":374.4},{"$f":"VLOOKUP($W30,'RR-1C'!$B:$AA,23,FALSE)","v":213.94297502980251},{"$f":"VLOOKUP($W30,'RR-1C'!$B:$AA,24,FALSE)","v":675.79297502980251},{"$f":"VLOOKUP($W30,'RR-1C'!$B:$AA,25,FALSE)","v":3539.8775034562564},{"$f":"SMALL('RR-1C'!$AA$13:$AA$27,3)","v":4215.6704784860585}]
[null,4,null,"Refinaria Abreu e Lima","Rodovia PE 60, Km 10 - Ipojuca - PE CEP:55590-000",{"$f":"VLOOKUP($W31,'RR-1C'!$B:$AA,7,FALSE)","v":"CAIEIRAS - SP"},{"$f":"VLOOKUP($W31,'RR-1C'!$B:$AA,8,FALSE)","v":"Serro - MG"},{"$f":"VLOOKUP($W31,'RR-1C'!$B:$AA,9,FALSE)","v":2.9298620737986507},{"$f":"VLOOKUP($W31,'RR-1C'!$B:$AA,10,FALSE)","v":2.7734975034562561},{"$f":"VLOOKUP($W31,'RR-1C'!$B:$AA,11,FALSE)","v":2929.8620737986507},{"$f":"VLOOKUP($W31,'RR-1C'!$B:$AA,12,FALSE)","v":809.59},{"$f":"VLOOKUP($W31,'RR-1C'!$B:$AA,13,FALSE)","v":3739.4520737986509},{"$f":"VLOOKUP($W31,'RR-1C'!$B:$AA,14,FALSE)","v":800},{"$f":"VLOOKUP($W31,'[2]Transporte RR-1C'!$B:$AA,15,FALSE)","v":{"$error":"#N/A"}},{"$f":"VLOOKUP($W31,'RR-1C'!$B:$AA,18,FALSE)","v":229.34},{"$f":"VLOOKUP($W31,'RR-1C'!$B:$AA,19,FALSE)","v":50.34},{"$f":"VLOOKUP($W31,'RR-1C'!$B:$AA,20,FALSE)","v":324.02999999999997},{"$f":"VLOOKUP($W31,'RR-1C'!$B:$AA,21,FALSE)","v":603.71},{"$f":"VLOOKUP($W31,'RR-1C'!$B:$AA,22,FALSE)","v":121.8},{"$f":"VLOOKUP($W31,'RR-1C'!$B:$AA,23,FALSE)","v":69.600038351041519},{"$f":"VLOOKUP($W31,'RR-1C'!$B:$AA,24,FALSE)","v":673.31003835104161},{"$f":"VLOOKUP($W31,'RR-1C'!$B:$AA,25,FALSE)","v":3739.4520737986509},{"$f":"SMALL('RR-1C'!$AA$13:$AA$27,4)","v":4412.7621121496923}]
[null,5,null,"Refinaria Potiguar Clara Camarão","Rodovia RN 221, KM 25 - Guamaré - RN CEP:59598-000",{"$f":"VLOOKUP($W32,'RR-1C'!$B:$AA,7,FALSE)","v":"CACAPAVA - SP"},{"$f":"VLOOKUP($W32,'RR-1C'!$B:$AA,8,FALSE)","v":"Serro - MG"},{"$f":"VLOOKUP($W32,'RR-1C'!$B:$AA,9,FALSE)","v":2.9298620737986507},{"$f":"VLOOKUP($W32,'RR-1C'!$B:$AA,10,FALSE)","v":2.7734975034562561},{"$f":"VLOOKUP($W32,'RR-1C'!$B:$AA,11,FALSE)","v":2929.8620737986507},{"$f":"VLOOKUP($W32,'RR-1C'!$B:$AA,12,FALSE)","v":809.59},{"$f":"VLOOKUP($W32,'RR-1C'!$B:$AA,13,FALSE)","v":3739.4520737986509},{"$f":"VLOOKUP($W32,'RR-1C'!$B:$AA,14,FALSE)","v":751},{"$f":"VLOOKUP($W32,'[2]Transporte RR-1C'!$B:$AA,15,FALSE)","v":{"$error":"#N/A"}},{"$f":"VLOOKUP($W32,'RR-1C'!$B:$AA,18,FALSE)","v":216.94},{"$f":"VLOOKUP($W32,'RR-1C'!$B:$AA,19,FALSE)","v":47.62},{"$f":"VLOOKUP($W32,'RR-1C'!$B:$AA,20,FALSE)","v":306.51},{"$f":"VLOOKUP($W32,'RR-1C'!$B:$AA,21,FALSE)","v":571.06999999999994},{"$f":"VLOOKUP($W32,'RR-1C'!$B:$AA,22,FALSE)","v":197.4},{"$f":"VLOOKUP($W32,'RR-1C'!$B:$AA,23,FALSE)","v":112.80006215513627},{"$f":"VLOOKUP($W32,'RR-1C'!$B:$AA,24,FALSE)","v":683.87006215513622},{"$f":"VLOOKUP($W32,'RR-1C'!$B:$AA,25,FALSE)","v":3739.4520737986509},{"$f":"SMALL('RR-1C'!$AA$13:$AA$27,5)","v":4423.3221359537874}]
[null,6,null,"Complexo Petroquímico do Rio de Janeiro (Comperj)","Rodovia Estadual RJ-116 - Km 5,2 - Acesso A-1, s/n, Complemento Sambaetiba - Zona Urbana do 4º Distrito de Itaboraí - RJ CEP:24841-203",{"$f":"VLOOKUP($W33,'RR-1C'!$B:$AA,7,FALSE)","v":"PAULINIA - SP"},{"$f":"VLOOKUP($W33,'RR-1C'!$B:$AA,8,FALSE)","v":"Serro - MG"},{"$f":"VLOOKUP($W33,'RR-1C'!$B:$AA,9,FALSE)","v":2.9298620737986507},{"$f":"VLOOKUP($W33,'RR-1C'!$B:$AA,10,FALSE)","v":2.7734975034562561},{"$f":"VLOOKUP($W33,'RR-1C'!$B:$AA,11,FALSE)","v":2929.8620737986507},{"$f":"VLOOKUP($W33,'RR-1C'!$B:$AA,12,FALSE)","v":809.59},{"$f":"VLOOKUP($W33,'RR-1C'!$B:$AA,13,FALSE)","v":3739.4520737986509},{"$f":"VLOOKUP($W33,'RR-1C'!$B:$AA,14,FALSE)","v":764},{"$f":"VLOOKUP($W33,'[2]Transporte RR-1C'!$B:$AA,15,FALSE)","v":{"$error":"#N/A"}},{"$f":"VLOOKUP($W33,'RR-1C'!$B:$AA,18,FALSE)","v":220.23},{"$f":"VLOOKUP($W33,'RR-1C'!$B:$AA,19,FALSE)","v":48.34},{"$f":"VLOOKUP($W33,'RR-1C'!$B:$AA,20,FALSE)","v":311.16000000000003},{"$f":"VLOOKUP($W33,'RR-1C'!$B:$AA,21,FALSE)","v":579.73},{"$f":"VLOOKUP($W33,'RR-1C'!$B:$AA,22,FALSE)","v":266.39999999999998},{"$f":"VLOOKUP($W33,'RR-1C'!$B:$AA,23,FALSE)","v":152.22865530966718},{"$f":"VLOOKUP($W33,'RR-1C'!$B:$AA,24,FALSE)","v":731.95865530966717},{"$f":"VLOOKUP($W33,'RR-1C'!$B:$AA,25,FALSE)","v":3739.4520737986509},{"$f":"SMALL('RR-1C'!$AA$13:$AA$27,6)","v":4471.4107291083183}]