{"text_format":"2","workbook":"xlsx","n_sheets":10,"sheets":["ORÇAMENTO","CPU-SERV","CPU-FORNEC","BDI SERV","BDI FORN","CRONOGRAMA","EAI","RR-1C","CAP","MAT.ASF"],"not_rendered":{"charts":0,"images":1,"macros":0,"external_links":2,"defined_names":12,"comments":5,"pivot_tables":0},"unopened":[],"bounds":{"document_bytes":16777216,"sheet_cells":100000,"run_cost":"one","rows_first":2000,"rows_last":500,"rows_between":2000,"halvings":0,"cell_chars":16384,"cell_head_chars":4096},"cells_cut":0,"cells_raw":0,"read":"whole","date_system":"1900"}

{"sheet":"ORÇAMENTO","index":0,"n_rows":69,"n_cols":12,"rows_kept":69,"cut":false,"hidden":false,"merged":[[0,0,8,0],[0,4,0,11],[1,4,1,11],[2,4,2,11],[6,1,6,4],[4,2,4,8],[4,9,4,10],[5,2,5,4],[6,8,6,10],[7,1,7,11],[5,8,5,10]]}
["<---- NUMERAR SERVIÇOS PARA CPU",null,null,null,"Ministério do Desenvolvimento Regional"]
[{"$nulls":4},"Companhia de Desenvolvimento dos Vales do São Francisco e do Parnaíba"]
[{"$nulls":4},"1ª Superintendência Regional"]
[]
[null,"OBRA: "," DRENAGEM E PAVIMENTAÇÃO - VIAS INTERNAS DO PARQUE DE EXPOSIÇÕES E RUA BOM JARDIM (BAIRRO SANTO ANTÔNIO) - SERRO-MG",{"$nulls":6},"BDI Serviços (%):",null,{"$f":"'BDI SERV'!E26","v":23.32}]
[null,"DATA:"," JANEIRO / 2025",{"$nulls":5},"BDI Diferenciado Serviços (%):",null,null,{"$f":"'BDI FORN'!D31","v":15}]
{"$rows_left_out":64}
{"sheet":"CPU-SERV","index":1,"n_rows":2019,"n_cols":11,"rows_kept":2019,"cut":false,"hidden":false,"merged":[[1855,0,1892,0],[1856,2,1856,9],[1857,1,1858,3],[1857,4,1857,5],[1858,4,1858,5],[1859,2,1859,7],[1859,8,1859,9],[1860,1,1861,2],[1860,3,1861,3],[1860,4,1860,5],[1860,6,1860,7],[1865,7,1865,9],[1868,3,1868,7],[1869,3,1869,7],[1870,3,1870,7],[1873,7,1873,9],[1876,3,1876,7],[1877,7,1877,9],[1880,3,1880,7],[1882,8,1882,9],[1885,3,1885,7],[1886,1,1887,2],[1886,3,1887,3],[1886,4,1887,4],[1886,5,1886,7],[1886,9,1887,9],[1890,3,1890,7],[1891,5,1891,7],[1813,0,1853,0],[1814,2,1814,9],[1815,1,1816,3],[1815,4,1815,5],[1816,4,1816,5],[1817,2,1817,7],[1817,8,1817,9],[1818,1,1819,2],[1818,3,1819,3],[1818,4,1818,5],[1818,6,1818,7],[1823,7,1823,9],[1826,3,1826,7],[1827,3,1827,7],[1828,3,1828,7],[1831,7,1831,9],[1837,3,1837,7],[1838,7,1838,9],[1841,3,1841,7],[1843,8,1843,9],[1846,3,1846,7],[1847,1,1848,2],[1847,3,1848,3],[1847,4,1848,4],[1847,5,1847,7],[1847,9,1848,9],[1851,3,1851,7],[1852,5,1852,7],[1774,0,1811,0],[1775,2,1775,9],[1776,1,1777,3],[1776,4,1776,5],[1777,4,1777,5],[1778,2,1778,7],[1778,8,1778,9],[1779,1,1780,2],[1779,3,1780,3],[1779,4,1779,5],[1779,6,1779,7],[1784,7,1784,9],[1787,3,1787,7],[1788,3,1788,7],[1789,3,1789,7],[1792,7,1792,9],[1795,3,1795,7],[1796,7,1796,9],[1799,3,1799,7],[1801,8,1801,9],[1804,3,1804,7],[1805,1,1806,2],[1805,3,1806,3],[1805,4,1806,4],[1805,5,1805,7],[1805,9,1806,9],[1809,3,1809,7],[1810,5,1810,7],[1735,0,1772,0],[1736,2,1736,9],[1737,1,1738,3],[1737,4,1737,5],[1738,4,1738,5],[1739,2,1739,7],[1739,8,1739,9],[1740,1,1741,2],[1740,3,1741,3],[1740,4,1740,5],[1740,6,1740,7],[1745,7,1745,9],[1748,3,1748,7],[1749,3,1749,7],[1750,3,1750,7],[1753,7,1753,9],[1756,3,1756,7],[1757,7,1757,9],[1760,3,1760,7],[1762,8,1762,9],[1765,3,1765,7],[1766,1,1767,2],[1766,3,1767,3],[1766,4,1767,4],[1766,5,1766,7],[1766,9,1767,9],[1770,3,1770,7],[1771,5,1771,7],[1696,0,1733,0],[1697,2,1697,9],[1698,1,1699,3],[1698,4,1698,5],[1699,4,1699,5],[1700,2,1700,7],[1700,8,1700,9],[1701,1,1702,2],[1701,3,1702,3],[1701,4,1701,5],[1701,6,1701,7],[1706,7,1706,9],[1709,3,1709,7],[1710,3,1710,7],[1711,3,1711,7],[1714,7,1714,9],[1717,3,1717,7],[1718,7,1718,9],[1721,3,1721,7],[1723,8,1723,9],[1726,3,1726,7],[1727,1,1728,2],[1727,3,1728,3],[1727,4,1728,4],[1727,5,1727,7],[1727,9,1728,9],[1731,3,1731,7],[1732,5,1732,7],[1642,0,1694,0],[1643,2,1643,9],[1644,1,1645,3],[1644,4,1644,5],[1645,4,1645,5],[1646,2,1646,7],[1646,8,1646,9],[1647,1,1648,2],[1647,3,1648,3],[1647,4,1647,5],[1647,6,1647,7],[1652,7,1652,9],[1655,3,1655,7],[1656,3,1656,7],[1657,3,1657,7],[1660,7,1660,9],[1668,3,1668,7],[1669,7,1669,9],[1672,3,1672,7],[1674,8,1674,9],[1682,3,1682,7],[1683,1,1684,2],[1683,3,1684,3],[1683,4,1684,4],[1683,5,1683,7],[1683,9,1684,9],[1692,3,1692,7],[1693,5,1693,7],[1592,0,1640,0],[1593,2,1593,9],[1594,1,1595,3],[1594,4,1594,5],[1595,4,1595,5],[1596,2,1596,7],[1596,8,1596,9],[1597,1,1598,2],[1597,3,1598,3],[1597,4,1597,5],[1597,6,1597,7],[1604,7,1604,9],[1607,3,1607,7],[1608,3,1608,7],[1609,3,1609,7],[1612,7,1612,9],[1618,3,1618,7],[1619,7,1619,9],[1622,3,1622,7],[1624,8,1624,9],[1630,3,1630,7],[1631,1,1632,2],[1631,3,1632,3],[1631,4,1632,4],[1631,5,1631,7],[1631,9,1632,9],[1638,3,1638,7],[1639,5,1639,7],[1553,0,1590,0],[1554,2,1554,9],[1555,1,1556,3],[1555,4,1555,5],[1556,4,1556,5],[1557,2,1557,7],[1557,8,1557,9],[1558,1,1559,2],[1558,3,1559,3],[1558,4,1558,5],[1558,6,1558,7],[1563,7,1563,9],[1566,3,1566,7],[1567,3,1567,7],[1568,3,1568,7],[1571,7,1571,9],[1574,3,1574,7],[1575,7,1575,9],[1578,3,1578,7],[1580,8,1580,9],[1583,3,1583,7],[1584,1,1585,2],[1584,3,1585,3],[1584,4,1585,4],[1584,5,1584,7],[1584,9,1585,9],[1588,3,1588,7],[1589,5,1589,7],[1511,0,1551,0],[1512,2,1512,9],[1513,1,1514,3],[1513,4,1513,5],[1514,4,1514,5],[1515,2,1515,7],[1515,8,1515,9],[1516,1,1517,2],[1516,3,1517,3],[1516,4,1516,5],[1516,6,1516,7],[1521,7,1521,9],[1525,3,1525,7],[1526,3,1526,7],[1527,3,1527,7],[1530,7,1530,9],[1534,3,1534,7],[1535,7,1535,9],[1539,3,1539,7],[1541,8,1541,9],[1544,3,1544,7],[1545,1,1546,2],[1545,3,1546,3],[1545,4,1546,4],[1545,5,1545,7],[1545,9,1546,9],[1549,3,1549,7],[1550,5,1550,7],[1472,0,1509,0],[1473,2,1473,9],[1474,1,1475,3],[1474,4,1474,5],[1475,4,1475,5],[1476,2,1476,7],[1476,8,1476,9],[1477,1,1478,2],[1477,3,1478,3],[1477,4,1477,5],[1477,6,1477,7],[1482,7,1482,9],[1485,3,1485,7],[1486,3,1486,7],[1487,3,1487,7],[1490,7,1490,9],[1493,3,1493,7],[1494,7,1494,9],[1497,3,1497,7],[1499,8,1499,9],[1502,3,1502,7],[1503,1,1504,2],[1503,3,1504,3],[1503,4,1504,4],[1503,5,1503,7],[1503,9,1504,9],[1507,3,1507,7],[1508,5,1508,7],[1431,0,1470,0],[1432,2,1432,9],[1433,1,1434,3],[1433,4,1433,5],[1434,4,1434,5],[1435,2,1435,7],[1435,8,1435,9],[1436,1,1437,2],[1436,3,1437,3],[1436,4,1436,5],[1436,6,1436,7],[1441,7,1441,9],[1444,3,1444,7],[1445,3,1445,7],[1446,3,1446,7],[1449,7,1449,9],[1452,3,1452,7],[1453,7,1453,9],[1458,3,1458,7],[1460,8,1460,9],[1463,3,1463,7],[1464,1,1465,2],[1464,3,1465,3],[1464,4,1465,4],[1464,5,1464,7],[1464,9,1465,9],[1468,3,1468,7],[1469,5,1469,7],[1390,0,1429,0],[1391,2,1391,9],[1392,1,1393,3],[1392,4,1392,5],[1393,4,1393,5],[1394,2,1394,7],[1394,8,1394,9],[1395,1,1396,2],[1395,3,1396,3],[1395,4,1395,5],[1395,6,1395,7],[1400,7,1400,9],[1403,3,1403,7],[1404,3,1404,7],[1405,3,1405,7],[1408,7,1408,9],[1411,3,1411,7],[1412,7,1412,9],[1417,3,1417,7],[1419,8,1419,9],[1422,3,1422,7],[1423,1,1424,2],[1423,3,1424,3],[1423,4,1424,4],[1423,5,1423,7],[1423,9,1424,9],[1427,3,1427,7],[1428,5,1428,7],[1347,0,1388,0],[1348,2,1348,9],[1349,1,1350,3],[1349,4,1349,5],[1350,4,1350,5],[1351,2,1351,7],[1351,8,1351,9],[1352,1,1353,2],[1352,3,1353,3],[1352,4,1352,5],[1352,6,1352,7],[1357,7,1357,9],[1360,3,1360,7],[1361,3,1361,7],[1362,3,1362,7],[1365,7,1365,9],[1368,3,1368,7],[1369,7,1369,9],[1376,3,1376,7],[1378,8,1378,9],[1381,3,1381,7],[1382,1,1383,2],[1382,3,1383,3],[1382,4,1383,4],[1382,5,1382,7],[1382,9,1383,9],[1386,3,1386,7],[1387,5,1387,7],[1304,0,1345,0],[1305,2,1305,9],[1306,1,1307,3],[1306,4,1306,5],[1307,4,1307,5],[1308,2,1308,7],[1308,8,1308,9],[1309,1,1310,2],[1309,3,1310,3],[1309,4,1309,5],[1309,6,1309,7],[1314,7,1314,9],[1317,3,1317,7],[1318,3,1318,7],[1319,3,1319,7],[1322,7,1322,9],[1325,3,1325,7],[1326,7,1326,9],[1333,3,1333,7],[1335,8,1335,9],[1338,3,1338,7],[1339,1,1340,2],[1339,3,1340,3],[1339,4,1340,4],[1339,5,1339,7],[1339,9,1340,9],[1343,3,1343,7],[1344,5,1344,7],[1264,0,1302,0],[1265,2,1265,9],[1266,1,1267,3],[1266,4,1266,5],[1267,4,1267,5],[1268,2,1268,7],[1268,8,1268,9],[1269,1,1270,2],[1269,3,1270,3],[1269,4,1269,5],[1269,6,1269,7],[1274,7,1274,9],[1277,3,1277,7],[1278,3,1278,7],[1279,3,1279,7],[1282,7,1282,9],[1285,3,1285,7],[1286,7,1286,9],[1290,3,1290,7],[1292,8,1292,9],[1295,3,1295,7],[1296,1,1297,2],[1296,3,1297,3],[1296,4,1297,4],[1296,5,1296,7],[1296,9,1297,9],[1300,3,1300,7],[1301,5,1301,7],[1221,0,1262,0],[1222,2,1222,9],[1223,1,1224,3],[1223,4,1223,5],[1224,4,1224,5],[1225,2,1225,7],[1225,8,1225,9],[1226,1,1227,2],[1226,3,1227,3],[1226,4,1226,5],[1226,6,1226,7],[1231,7,1231,9],[1234,3,1234,7],[1235,3,1235,7],[1236,3,1236,7],[1239,7,1239,9],[1242,3,1242,7],[1243,7,1243,9],[1250,3,1250,7],[1252,8,1252,9],[1255,3,1255,7],[1256,1,1257,2],[1256,3,1257,3],[1256,4,1257,4],[1256,5,1256,7],[1256,9,1257,9],[1260,3,1260,7],[1261,5,1261,7],[1182,0,1219,0],[1183,2,1183,9],[1184,1,1185,3],[1184,4,1184,5],[1185,4,1185,5],[1186,2,1186,7],[1186,8,1186,9],[1187,1,1188,2],[1187,3,1188,3],[1187,4,1187,5],[1187,6,1187,7],[1192,7,1192,9],[1195,3,1195,7],[1196,3,1196,7],[1197,3,1197,7],[1200,7,1200,9],[1203,3,1203,7],[1204,7,1204,9],[1207,3,1207,7],[1209,8,1209,9],[1212,3,1212,7],[1213,1,1214,2],[1213,3,1214,3],[1213,4,1214,4],[1213,5,1213,7],[1213,9,1214,9],[1217,3,1217,7],[1218,5,1218,7],[1143,0,1180,0],[1144,2,1144,9],[1145,1,1146,3],[1145,4,1145,5],[1146,4,1146,5],[1147,2,1147,7],[1147,8,1147,9],[1148,1,1149,2],[1148,3,1149,3],[1148,4,1148,5],[1148,6,1148,7],[1153,7,1153,9],[1156,3,1156,7],[1157,3,1157,7],[1158,3,1158,7],[1161,7,1161,9],[1164,3,1164,7],[1165,7,1165,9],[1168,3,1168,7],[1170,8,1170,9],[1173,3,1173,7],[1174,1,1175,2],[1174,3,1175,3],[1174,4,1175,4],[1174,5,1174,7],[1174,9,1175,9],[1178,3,1178,7],[1179,5,1179,7],[1104,0,1141,0],[1105,2,1105,9],[1106,1,1107,3],[1106,4,1106,5],[1107,4,1107,5],[1108,2,1108,7],[1108,8,1108,9],[1109,1,1110,2],[1109,3,1110,3],[1109,4,1109,5],[1109,6,1109,7],[1114,7,1114,9],[1117,3,1117,7],[1118,3,1118,7],[1119,3,1119,7],[1122,7,1122,9],[1125,3,1125,7],[1126,7,1126,9],[1129,3,1129,7],[1131,8,1131,9],[1134,3,1134,7],[1135,1,1136,2],[1135,3,1136,3],[1135,4,1136,4],[1135,5,1135,7],[1135,9,1136,9],[1139,3,1139,7],[1140,5,1140,7],[1056,0,1102,0],[1057,2,1057,9],[1058,1,1059,3],[1058,4,1058,5],[1059,4,1059,5],[1060,2,1060,7],[1060,8,1060,9],[1061,1,1062,2],[1061,3,1062,3],[1061,4,1061,5],[1061,6,1061,7],[1066,7,1066,9],[1069,3,1069,7],[1070,3,1070,7],[1071,3,1071,7],[1074,7,1074,9],[1080,3,1080,7],[1081,7,1081,9],[1084,3,1084,7],[1086,8,1086,9],[1092,3,1092,7],[1093,1,1094,2],[1093,3,1094,3],[1093,4,1094,4],[1093,5,1093,7],[1093,9,1094,9],[1100,3,1100,7],[1101,5,1101,7],[1014,0,1054,0],[1015,2,1015,9],[1016,1,1017,3],[1016,4,1016,5],[1017,4,1017,5],[1018,2,1018,7],[1018,8,1018,9],[1019,1,1020,2],[1019,3,1020,3],[1019,4,1019,5],[1019,6,1019,7],[1025,7,1025,9],[1028,3,1028,7],[1029,3,1029,7],[1030,3,1030,7],[1033,7,1033,9],[1037,3,1037,7],[1038,7,1038,9],[1041,3,1041,7],[1043,8,1043,9],[1047,3,1047,7],[1048,1,1049,2],[1048,3,1049,3],[1048,4,1049,4],[1048,5,1048,7],[1048,9,1049,9],[1052,3,1052,7],[1053,5,1053,7],[975,0,1012,0],[976,2,976,9],[977,1,978,3],[977,4,977,5],[978,4,978,5],[979,2,979,7],[979,8,979,9],[980,1,981,2],[980,3,981,3],[980,4,980,5],[980,6,980,7],[985,7,985,9],[988,3,988,7],[989,3,989,7],[990,3,990,7],[993,7,993,9],[996,3,996,7],[997,7,997,9],[1000,3,1000,7],[1002,8,1002,9],[1005,3,1005,7],[1006,1,1007,2],[1006,3,1007,3],[1006,4,1007,4],[1006,5,1006,7],[1006,9,1007,9],[1010,3,1010,7],[1011,5,1011,7],[936,0,973,0],[937,2,937,9],[938,1,939,3],[938,4,938,5],[939,4,939,5],[940,2,940,7],[940,8,940,9],[941,1,942,2],[941,3,942,3],[941,4,941,5],[941,6,941,7],[946,7,946,9],[949,3,949,7],[950,3,950,7],[951,3,951,7],[954,7,954,9],[957,3,957,7],[958,7,958,9],[961,3,961,7],[963,8,963,9],[966,3,966,7],[967,1,968,2],[967,3,968,3],[967,4,968,4],[967,5,967,7],[967,9,968,9],[971,3,971,7],[972,5,972,7],[892,3,892,7],[893,5,893,7],[896,0,934,0],[897,2,897,9],[898,1,899,3],[898,4,898,5],[899,4,899,5],[900,2,900,7],[900,8,900,9],[901,1,902,2],[901,3,902,3],[901,4,901,5],[901,6,901,7],[906,7,906,9],[909,3,909,7],[910,3,910,7],[911,3,911,7],[914,7,914,9],[918,3,918,7],[919,7,919,9],[922,3,922,7],[924,8,924,9],[927,3,927,7],[928,1,929,2],[928,3,929,3],[928,4,929,4],[928,5,928,7],[928,9,929,9],[932,3,932,7],[933,5,933,7],[389,7,389,9],[393,3,393,7],[394,7,394,9],[397,3,397,7],[399,8,399,9],[402,3,402,7],[403,1,404,2],[403,3,404,3],[403,4,404,4],[403,5,403,7],[403,9,404,9],[407,3,407,7],[408,5,408,7],[855,0,894,0],[856,2,856,9],[857,1,858,3],[857,4,857,5],[858,4,858,5],[859,2,859,7],[859,8,859,9],[860,1,861,2],[860,3,861,3],[860,4,860,5],[860,6,860,7],[865,7,865,9],[869,3,869,7],[870,3,870,7],[871,3,871,7],[874,7,874,9],[878,3,878,7],[879,7,879,9],[644,3,644,7],[243,0,283,0],[244,2,244,9],[245,1,246,3],[245,4,245,5],[246,4,246,5],[247,2,247,7],[247,8,247,9],[248,1,249,2],[248,3,249,3],[248,4,248,5],[248,6,248,7],[256,7,256,9],[259,3,259,7],[260,3,260,7],[261,3,261,7],[264,7,264,9],[267,3,267,7],[268,7,268,9],[271,3,271,7],[273,8,273,9],[276,3,276,7],[277,1,278,2],[277,3,278,3],[277,4,278,4],[277,5,277,7],[277,9,278,9],[281,3,281,7],[282,5,282,7],[646,8,646,9],[649,3,649,7],[650,1,651,2],[650,3,651,3],[650,4,651,4],[650,5,650,7],[650,9,651,9],[654,3,654,7],[655,5,655,7],[620,2,620,9],[621,1,622,3],[621,4,621,5],[622,4,622,5],[623,2,623,7],[623,8,623,9],[624,1,625,2],[624,3,625,3],[624,4,624,5],[624,6,624,7],[629,7,629,9],[632,3,632,7],[633,3,633,7],[634,3,634,7],[637,7,637,9],[640,3,640,7],[641,7,641,9],[7,13,7,15],[15,11,15,13],[27,8,27,9],[21,3,21,7],[4,2,4,7],[4,8,4,9],[5,1,6,2],[5,3,6,3],[5,4,5,5],[5,6,5,7],[529,0,578,0],[530,2,530,9],[531,1,532,3],[531,4,531,5],[532,4,532,5],[533,2,533,7],[533,8,533,9],[534,1,535,2],[534,3,535,3],[534,4,534,5],[534,6,534,7],[542,7,542,9],[544,3,544,7],[545,3,545,7],[546,3,546,7],[549,7,549,9],[557,3,557,7],[39,0,81,0],[40,2,40,9],[619,0,656,0],[41,1,42,3],[41,4,41,5],[42,4,42,5],[43,2,43,7],[43,8,43,9],[44,1,45,2],[0,0,37,0],[3,4,3,5],[0,11,0,12],[1,11,1,12],[2,4,2,5],[1,2,1,9],[2,1,3,3],[31,3,32,3],[31,4,32,4],[31,5,31,7],[31,9,32,9],[35,3,35,7],[36,5,36,7],[10,7,10,9],[13,3,13,7],[14,3,14,7],[15,3,15,7],[18,7,18,9],[30,3,30,7],[31,1,32,2],[22,7,22,9],[25,3,25,7],[2,10,2,11],[79,3,79,7],[80,5,80,7],[85,4,85,5],[74,3,74,7],[75,1,76,2],[75,3,76,3],[75,4,76,4],[75,5,75,7],[75,9,76,9],[57,3,57,7],[60,7,60,9],[63,3,63,7],[64,7,64,9],[69,3,69,7],[71,8,71,9],[44,3,45,3],[44,4,44,5],[44,6,44,7],[49,7,49,9],[55,3,55,7],[56,3,56,7],[114,1,115,2],[114,3,115,3],[114,4,115,4],[114,5,114,7],[114,9,115,9],[118,3,118,7],[93,7,93,9],[98,3,98,7],[101,7,101,9],[104,3,104,7],[105,7,105,9],[108,3,108,7],[83,0,120,0],[84,2,84,9],[85,1,86,3],[86,4,86,5],[87,2,87,7],[87,8,87,9],[88,1,89,2],[110,8,110,9],[113,3,113,7],[96,3,96,7],[97,3,97,7],[88,3,89,3],[88,4,88,5],[88,6,88,7],[136,3,136,7],[137,3,137,7],[140,7,140,9],[145,3,145,7],[146,7,146,9],[149,3,149,7],[127,1,128,2],[127,3,128,3],[127,4,127,5],[127,6,127,7],[132,7,132,9],[135,3,135,7],[119,5,119,7],[122,0,161,0],[123,2,123,9],[124,1,125,3],[124,4,124,5],[125,4,125,5],[126,2,126,7],[126,8,126,9],[159,3,159,7],[160,5,160,7],[179,3,179,7],[180,3,180,7],[183,7,183,9],[186,3,186,7],[187,7,187,9],[167,8,167,9],[168,1,169,2],[168,3,169,3],[168,4,168,5],[168,6,168,7],[173,7,173,9],[164,2,164,9],[165,1,166,3],[165,4,165,5],[166,4,166,5],[167,2,167,7],[151,8,151,9],[154,3,154,7],[155,1,156,2],[155,3,156,3],[155,4,156,4],[155,5,155,7],[155,9,156,9],[204,0,241,0],[205,2,205,9],[206,1,207,3],[206,4,206,5],[207,4,207,5],[208,2,208,7],[190,3,190,7],[192,8,192,9],[195,3,195,7],[196,1,197,2],[196,3,197,3],[196,4,197,4],[196,5,196,7],[196,9,197,9],[229,3,229,7],[231,8,231,9],[234,3,234,7],[235,1,236,2],[235,3,236,3],[235,4,236,4],[235,5,235,7],[235,9,236,9],[217,3,217,7],[218,3,218,7],[208,8,208,9],[209,1,210,2],[209,3,210,3],[209,4,209,5],[163,0,202,0],[200,3,200,7],[201,5,201,7],[178,3,178,7],[289,8,289,9],[290,1,291,2],[290,3,291,3],[290,4,290,5],[209,6,209,7],[214,7,214,9],[239,3,239,7],[240,5,240,7],[219,3,219,7],[222,7,222,9],[225,3,225,7],[226,7,226,9],[328,0,369,0],[329,2,329,9],[330,1,331,3],[330,4,330,5],[331,4,331,5],[332,2,332,7],[367,3,367,7],[368,5,368,7],[285,0,326,0],[286,2,286,9],[287,1,288,3],[287,4,287,5],[288,4,288,5],[289,2,289,7],[314,3,314,7],[316,8,316,9],[319,3,319,7],[320,1,321,2],[320,3,321,3],[320,4,321,4],[320,5,320,7],[320,9,321,9],[302,3,302,7],[303,3,303,7],[290,6,290,7],[299,7,299,9],[345,3,345,7],[346,3,346,7],[347,3,347,7],[350,7,350,9],[353,3,353,7],[354,7,354,9],[332,8,332,9],[333,1,334,2],[333,3,334,3],[333,4,333,5],[333,6,333,7],[342,7,342,9],[324,3,324,7],[325,5,325,7],[304,3,304,7],[307,7,307,9],[310,3,310,7],[311,7,311,9],[411,0,448,0]],"merged_total":1380,"flags":["merged_cut"]}
[1,"1ª/GRD",{"$nulls":8},{"$f":"J37","v":24209.41}]
[null,"OBRA:"," DRENAGEM E PAVIMENTAÇÃO - VIAS INTERNAS DO PARQUE DE EXPOSIÇÕES E RUA BOM JARDIM (BAIRRO SANTO ANTÔNIO) - SERRO-MG"]
[null,"Custo Unitário de Referência",null,null,"Minas Gerais"]
[{"$nulls":4}," Outubro/2024 ",null,null,"Produção da equipe ",0.5,{"$f":"VLOOKUP(A1,ORÇAMENTO!$A$10:$L$69,7,1)","v":"GL"}]
[null,"CPU.1","MOBILIZAÇÃO E DESMOBILIZAÇÃO",{"$nulls":5},"Valores em reais (R$)"]
[null,"A - EQUIPAMENTOS",null,"Quantidade","Utilização",null,"Custo Horário",null,null,"Custo"]
{"$rows_left_out":2014}
{"sheet":"CPU-FORNEC","index":2,"n_rows":92,"n_cols":14,"rows_kept":92,"cut":false,"hidden":false,"merged":[[71,0,80,0],[71,1,71,3],[71,4,71,7],[72,2,72,5],[73,2,73,3],[74,1,74,7],[77,1,77,3],[77,5,77,6],[78,1,78,6],[79,1,79,6],[80,1,80,6],[0,0,26,0],[0,1,0,3],[0,4,0,7],[22,1,22,3],[49,0,58,0],[49,1,49,3],[49,4,49,7],[50,2,50,5],[51,2,51,3],[52,1,52,7],[55,1,55,3],[55,5,55,6],[56,1,56,6],[57,1,57,6],[58,1,58,6],[27,1,27,3],[27,4,27,7],[28,2,28,5],[27,0,36,0],[29,2,29,3],[30,1,30,7],[33,1,33,3],[33,5,33,6],[34,1,34,6],[35,1,35,6],[36,1,36,6],[0,10,0,11],[1,2,1,5],[1,10,1,11],[2,2,2,3],[3,1,3,7],[22,5,22,6],[23,1,23,6],[24,1,24,6],[25,1,25,6],[5,1,5,7],[9,1,9,7],[13,1,13,7],[17,1,17,7],[38,0,47,0],[38,1,38,3],[38,4,38,7],[39,2,39,5],[40,2,40,3],[41,1,41,7],[44,1,44,3],[44,5,44,6],[45,1,45,6],[46,1,46,6],[47,1,47,6],[60,0,69,0],[60,1,60,3],[60,4,60,7],[61,2,61,5],[62,2,62,3],[63,1,63,7],[66,1,66,3],[66,5,66,6],[67,1,67,6],[68,1,68,6],[69,1,69,6],[81,1,81,7],[82,0,91,0],[82,1,82,3],[82,4,82,7],[83,2,83,5],[84,2,84,3],[85,1,85,7],[88,1,88,3],[88,5,88,6],[89,1,89,6],[90,1,90,6],[91,1,91,6]]}
[1,"CODEVASF",null,null," COMPOSIÇÃO DE PREÇO UNITÁRIO",null,null,null,{"$f":"H24","v":0},{"$f":"H26","v":0},"BDI CALCULADO:",null,{"$f":"ORÇAMENTO!L6","v":15}]
[null,"OBRA:  ",{"$f":"ORÇAMENTO!C5","v":" DRENAGEM E PAVIMENTAÇÃO - VIAS INTERNAS DO PARQUE DE EXPOSIÇÕES E RUA BOM JARDIM (BAIRRO SANTO ANTÔNIO) - SERRO-MG"},null,null,null,"DATA: ",{"$f":"ORÇAMENTO!C6","v":" JANEIRO / 2025"},null,null,"BDI DIFERENCIADO:",null,{"$f":"'BDI FORN'!D31/100","v":0.15}]
[null,"SERVIÇO:  ",{"$f":"VLOOKUP(A1,ORÇAMENTO!A11:L32,3)","v":"CPU.1"},null,"Referência:",{"$f":"VLOOKUP(A1,ORÇAMENTO!$A$11:$L$32,4)","v":"CODEVASF"},"UNIDADE: ",{"$f":"VLOOKUP(A1,ORÇAMENTO!A11:L32,5)","v":"MOBILIZAÇÃO E DESMOBILIZAÇÃO"}]
[]
[null,"TIPO ITEM","CODIGO ITEM","DESCRIÇÃO ITEM","UNIDADE ITEM","COEFICIENTE","PRECO UNITARIO","CUSTO TOTAL",null,"distancia =",90,"B.DESPACHO"]
[null,"EQUIPAMENTOS",{"$nulls":7},"Pá carregadeira ",null,null,10.1," ton"]
{"$rows_left_out":87}
{"sheet":"BDI SERV","index":3,"n_rows":60,"n_cols":5,"rows_kept":60,"cut":false,"hidden":false,"merged":[[0,1,2,4],[25,1,25,3],[26,1,26,2],[26,3,26,4],[27,3,27,4],[28,7,28,15],[35,0,35,5],[36,0,36,5],[38,1,38,4],[39,2,39,3]]}
[null,"DETALHAMENTO DO BDI - SERVIÇOS"]
[]
[]
[null,"Item","Descrição dos Serviços","% - PV","% - CD"]
[]
[null,1,"ADMINISTRAÇÃO CENTRAL"," ",{"$f":"SUM(E7:E9)","v":4.01}]
{"$rows_left_out":55}
{"sheet":"BDI FORN","index":4,"n_rows":37,"n_cols":5,"rows_kept":37,"cut":false,"hidden":false,"merged":[[31,1,31,2],[32,0,34,5],[36,0,36,5],[0,1,2,4],[3,1,4,1],[3,2,4,2],[28,0,28,5],[30,1,30,2]]}
[null,"DETALHAMENTO DO BDI - FORNECIMENTO \n(MATERIAL ASFÁLTICO)"]
[]
[]
[null,"Item","Descrição dos Serviços","%","%"]
[null,null,null,"PV","CD"]
[]
{"$rows_left_out":32}
{"sheet":"CRONOGRAMA","index":5,"n_rows":19,"n_cols":15,"rows_kept":19,"cut":false,"hidden":false,"merged":[[15,1,16,2],[18,1,22,14],[11,0,12,0],[11,1,12,1],[11,2,12,2],[13,0,14,0],[13,1,14,1],[13,2,14,2],[9,0,10,0],[9,1,10,1],[9,2,10,2],[3,1,3,13],[5,0,6,0],[5,1,6,1],[5,2,6,2],[7,0,8,0],[7,1,8,1],[7,2,8,2],[0,1,0,14],[1,1,2,1],[1,2,2,4],[1,6,1,14],[2,6,2,14]]}
[null,"CRONOGRAMA FÍSICO-FINANCEIRO"]
[null,"OBRA: ",{"$f":"ORÇAMENTO!C5","v":" DRENAGEM E PAVIMENTAÇÃO - VIAS INTERNAS DO PARQUE DE EXPOSIÇÕES E RUA BOM JARDIM (BAIRRO SANTO ANTÔNIO) - SERRO-MG"},null,null,"VALOR:",{"$f":"ORÇAMENTO!L69","v":4598888.0299999993}]
[{"$nulls":5},"PRAZO: ","270 DIAS "]
[]
[null,"ITEM","ETAPAS/DESCRIÇAO","FISICO/  FINANCEIRO","TOTAL    ETAPAS","MÊS 1","MÊS 2","MÊS 3","MÊS 4","MÊS 5","MÊS 6","MÊS 7","MÊS 8","MÊS 9","TOTAL"]
["A",{"$f":"VLOOKUP(A6,ORÇAMENTO!$A$10:$L$69,2)","v":1},{"$f":"VLOOKUP(A6,ORÇAMENTO!$A$10:$L$69,5)","v":"SERVIÇOS PRELIMINARES "},"FISICO ",{"$f":"ROUND(E7/$G$2,4)","v":6.9599999999999995E-2},0.2,0.1,0.1,0.1,0.1,0.1,0.1,0.1,0.1,{"$f":"SUM(F6:N6)","v":0.99999999999999989}]
{"$rows_left_out":14}
{"sheet":"EAI","index":6,"n_rows":90,"n_cols":34,"rows_kept":90,"cut":false,"hidden":false,"merged":[[12,3,24,3],[1,2,3,26],[5,2,7,2],[5,12,7,12],[6,6,7,6],[6,19,6,20],[10,4,10,8],[10,9,10,10],[10,22,10,23],[5,6,5,7],[5,8,5,9],[6,21,6,24],[7,21,7,24]]}
[]
[null,null,"MEMÓRIA DE CÁLCULO"]
[]
[]
[]
[{"$nulls":6},"TIPOLOGIA DO MATERIAL",null,"Emulsão Asfáltica para Serviço de Imprimação",null,null,null,"IMPOSTOS","COFINS",6.4999999999999997E-3,6.4999999999999997E-3]
{"$rows_left_out":78}
{"sheet":"RR-1C","index":7,"n_rows":92,"n_cols":34,"rows_kept":92,"cut":false,"hidden":false,"merged":[[1,2,3,26],[5,2,7,2],[10,4,10,8],[10,9,10,10],[10,22,10,23],[6,21,6,24],[7,21,7,24],[12,3,26,3],[6,19,6,20],[6,6,7,6],[5,12,7,12],[5,6,5,7],[5,8,5,9]]}
[]
[null,null,"MEMÓRIA DE CÁLCULO"]
[]
[]
[]
[{"$nulls":6},"TIPOLOGIA DO MATERIAL",null,"EMULSÕES ASFÁLTICAS RR-1C",null,null,null,"IMPOSTOS","COFINS",6.4999999999999997E-3,6.4999999999999997E-3]
{"$rows_left_out":80}
{"sheet":"CAP","index":8,"n_rows":91,"n_cols":34,"rows_kept":91,"cut":false,"hidden":false,"merged":[[10,4,10,8],[10,9,10,10],[10,22,10,23],[12,3,24,3],[1,2,3,26],[5,2,7,2],[5,12,7,12],[6,6,7,6],[6,19,6,20],[6,21,6,24],[7,21,7,24],[5,6,5,7],[5,8,5,9]]}
[]
[null,null,"MEMÓRIA DE CÁLCULO"]
[]
[]
[]
[{"$nulls":6},"TIPOLOGIA DO MATERIAL",null,"CIMENTOS ASFÁLTICOS CAP-50-70",null,null,null,"IMPOSTOS","COFINS",6.4999999999999997E-3,6.4999999999999997E-3]
{"$rows_left_out":78}
{"sheet":"MAT.ASF","index":9,"n_rows":33,"n_cols":23,"rows_kept":33,"cut":false,"hidden":false,"merged":[[7,1,7,19],[8,1,10,22],[2,1,2,8],[3,1,3,8],[4,1,4,8],[5,1,5,8],[6,1,6,22],[20,2,25,2],[27,2,32,2],[19,1,19,22],[26,1,26,22],[11,2,12,2],[11,3,11,6],[11,7,11,8],[11,18,11,19],[13,2,18,2]]}
{"$rows_empty":8}
[null,"PLANILHA RESUMO - MATERIAIS ASFÁLTICOS"]
[]
[]
[null,"DATA-BASE","PRODUTOS","LOCALIDADES",null,null,null,"CUSTO ANP (R$/Kg)",null,"CUSTO ANP","IMPOSTOS DO PRODUTO","CUSTO DO PRODUTO COM IMPOSTOS","DMT's","DMT's","CUSTO DO TRANSPORTE TOTAL","ICMS","ATUALIZAÇÃO DO CUSTO DE TRANSPORTE","CUSTO DO TRANSPORTE RODOVIA PAVIMENTADA COM IMPOSTOS E ATUALIZAÇÃO MONETÁRIA","PEDÁGIO ",null,"TOTAL TRANSPORTE","TOTAL PRODUTO","TOTAL GERAL"]
[null,{"$f":"CAP!H9","v":"2024-12-01"},null,"REFINARIAS","ENDEREÇO","ORIGEM - REFINARIAS / DISTRIBUIDORAS","DESTINO","ESTADO","REGIÃO","R$/t","R$/t","R$/t","KM","KM","R$/t","R$/t","R$/t","R$/t","CUSTO POR EIXO","R$/t","R$/t","R$/t","R$/t"]
{"$rows_left_out":20}