{"text_format":"2","workbook":"xlsx","n_sheets":10,"sheets":["ORÇAMENTO","CPU-SERV","CPU-FORNEC","BDI SERV","BDI FORN","CRONOGRAMA","EAI","RR-1C","CAP","MAT.ASF"],"not_rendered":{"charts":0,"images":2,"macros":0,"external_links":2,"defined_names":12,"comments":5,"pivot_tables":0},"unopened":[],"bounds":{"document_bytes":16777216,"sheet_cells":100000,"run_cost":"one","rows_first":2000,"rows_last":500,"rows_between":2000,"halvings":0,"cell_chars":16384,"cell_head_chars":4096},"cells_cut":0,"cells_raw":0,"read":"whole","date_system":"1900"}

{"sheet":"ORÇAMENTO","index":0,"n_rows":42,"n_cols":12,"rows_kept":42,"cut":false,"hidden":false,"merged":[[7,1,7,11],[5,8,5,10],[0,0,8,0],[0,4,0,11],[1,4,1,11],[2,4,2,11],[6,1,6,4],[4,2,4,8],[4,9,4,10],[5,2,5,4],[6,8,6,10]]}
["<---- NUMERAR SERVIÇOS PARA CPU",null,null,null,"Ministério do Desenvolvimento Regional"]
[{"$nulls":4},"Companhia de Desenvolvimento dos Vales do São Francisco e do Parnaíba"]
[{"$nulls":4},"1ª Superintendência Regional"]
[]
[null,"OBRA: "," PAVIMENTAÇÃO ASFÁLTICA EM CBUQ - VIAS DIVERSAS - BAIRROS: N. SRA. DO ROSÁRIO, CÍCERO PASSOS E COMUNIDADE PERNAMBUCO - PIRAPORA-MG",{"$nulls":6},"BDI Serviços (%):",null,{"$f":"'BDI SERV'!E26","v":21.35}]
[null,"DATA:"," JANEIRO / 2025",{"$nulls":5},"BDI Diferenciado Serviços (%):",null,null,{"$f":"'BDI FORN'!D31","v":15}]
{"$rows_left_out":37}
{"sheet":"CPU-SERV","index":1,"n_rows":1719,"n_cols":16,"rows_kept":1719,"cut":false,"hidden":false,"merged":[[1516,11,1516,12],[1517,2,1517,9],[1517,11,1517,12],[1483,7,1483,9],[1489,3,1489,7],[1490,7,1490,9],[1518,1,1519,3],[1518,4,1518,5],[1519,4,1519,5],[1520,2,1520,7],[1494,3,1494,7],[1496,8,1496,9],[1503,3,1503,7],[1504,1,1505,2],[1504,3,1505,3],[1504,4,1505,4],[1504,5,1504,7],[1504,9,1505,9],[1563,3,1563,7],[1564,5,1564,7],[1545,3,1545,7],[1547,8,1547,9],[1554,3,1554,7],[1555,1,1556,2],[1555,3,1556,3],[1555,4,1556,4],[1555,5,1555,7],[1555,9,1556,9],[1540,3,1540,7],[1541,7,1541,9],[1469,2,1469,7],[1512,3,1512,7],[1513,5,1513,7],[1516,0,1565,0],[1438,3,1438,7],[1439,7,1439,9],[1529,3,1529,7],[1530,3,1530,7],[1531,3,1531,7],[1534,7,1534,9],[1526,7,1526,9],[1424,7,1424,9],[1478,3,1478,7],[1479,3,1479,7],[1480,3,1480,7],[1363,0,1412,0],[1465,0,1514,0],[1469,8,1469,9],[1470,1,1471,2],[1470,3,1471,3],[1470,4,1470,5],[1470,6,1470,7],[1475,7,1475,9],[1461,3,1461,7],[1462,5,1462,7],[1520,8,1520,9],[1521,1,1522,2],[1521,3,1522,3],[1521,4,1521,5],[1521,6,1521,7],[1467,4,1467,5],[1468,4,1468,5],[1363,11,1363,12],[1364,2,1364,9],[1364,11,1364,12],[1365,1,1366,3],[1365,4,1365,5],[1366,4,1366,5],[1367,2,1367,7],[1410,3,1410,7],[1411,5,1411,7],[1414,0,1463,0],[1414,11,1414,12],[1415,2,1415,9],[1415,11,1415,12],[1416,1,1417,3],[1416,4,1416,5],[1417,4,1417,5],[1418,2,1418,7],[1392,3,1392,7],[1394,8,1394,9],[1401,3,1401,7],[1402,1,1403,2],[1402,3,1403,3],[1419,1,1420,2],[1419,3,1420,3],[1419,4,1419,5],[1419,6,1419,7],[1453,5,1453,7],[1453,9,1454,9],[1427,3,1427,7],[1428,3,1428,7],[1429,3,1429,7],[1432,7,1432,9],[1465,11,1465,12],[1466,2,1466,9],[1466,11,1466,12],[1467,1,1468,3],[1402,4,1403,4],[1402,5,1402,7],[1402,9,1403,9],[1443,3,1443,7],[1445,8,1445,9],[1452,3,1452,7],[1453,1,1454,2],[1453,3,1454,3],[1453,4,1454,4],[1418,8,1418,9],[1317,3,1318,3],[1317,4,1317,5],[1317,6,1317,7],[1322,7,1322,9],[1376,3,1376,7],[1377,3,1377,7],[1378,3,1378,7],[1381,7,1381,9],[1387,3,1387,7],[1388,7,1388,9],[1367,8,1367,9],[1368,1,1369,2],[1368,3,1369,3],[1368,4,1368,5],[1368,6,1368,7],[1373,7,1373,9],[1359,3,1359,7],[1360,5,1360,7],[1312,0,1361,0],[1312,11,1312,12],[1313,2,1313,9],[1313,11,1313,12],[1314,1,1315,3],[1314,4,1314,5],[1315,4,1315,5],[1316,2,1316,7],[1290,3,1290,7],[1292,8,1292,9],[1299,3,1299,7],[1300,1,1301,2],[1300,3,1301,3],[1300,4,1301,4],[1300,5,1300,7],[1300,9,1301,9],[1341,3,1341,7],[1343,8,1343,9],[1350,3,1350,7],[1351,1,1352,2],[1351,3,1352,3],[1351,4,1352,4],[1351,5,1351,7],[1351,9,1352,9],[1325,3,1325,7],[1326,3,1326,7],[1327,3,1327,7],[1330,7,1330,9],[1336,3,1336,7],[1337,7,1337,9],[1316,8,1316,9],[1317,1,1318,2],[1279,7,1279,9],[1285,3,1285,7],[1286,7,1286,9],[1265,8,1265,9],[1266,1,1267,2],[1266,3,1267,3],[1266,4,1266,5],[1266,6,1266,7],[1271,7,1271,9],[1257,3,1257,7],[1258,5,1258,7],[1261,0,1310,0],[1261,11,1261,12],[1262,2,1262,9],[1262,11,1262,12],[1263,1,1264,3],[1263,4,1263,5],[1264,4,1264,5],[1265,2,1265,7],[1308,3,1308,7],[1309,5,1309,7],[1274,3,1274,7],[1275,3,1275,7],[1276,3,1276,7],[1249,5,1249,7],[1249,9,1250,9],[1223,3,1223,7],[1224,3,1224,7],[1225,3,1225,7],[1228,7,1228,9],[1234,3,1234,7],[1235,7,1235,9],[1214,8,1214,9],[1215,1,1216,2],[1215,3,1216,3],[1215,4,1215,5],[1215,6,1215,7],[1220,7,1220,9],[1113,3,1114,3],[1113,4,1113,5],[1113,6,1113,7],[1118,7,1118,9],[1172,3,1172,7],[1173,3,1173,7],[1174,3,1174,7],[1177,7,1177,9],[1183,3,1183,7],[1184,7,1184,9],[1163,8,1163,9],[1164,1,1165,2],[1164,3,1165,3],[1164,4,1164,5],[1164,6,1164,7],[1169,7,1169,9],[1155,3,1155,7],[1156,5,1156,7],[1159,0,1208,0],[1159,11,1159,12],[1160,2,1160,9],[1160,11,1160,12],[1161,1,1162,3],[1161,4,1161,5],[1162,4,1162,5],[1163,2,1163,7],[1206,3,1206,7],[1207,5,1207,7],[1210,0,1259,0],[1210,11,1210,12],[1211,2,1211,9],[1211,11,1211,12],[1212,1,1213,3],[1212,4,1212,5],[1213,4,1213,5],[1214,2,1214,7],[1188,3,1188,7],[1190,8,1190,9],[1197,3,1197,7],[1198,1,1199,2],[1198,3,1199,3],[1198,4,1199,4],[1198,5,1198,7],[1198,9,1199,9],[1239,3,1239,7],[1241,8,1241,9],[1248,3,1248,7],[1249,1,1250,2],[1249,3,1250,3],[1249,4,1250,4],[1108,0,1157,0],[1108,11,1108,12],[1109,2,1109,9],[1109,11,1109,12],[1110,1,1111,3],[1110,4,1110,5],[1111,4,1111,5],[1112,2,1112,7],[1086,3,1086,7],[1088,8,1088,9],[1095,3,1095,7],[1096,1,1097,2],[1096,3,1097,3],[1096,4,1097,4],[1096,5,1096,7],[1096,9,1097,9],[1137,3,1137,7],[1139,8,1139,9],[1146,3,1146,7],[1147,1,1148,2],[1147,3,1148,3],[1147,4,1148,4],[1147,5,1147,7],[1147,9,1148,9],[1121,3,1121,7],[1122,3,1122,7],[1059,4,1059,5],[1060,4,1060,5],[1061,2,1061,7],[1104,3,1104,7],[1105,5,1105,7],[1045,5,1045,7],[1045,9,1046,9],[1019,3,1019,7],[1020,3,1020,7],[1021,3,1021,7],[1024,7,1024,9],[1030,3,1030,7],[1031,7,1031,9],[1123,3,1123,7],[1126,7,1126,9],[1132,3,1132,7],[1133,7,1133,9],[1112,8,1112,9],[1113,1,1114,2],[1075,7,1075,9],[1081,3,1081,7],[1082,7,1082,9],[1061,8,1061,9],[1062,1,1063,2],[1062,3,1063,3],[1062,4,1062,5],[1062,6,1062,7],[1067,7,1067,9],[1053,3,1053,7],[1054,5,1054,7],[1016,7,1016,9],[1070,3,1070,7],[1071,3,1071,7],[1072,3,1072,7],[955,0,1004,0],[955,11,955,12],[956,2,956,9],[956,11,956,12],[957,1,958,3],[957,4,957,5],[958,4,958,5],[959,2,959,7],[1002,3,1002,7],[1003,5,1003,7],[1006,0,1055,0],[1006,11,1006,12],[1007,2,1007,9],[1007,11,1007,12],[1008,1,1009,3],[1008,4,1008,5],[1009,4,1009,5],[1010,2,1010,7],[984,3,984,7],[986,8,986,9],[993,3,993,7],[994,1,995,2],[994,3,995,3],[1057,0,1106,0],[1057,11,1057,12],[1058,2,1058,9],[1058,11,1058,12],[1059,1,1060,3],[994,4,995,4],[994,5,994,7],[994,9,995,9],[1035,3,1035,7],[1037,8,1037,9],[1044,3,1044,7],[1045,1,1046,2],[1045,3,1046,3],[1045,4,1046,4],[909,3,910,3],[909,4,909,5],[909,6,909,7],[914,7,914,9],[968,3,968,7],[969,3,969,7],[970,3,970,7],[973,7,973,9],[979,3,979,7],[980,7,980,9],[959,8,959,9],[960,1,961,2],[960,3,961,3],[960,4,960,5],[960,6,960,7],[965,7,965,9],[951,3,951,7],[952,5,952,7],[1010,8,1010,9],[1011,1,1012,2],[1011,3,1012,3],[1011,4,1011,5],[1011,6,1011,7],[904,0,953,0],[904,11,904,12],[905,2,905,9],[905,11,905,12],[906,1,907,3],[906,4,906,5],[907,4,907,5],[908,2,908,7],[886,3,886,7],[888,8,888,9],[893,3,893,7],[894,1,895,2],[894,3,895,3],[894,4,895,4],[894,5,894,7],[894,9,895,9],[933,3,933,7],[935,8,935,9],[942,3,942,7],[943,1,944,2],[943,3,944,3],[943,4,944,4],[943,5,943,7],[943,9,944,9],[917,3,917,7],[918,3,918,7],[919,3,919,7],[922,7,922,9],[928,3,928,7],[929,7,929,9],[908,8,908,9],[909,1,910,2],[848,3,849,3],[848,4,849,4],[848,5,848,7],[848,9,849,9],[871,3,871,7],[872,3,872,7],[873,3,873,7],[876,7,876,9],[882,3,882,7],[883,7,883,9],[862,8,862,9],[863,1,864,2],[863,3,864,3],[863,4,863,5],[863,6,863,7],[868,7,868,9],[858,0,902,0],[859,2,859,9],[860,1,861,3],[860,4,860,5],[861,4,861,5],[862,2,862,7],[900,3,900,7],[901,5,901,7],[808,3,808,7],[809,5,809,7],[773,0,810,0],[774,2,774,9],[775,1,776,3],[775,4,775,5],[776,4,776,5],[777,2,777,7],[825,3,825,7],[826,3,826,7],[827,3,827,7],[830,7,830,9],[836,3,836,7],[837,7,837,9],[816,8,816,9],[817,1,818,2],[817,3,818,3],[817,4,817,5],[817,6,817,7],[822,7,822,9],[812,0,856,0],[813,2,813,9],[814,1,815,3],[814,4,814,5],[815,4,815,5],[816,2,816,7],[854,3,854,7],[855,5,855,7],[840,3,840,7],[842,8,842,9],[847,3,847,7],[848,1,849,2],[765,3,766,3],[765,4,766,4],[765,5,765,7],[765,9,766,9],[798,3,798,7],[800,8,800,9],[803,3,803,7],[804,1,805,2],[804,3,805,3],[804,4,805,4],[804,5,804,7],[804,9,805,9],[786,3,786,7],[787,3,787,7],[788,3,788,7],[791,7,791,9],[794,3,794,7],[795,7,795,9],[777,8,777,9],[778,1,779,2],[778,3,779,3],[778,4,778,5],[778,6,778,7],[783,7,783,9],[729,3,729,7],[730,5,730,7],[693,0,731,0],[694,2,694,9],[695,1,696,3],[695,4,695,5],[696,4,696,5],[697,2,697,7],[747,3,747,7],[748,3,748,7],[749,3,749,7],[752,7,752,9],[755,3,755,7],[756,7,756,9],[737,8,737,9],[738,1,739,2],[738,3,739,3],[738,4,738,5],[738,6,738,7],[743,7,743,9],[733,0,771,0],[734,2,734,9],[735,1,736,3],[735,4,735,5],[736,4,736,5],[737,2,737,7],[769,3,769,7],[770,5,770,7],[759,3,759,7],[761,8,761,9],[764,3,764,7],[765,1,766,2],[685,3,686,3],[685,4,686,4],[685,5,685,7],[685,9,686,9],[719,3,719,7],[721,8,721,9],[724,3,724,7],[725,1,726,2],[725,3,726,3],[725,4,726,4],[725,5,725,7],[725,9,726,9],[707,3,707,7],[708,3,708,7],[709,3,709,7],[712,7,712,9],[715,3,715,7],[716,7,716,9],[697,8,697,9],[698,1,699,2],[698,3,699,3],[698,4,698,5],[698,6,698,7],[703,7,703,9],[667,3,667,7],[668,3,668,7],[669,3,669,7],[672,7,672,9],[675,3,675,7],[676,7,676,9],[658,8,658,9],[659,1,660,2],[659,3,660,3],[659,4,659,5],[659,6,659,7],[664,7,664,9],[650,3,650,7],[651,5,651,7],[654,0,691,0],[655,2,655,9],[656,1,657,3],[656,4,656,5],[657,4,657,5],[658,2,658,7],[689,3,689,7],[690,5,690,7],[615,0,652,0],[616,2,616,9],[617,1,618,3],[617,4,617,5],[618,4,618,5],[619,2,619,7],[679,3,679,7],[681,8,681,9],[684,3,684,7],[685,1,686,2],[640,3,640,7],[642,8,642,9],[645,3,645,7],[646,1,647,2],[646,3,647,3],[646,4,647,4],[646,5,646,7],[646,9,647,9],[628,3,628,7],[629,3,629,7],[630,3,630,7],[633,7,633,9],[636,3,636,7],[637,7,637,9],[619,8,619,9],[620,1,621,2],[620,3,621,3],[620,4,620,5],[620,6,620,7],[625,7,625,9],[598,7,598,9],[580,8,580,9],[581,1,582,2],[581,3,582,3],[581,4,581,5],[581,6,581,7],[586,7,586,9],[533,3,533,7],[534,5,534,7],[576,0,613,0],[577,2,577,9],[578,1,579,3],[578,4,578,5],[579,4,579,5],[580,2,580,7],[611,3,611,7],[612,5,612,7],[498,0,535,0],[499,2,499,9],[500,1,501,3],[500,4,500,5],[501,4,501,5],[601,3,601,7],[603,8,603,9],[606,3,606,7],[607,1,608,2],[607,3,608,3],[607,4,608,4],[607,5,607,7],[607,9,608,9],[512,3,512,7],[513,3,513,7],[516,7,516,9],[519,3,519,7],[520,7,520,9],[502,8,502,9],[503,1,504,2],[503,3,504,3],[503,4,503,5],[503,6,503,7],[508,7,508,9],[589,3,589,7],[590,3,590,7],[591,3,591,7],[594,7,594,9],[597,3,597,7],[502,2,502,7],[435,8,435,9],[438,3,438,7],[439,1,440,2],[439,3,440,3],[439,4,440,4],[439,5,439,7],[439,9,440,9],[487,1,488,2],[487,3,488,3],[487,4,488,4],[487,5,487,7],[487,9,488,9],[494,3,494,7],[478,3,478,7],[480,8,480,9],[486,3,486,7],[511,3,511,7],[472,7,472,8],[495,5,495,7],[523,3,523,7],[525,8,525,9],[528,3,528,7],[529,1,530,2],[529,3,530,3],[529,4,530,4],[529,5,529,7],[529,9,530,9],[373,6,373,7],[378,7,378,9],[421,3,421,7],[422,3,422,7],[423,3,423,7],[426,7,426,9],[429,3,429,7],[430,7,430,9],[411,8,411,9],[412,1,413,2],[412,3,413,3],[412,4,412,5],[412,6,412,7],[418,7,418,9],[403,3,403,7],[404,5,404,7],[382,3,382,7],[383,3,383,7],[386,7,386,9],[389,3,389,7],[390,7,390,9],[476,7,476,9],[433,3,433,7],[407,0,445,0],[408,2,408,9],[409,1,410,3],[409,4,409,5],[410,4,410,5],[411,2,411,7],[443,3,443,7],[444,5,444,7],[387,7,387,8],[368,0,405,0],[369,2,369,9],[370,1,371,3],[370,4,370,5],[371,4,371,5],[372,2,372,7],[354,3,354,7],[356,8,356,9],[359,3,359,7],[360,1,361,2],[360,3,361,3],[360,4,361,4],[360,5,360,7],[360,9,361,9],[393,3,393,7],[395,8,395,9],[398,3,398,7],[399,1,400,2],[399,3,400,3],[399,4,400,4],[399,5,399,7],[399,9,400,9],[381,3,381,7],[372,8,372,9],[373,1,374,2],[373,3,374,3],[373,4,373,5],[342,3,342,7],[343,3,343,7],[344,3,344,7],[347,7,347,9],[350,3,350,7],[351,7,351,9],[333,8,333,9],[334,1,335,2],[334,3,335,3],[334,4,334,5],[334,6,334,7],[339,7,339,9],[329,0,366,0],[330,2,330,9],[331,1,332,3],[331,4,331,5],[332,4,332,5],[333,2,333,7],[364,3,364,7],[365,5,365,7],[348,7,348,8],[315,3,315,7],[317,8,317,9],[320,3,320,7],[321,1,322,2],[321,3,322,3],[321,4,322,4],[321,5,321,7],[321,9,322,9],[278,5,278,7],[278,9,279,9],[260,3,260,7],[261,3,261,7],[248,6,248,7],[257,7,257,9],[303,3,303,7],[304,3,304,7],[305,3,305,7],[308,7,308,9],[311,3,311,7],[312,7,312,9],[290,8,290,9],[291,1,292,2],[291,3,292,3],[291,4,291,5],[291,6,291,7],[300,7,300,9],[282,3,282,7],[283,5,283,7],[262,3,262,7],[265,7,265,9],[268,3,268,7],[269,7,269,9],[247,8,247,9],[248,1,249,2],[248,3,249,3],[248,4,248,5],[209,6,209,7],[214,7,214,9],[239,3,239,7],[240,5,240,7],[219,3,219,7],[222,7,222,9],[225,3,225,7],[226,7,226,9],[286,0,327,0],[287,2,287,9],[288,1,289,3],[288,4,288,5],[289,4,289,5],[290,2,290,7],[325,3,325,7],[326,5,326,7],[243,0,284,0],[244,2,244,9],[245,1,246,3],[245,4,245,5],[246,4,246,5],[247,2,247,7],[272,3,272,7],[274,8,274,9],[277,3,277,7],[278,1,279,2],[278,3,279,3],[278,4,279,4],[204,0,241,0],[205,2,205,9],[206,1,207,3],[206,4,206,5],[207,4,207,5],[208,2,208,7],[190,3,190,7],[192,8,192,9],[195,3,195,7],[196,1,197,2],[196,3,197,3],[196,4,197,4],[196,5,196,7],[196,9,197,9],[229,3,229,7],[231,8,231,9],[234,3,234,7],[235,1,236,2],[235,3,236,3],[235,4,236,4],[235,5,235,7],[235,9,236,9],[217,3,217,7],[218,3,218,7],[208,8,208,9],[209,1,210,2],[209,3,210,3],[209,4,209,5],[163,0,202,0],[200,3,200,7],[201,5,201,7],[178,3,178,7],[179,3,179,7],[180,3,180,7],[183,7,183,9],[186,3,186,7],[187,7,187,9],[167,8,167,9],[168,1,169,2],[168,3,169,3],[168,4,168,5],[168,6,168,7],[173,7,173,9],[164,2,164,9],[165,1,166,3],[165,4,165,5],[166,4,166,5],[167,2,167,7],[151,8,151,9],[154,3,154,7],[155,1,156,2],[155,3,156,3],[155,4,156,4],[155,5,155,7],[155,9,156,9],[136,3,136,7],[137,3,137,7],[140,7,140,9],[145,3,145,7],[146,7,146,9],[149,3,149,7],[127,1,128,2],[127,3,128,3],[127,4,127,5],[127,6,127,7],[132,7,132,9],[135,3,135,7],[119,5,119,7],[122,0,161,0],[123,2,123,9],[124,1,125,3],[124,4,124,5],[125,4,125,5],[126,2,126,7],[126,8,126,9],[159,3,159,7],[160,5,160,7],[114,1,115,2],[114,3,115,3],[114,4,115,4],[114,5,114,7],[114,9,115,9],[118,3,118,7],[93,7,93,9],[98,3,98,7],[101,7,101,9],[104,3,104,7],[105,7,105,9],[108,3,108,7],[83,0,120,0],[84,2,84,9],[85,1,86,3],[86,4,86,5],[87,2,87,7],[87,8,87,9],[88,1,89,2],[110,8,110,9],[113,3,113,7],[96,3,96,7],[97,3,97,7],[88,3,89,3],[88,4,88,5],[88,6,88,7],[79,3,79,7],[80,5,80,7],[85,4,85,5],[74,3,74,7],[75,1,76,2],[75,3,76,3],[75,4,76,4],[75,5,75,7],[75,9,76,9],[57,3,57,7],[60,7,60,9],[63,3,63,7],[64,7,64,9],[69,3,69,7],[71,8,71,9],[44,3,45,3],[44,4,44,5],[44,6,44,7],[49,7,49,9],[55,3,55,7],[56,3,56,7],[41,1,42,3],[41,4,41,5],[42,4,42,5],[43,2,43,7],[43,8,43,9],[44,1,45,2],[0,0,37,0],[3,4,3,5],[0,11,0,12],[1,11,1,12],[2,4,2,5],[1,2,1,9],[2,1,3,3],[31,3,32,3],[31,4,32,4],[31,5,31,7],[31,9,32,9],[35,3,35,7],[36,5,36,7],[10,7,10,9],[13,3,13,7],[14,3,14,7],[15,3,15,7],[18,7,18,9],[30,3,30,7],[31,1,32,2],[22,7,22,9],[25,3,25,7],[2,10,2,11],[1606,5,1606,7],[1606,9,1607,9],[1614,3,1614,7],[1615,5,1615,7],[27,8,27,9],[21,3,21,7],[4,2,4,7],[4,8,4,9],[5,1,6,2],[5,3,6,3],[5,4,5,5],[5,6,5,7],[447,0,496,0],[448,2,448,9],[449,1,450,3],[449,4,449,5],[450,4,450,5],[451,2,451,7],[451,8,451,9],[452,1,453,2],[452,3,453,3],[452,4,452,5],[452,6,452,7],[460,7,460,9],[462,3,462,7],[463,3,463,7],[464,3,464,7],[467,7,467,9],[475,3,475,7],[39,0,81,0],[40,2,40,9],[537,0,574,0],[1618,11,1618,12],[1620,4,1620,5],[1631,3,1631,7],[1632,3,1632,7],[1618,0,1667,0],[1619,2,1619,9],[1567,0,1616,0],[1567,11,1567,12],[1568,2,1568,9],[1568,11,1568,12],[1569,1,1570,3]],"merged_total":1104,"flags":["merged_cut"]}
[1,"1ª/GRD",{"$nulls":8},{"$f":"J37","v":20151.82},"Minas Gerais"]
[null,"OBRA:"," PAVIMENTAÇÃO ASFÁLTICA EM CBUQ - VIAS DIVERSAS - BAIRROS: N. SRA. DO ROSÁRIO, CÍCERO PASSOS E COMUNIDADE PERNAMBUCO - PIRAPORA-MG",{"$nulls":8}," Outubro/2024 "]
[null,"Custo Unitário de Referência",null,null,"Minas Gerais",{"$nulls":5},"QUANT.MATERIAL:",null,{"$f":"SUM(M20:M904)","v":{"$error":"#VALUE!"}},{"$f":"M3/(ORÇAMENTO!L42-ORÇAMENTO!L35)/(1+ORÇAMENTO!L6)","v":{"$error":"#VALUE!"}}]
[{"$nulls":4}," Outubro/2024 ",null,null,"Produção da equipe ",0.5,{"$f":"VLOOKUP(A1,ORÇAMENTO!$A$10:$L$42,7,1)","v":"GL"}]
[null,"CPU.1","MOBILIZAÇÃO E DESMOBILIZAÇÃO",{"$nulls":5},"Valores em reais (R$)"]
[null,"A - EQUIPAMENTOS",null,"Quantidade","Utilização",null,"Custo Horário",null,null,"Custo"]
{"$rows_left_out":1714}
{"sheet":"CPU-FORNEC","index":2,"n_rows":92,"n_cols":14,"rows_kept":92,"cut":false,"hidden":false,"merged":[[81,1,81,7],[82,0,91,0],[82,1,82,3],[82,4,82,7],[83,2,83,5],[84,2,84,3],[85,1,85,7],[88,1,88,3],[88,5,88,6],[89,1,89,6],[90,1,90,6],[91,1,91,6],[60,0,69,0],[60,1,60,3],[60,4,60,7],[61,2,61,5],[62,2,62,3],[63,1,63,7],[66,1,66,3],[66,5,66,6],[67,1,67,6],[68,1,68,6],[69,1,69,6],[38,0,47,0],[38,1,38,3],[38,4,38,7],[39,2,39,5],[40,2,40,3],[41,1,41,7],[44,1,44,3],[44,5,44,6],[45,1,45,6],[46,1,46,6],[47,1,47,6],[22,5,22,6],[23,1,23,6],[24,1,24,6],[25,1,25,6],[5,1,5,7],[9,1,9,7],[13,1,13,7],[17,1,17,7],[0,10,0,11],[1,2,1,5],[1,10,1,11],[2,2,2,3],[3,1,3,7],[27,4,27,7],[28,2,28,5],[27,0,36,0],[29,2,29,3],[30,1,30,7],[33,1,33,3],[33,5,33,6],[34,1,34,6],[35,1,35,6],[36,1,36,6],[0,0,26,0],[0,1,0,3],[0,4,0,7],[22,1,22,3],[49,0,58,0],[49,1,49,3],[49,4,49,7],[50,2,50,5],[51,2,51,3],[52,1,52,7],[55,1,55,3],[55,5,55,6],[56,1,56,6],[57,1,57,6],[58,1,58,6],[27,1,27,3],[71,0,80,0],[71,1,71,3],[71,4,71,7],[72,2,72,5],[73,2,73,3],[74,1,74,7],[77,1,77,3],[77,5,77,6],[78,1,78,6],[79,1,79,6],[80,1,80,6]]}
[1,"CODEVASF",null,null," COMPOSIÇÃO DE PREÇO UNITÁRIO",null,null,null,{"$f":"H24","v":0},{"$f":"H26","v":0},"BDI CALCULADO:",null,{"$f":"ORÇAMENTO!L6","v":15}]
[null,"OBRA:  ",{"$f":"ORÇAMENTO!C5","v":" PAVIMENTAÇÃO ASFÁLTICA EM CBUQ - VIAS DIVERSAS - BAIRROS: N. SRA. DO ROSÁRIO, CÍCERO PASSOS E COMUNIDADE PERNAMBUCO - PIRAPORA-MG"},null,null,null,"DATA: ",{"$f":"ORÇAMENTO!C6","v":" JANEIRO / 2025"},null,null,"BDI DIFERENCIADO:",null,{"$f":"'BDI FORN'!D31/100","v":0.15}]
[null,"SERVIÇO:  ",{"$f":"VLOOKUP(A1,ORÇAMENTO!A11:L30,3)","v":"CPU.1"},null,"Referência:",{"$f":"VLOOKUP(A1,ORÇAMENTO!$A$11:$L$30,4)","v":"CODEVASF"},"UNIDADE: ",{"$f":"VLOOKUP(A1,ORÇAMENTO!A11:L30,5)","v":"MOBILIZAÇÃO E DESMOBILIZAÇÃO"}]
[]
[null,"TIPO ITEM","CODIGO ITEM","DESCRIÇÃO ITEM","UNIDADE ITEM","COEFICIENTE","PRECO UNITARIO","CUSTO TOTAL",null,"distancia =",90,"B.DESPACHO"]
[null,"EQUIPAMENTOS",{"$nulls":7},"Pá carregadeira ",null,null,10.1," ton"]
{"$rows_left_out":87}
{"sheet":"BDI SERV","index":3,"n_rows":60,"n_cols":5,"rows_kept":60,"cut":false,"hidden":false,"merged":[[28,7,28,15],[35,0,35,5],[36,0,36,5],[38,1,38,4],[39,2,39,3],[0,1,2,4],[25,1,25,3],[26,1,26,2],[26,3,26,4],[27,3,27,4]]}
[null,"DETALHAMENTO DO BDI - SERVIÇOS"]
[]
[]
[null,"Item","Descrição dos Serviços","% - PV","% - CD"]
[]
[null,1,"ADMINISTRAÇÃO CENTRAL"," ",{"$f":"SUM(E7:E9)","v":4.01}]
{"$rows_left_out":55}
{"sheet":"BDI FORN","index":4,"n_rows":37,"n_cols":5,"rows_kept":37,"cut":false,"hidden":false,"merged":[[31,1,31,2],[32,0,34,5],[36,0,36,5],[0,1,2,4],[3,1,4,1],[3,2,4,2],[28,0,28,5],[30,1,30,2]]}
[null,"DETALHAMENTO DO BDI - FORNECIMENTO \n(MATERIAL ASFÁLTICO)"]
[]
[]
[null,"Item","Descrição dos Serviços","%","%"]
[null,null,null,"PV","CD"]
[]
{"$rows_left_out":32}
{"sheet":"CRONOGRAMA","index":5,"n_rows":19,"n_cols":12,"rows_kept":19,"cut":false,"hidden":false,"merged":[[0,1,0,11],[1,1,2,1],[1,2,2,4],[1,6,1,11],[2,6,2,11],[9,0,10,0],[9,1,10,1],[9,2,10,2],[3,1,3,10],[5,0,6,0],[5,1,6,1],[5,2,6,2],[7,0,8,0],[7,1,8,1],[7,2,8,2],[15,1,16,2],[18,1,22,11],[11,0,12,0],[11,1,12,1],[11,2,12,2],[13,0,14,0],[13,1,14,1],[13,2,14,2]]}
[null,"CRONOGRAMA FÍSICO-FINANCEIRO"]
[null,"OBRA: ",{"$f":"ORÇAMENTO!C5","v":" PAVIMENTAÇÃO ASFÁLTICA EM CBUQ - VIAS DIVERSAS - BAIRROS: N. SRA. DO ROSÁRIO, CÍCERO PASSOS E COMUNIDADE PERNAMBUCO - PIRAPORA-MG"},null,null,"VALOR:",{"$f":"ORÇAMENTO!L42","v":3597621.8699999996}]
[{"$nulls":5},"PRAZO: ","180 DIAS "]
[]
[null,"ITEM","ETAPAS/DESCRIÇAO","FISICO/  FINANCEIRO","TOTAL    ETAPAS","MÊS 1","MÊS 2","MÊS 3","MÊS 4","MÊS 5","MÊS 6","TOTAL"]
["A",{"$f":"VLOOKUP(A6,ORÇAMENTO!$A$10:$L$42,2)","v":1},{"$f":"VLOOKUP(A6,ORÇAMENTO!$A$10:$L$42,5)","v":"SERVIÇOS PRELIMINARES "},"FISICO ",{"$f":"ROUND(E7/$G$2,4)","v":6.4000000000000001E-2},0.25,0.15,0.15,0.15,0.15,0.15,{"$f":"SUM(F6:K6)","v":1}]
{"$rows_left_out":14}
{"sheet":"EAI","index":6,"n_rows":90,"n_cols":34,"rows_kept":90,"cut":false,"hidden":false,"merged":[[12,3,24,3],[1,2,3,26],[5,2,7,2],[5,12,7,12],[6,6,7,6],[6,19,6,20],[10,4,10,8],[10,9,10,10],[10,22,10,23],[5,6,5,7],[5,8,5,9],[6,21,6,24],[7,21,7,24]]}
[]
[null,null,"MEMÓRIA DE CÁLCULO"]
[]
[]
[]
[{"$nulls":6},"TIPOLOGIA DO MATERIAL",null,"Emulsão Asfáltica para Serviço de Imprimação",null,null,null,"IMPOSTOS","COFINS",6.4999999999999997E-3,6.4999999999999997E-3]
{"$rows_left_out":78}
{"sheet":"RR-1C","index":7,"n_rows":92,"n_cols":34,"rows_kept":92,"cut":false,"hidden":false,"merged":[[12,3,26,3],[6,19,6,20],[6,6,7,6],[5,12,7,12],[5,6,5,7],[5,8,5,9],[1,2,3,26],[5,2,7,2],[10,4,10,8],[10,9,10,10],[10,22,10,23],[6,21,6,24],[7,21,7,24]]}
[]
[null,null,"MEMÓRIA DE CÁLCULO"]
[]
[]
[]
[{"$nulls":6},"TIPOLOGIA DO MATERIAL",null,"EMULSÕES ASFÁLTICAS RR-1C",null,null,null,"IMPOSTOS","COFINS",6.4999999999999997E-3,6.4999999999999997E-3]
{"$rows_left_out":80}
{"sheet":"CAP","index":8,"n_rows":91,"n_cols":34,"rows_kept":91,"cut":false,"hidden":false,"merged":[[10,4,10,8],[10,9,10,10],[10,22,10,23],[12,3,24,3],[1,2,3,26],[5,2,7,2],[5,12,7,12],[6,6,7,6],[6,19,6,20],[6,21,6,24],[7,21,7,24],[5,6,5,7],[5,8,5,9]]}
[]
[null,null,"MEMÓRIA DE CÁLCULO"]
[]
[]
[]
[{"$nulls":6},"TIPOLOGIA DO MATERIAL",null,"CIMENTOS ASFÁLTICOS CAP-50-70",null,null,null,"IMPOSTOS","COFINS",6.4999999999999997E-3,6.4999999999999997E-3]
{"$rows_left_out":78}
{"sheet":"MAT.ASF","index":9,"n_rows":33,"n_cols":23,"rows_kept":33,"cut":false,"hidden":false,"merged":[[20,2,25,2],[27,2,32,2],[19,1,19,22],[26,1,26,22],[11,2,12,2],[11,3,11,6],[11,7,11,8],[11,18,11,19],[13,2,18,2],[7,1,7,19],[8,1,10,22],[2,1,2,8],[3,1,3,8],[4,1,4,8],[5,1,5,8],[6,1,6,22]]}
{"$rows_empty":8}
[null,"PLANILHA RESUMO - MATERIAIS ASFÁLTICOS"]
[]
[]
[null,"DATA-BASE","PRODUTOS","LOCALIDADES",null,null,null,"CUSTO ANP (R$/Kg)",null,"CUSTO ANP","IMPOSTOS DO PRODUTO","CUSTO DO PRODUTO COM IMPOSTOS","DMT's","DMT's","CUSTO DO TRANSPORTE TOTAL","ICMS","ATUALIZAÇÃO DO CUSTO DE TRANSPORTE","CUSTO DO TRANSPORTE RODOVIA PAVIMENTADA COM IMPOSTOS E ATUALIZAÇÃO MONETÁRIA","PEDÁGIO ",null,"TOTAL TRANSPORTE","TOTAL PRODUTO","TOTAL GERAL"]
[null,{"$f":"CAP!H9","v":"2024-12-01"},null,"REFINARIAS","ENDEREÇO","ORIGEM - REFINARIAS / DISTRIBUIDORAS","DESTINO","ESTADO","REGIÃO","R$/t","R$/t","R$/t","KM","KM","R$/t","R$/t","R$/t","R$/t","CUSTO POR EIXO","R$/t","R$/t","R$/t","R$/t"]
{"$rows_left_out":20}