{"text_format":"2","workbook":"xlsx","n_sheets":10,"sheets":["ORÇAMENTO","CPU-SERV","CPU-FORNEC","BDI SERV","BDI FORN","CRONOGRAMA","EAI","RR-1C","CAP","MAT.ASF"],"not_rendered":{"charts":0,"images":2,"macros":0,"external_links":2,"defined_names":12,"comments":5,"pivot_tables":0},"unopened":[],"bounds":{"document_bytes":16777216,"sheet_cells":100000,"run_cost":"one","rows_first":2000,"rows_last":500,"rows_between":2000,"halvings":0,"cell_chars":16384,"cell_head_chars":4096},"cells_cut":0,"cells_raw":0,"read":"whole","date_system":"1900"}

{"sheet":"ORÇAMENTO","index":0,"n_rows":42,"n_cols":12,"rows_kept":42,"cut":false,"hidden":false,"merged":[[7,1,7,11],[5,8,5,10],[0,0,8,0],[0,4,0,11],[1,4,1,11],[2,4,2,11],[6,1,6,4],[4,2,4,8],[4,9,4,10],[5,2,5,4],[6,8,6,10]]}
["<---- NUMERAR SERVIÇOS PARA CPU",null,null,null,"Ministério do Desenvolvimento Regional"]
[{"$nulls":4},"Companhia de Desenvolvimento dos Vales do São Francisco e do Parnaíba"]
[{"$nulls":4},"1ª Superintendência Regional"]
[]
[null,"OBRA: "," PAVIMENTAÇÃO ASFÁLTICA EM CBUQ - VIAS DIVERSAS - BAIRROS: N. SRA. DO ROSÁRIO, CÍCERO PASSOS E COMUNIDADE PERNAMBUCO - PIRAPORA-MG",{"$nulls":6},"BDI Serviços (%):",null,{"$f":"'BDI SERV'!E26","v":21.35}]
[null,"DATA:"," JANEIRO / 2025",{"$nulls":5},"BDI Diferenciado Serviços (%):",null,null,{"$f":"'BDI FORN'!D31","v":15}]
[null,"PRAZO DE EXECUÇÃO:     180 DIAS",{"$nulls":6},"BDI Fornecimentos (%):",null,null,{"$f":"'BDI FORN'!D31","v":15}]
[null,"PLANILHA DE ORÇAMENTAÇÃO"]
[null,"ITEM","CÓDIGO","FONTE","DISCRIMINAÇÃO","TIPO","UNID.","QUANT.","VR.UNIT.S/BDI","PR. UNIT.C/BDI","C. TOT.S/BDI","P. TOT.C/BDI"]
["A",1,null,null,"SERVIÇOS PRELIMINARES ",{"$nulls":5},{"$f":"SUM(K11:K15)","v":189849.84000000003},{"$f":"SUM(L11:L15)","v":230323.19000000003}]
[1,"1.1","CPU.1","CODEVASF","MOBILIZAÇÃO E DESMOBILIZAÇÃO","SERV","GL",1,{"$f":"VLOOKUP(A11,'CPU-SERV'!A:K,11,0)","v":20151.82},{"$f":"TRUNC(_xlfn.IFS(F11=\"SERV\",I11*(1+$L$5/100),F11=\"SERV DIF\",I11*(1+$L$6/100),F11=\"FORN\",I11*(1+$L$7/100)),2)","v":24454.23},{"$f":"TRUNC(H11*I11,2)","v":20151.82},{"$f":"TRUNC(H11*J11,2)","v":24454.23}]
[2,"1.2","CPU.2","CODEVASF","ADMINISTRAÇÃO LOCAL ","SERV","GL",1,{"$f":"VLOOKUP(A12,'CPU-SERV'!A:K,11,0)","v":142227.89000000001},{"$f":"TRUNC(_xlfn.IFS(F12=\"SERV\",I12*(1+$L$5/100),F12=\"SERV DIF\",I12*(1+$L$6/100),F12=\"FORN\",I12*(1+$L$7/100)),2)","v":172593.54},{"$f":"TRUNC(H12*I12,2)","v":142227.89000000001},{"$f":"TRUNC(H12*J12,2)","v":172593.54}]
[3,"1.3","CPU.3","CODEVASF","CANTEIRO DE OBRAS ","SERV","GL",1,{"$f":"VLOOKUP(A13,'CPU-SERV'!A:K,11,0)","v":13851.99},{"$f":"TRUNC(_xlfn.IFS(F13=\"SERV\",I13*(1+$L$5/100),F13=\"SERV DIF\",I13*(1+$L$6/100),F13=\"FORN\",I13*(1+$L$7/100)),2)","v":16809.38},13851.99,16809.38]
[4,"1.4",103689,"SINAPI","PLACA DE OBRA EM CHAPA DE AÇO GALVANIZADO","SERV","M2",6,{"$f":"VLOOKUP(A14,'CPU-SERV'!A:K,11,0)","v":349.69},{"$f":"TRUNC(_xlfn.IFS(F14=\"SERV\",I14*(1+$L$5/100),F14=\"SERV DIF\",I14*(1+$L$6/100),F14=\"FORN\",I14*(1+$L$7/100)),2)","v":424.34},2098.14,2546.04]
[6,"1.5",78472,"SINAPI","SERVIÇOS TOPOGRÁFICOS PARA PAVIMENTAÇÃO, INCLUSIVE LEVANTAMENTO PLANIALTIMÉTRICO CADASTRAL, GERAÇÃO DE NOTAS DE SERVIÇO, SEÇÕES TRANSVERSAIS E GREIDE, ESTAQUEAMENTO E ACOMPANHAMENTO EXECUTIVO","SERV","M2",24000.000000000004,{"$f":"VLOOKUP(A15,'CPU-SERV'!A:K,11,0)","v":0.48},{"$f":"TRUNC(_xlfn.IFS(F15=\"SERV\",I15*(1+$L$5/100),F15=\"SERV DIF\",I15*(1+$L$6/100),F15=\"FORN\",I15*(1+$L$7/100)),2)","v":0.57999999999999996},11520,13920]
["B",2,null,null,"TERRAPLANAGEM E PAVIMENTAÇÃO",{"$nulls":5},{"$f":"SUM(K17:K22)","v":994547.8},{"$f":"SUM(L17:L22)","v":1206500.3999999999}]
[7,"2.1",5502140,"SICRO","ESCAVAÇÃO, CARGA E TRANSPORTE DE MATERIAL DE 1ª CATEGORIA - DMT 1.000 A 1.200M, CAMINHO DE SERVIÇO EM REVESTIMENTO PRIMÁRIO","SERV","M3",3600,{"$f":"VLOOKUP(A17,'CPU-SERV'!A:K,11,0)","v":6.59},{"$f":"TRUNC(_xlfn.IFS(F17=\"SERV\",I17*(1+$L$5/100),F17=\"SERV DIF\",I17*(1+$L$6/100),F17=\"FORN\",I17*(1+$L$7/100)),2)","v":7.99},{"$f":"TRUNC(H17*I17,2)","v":23724},{"$f":"TRUNC(H17*J17,2)","v":28764}]
[9,"2.2",4011209,"SICRO","REGULARIZAÇÃO E COMPACTAÇÃO DO SUBLEITO ","SERV","M2",24000.000000000004,{"$f":"VLOOKUP(A18,'CPU-SERV'!A:K,11,0)","v":1.1399999999999999},{"$f":"TRUNC(_xlfn.IFS(F18=\"SERV\",I18*(1+$L$5/100),F18=\"SERV DIF\",I18*(1+$L$6/100),F18=\"FORN\",I18*(1+$L$7/100)),2)","v":1.38},{"$f":"TRUNC(H18*I18,2)","v":27360},{"$f":"TRUNC(H18*J18,2)","v":33120}]
[10,"2.3","4011256a","SICRO","EXECUÇÃO E COMPACTAÇÃO DE BASE E OU SUB ESTABILIZADA GRANULOMETRICAMENTE COM MISTURA SOLO BRITA (50%-50%), NA PISTA COM MATERIAL DE JAZIDA E BRITA COMERCIAL","SERV","M3",3600,{"$f":"VLOOKUP(A19,'CPU-SERV'!A:K,11,0)","v":133.88},{"$f":"TRUNC(_xlfn.IFS(F19=\"SERV\",I19*(1+$L$5/100),F19=\"SERV DIF\",I19*(1+$L$6/100),F19=\"FORN\",I19*(1+$L$7/100)),2)","v":162.46},481968,584856]
[12,"2.4",4011352,"SICRO","IMPRIMAÇÃO COM EMULSÃO ASFÁLTICA (EAI)","SERV","M2",24000.000000000004,{"$f":"VLOOKUP(A20,'CPU-SERV'!A:K,11,0)","v":0.39},{"$f":"TRUNC(_xlfn.IFS(F20=\"SERV\",I20*(1+$L$5/100),F20=\"SERV DIF\",I20*(1+$L$6/100),F20=\"FORN\",I20*(1+$L$7/100)),2)","v":0.47},9360,11280]
[13,"2.5",4011353,"SICRO","PINTURA DE LIGAÇÃO COM EMULSÃO ASFÁLTICA RR-1C","SERV","M2",22200,{"$f":"VLOOKUP(A21,'CPU-SERV'!A:K,11,0)","v":0.27},{"$f":"TRUNC(_xlfn.IFS(F21=\"SERV\",I21*(1+$L$5/100),F21=\"SERV DIF\",I21*(1+$L$6/100),F21=\"FORN\",I21*(1+$L$7/100)),2)","v":0.32},5994,7104]
[14,"2.6",4011463,"SICRO","EXECUÇÃO DE PAVIMENTO COM APLICAÇÃO DE CONCRETO ASFÁLTICO USINADO A QUENTE (CBUQ), CAMADA DE ROLAMENTO - EXCLUSIVE TRANSPORTE","SERV","T",1940,{"$f":"VLOOKUP(A22,'CPU-SERV'!A:K,11,0)","v":229.97},{"$f":"TRUNC(_xlfn.IFS(F22=\"SERV\",I22*(1+$L$5/100),F22=\"SERV DIF\",I22*(1+$L$6/100),F22=\"FORN\",I22*(1+$L$7/100)),2)","v":279.06},{"$f":"TRUNC(H22*I22,2)","v":446141.8},{"$f":"TRUNC(H22*J22,2)","v":541376.4}]
["C",3,null,null,"TRANSPORTE DE MATERIAIS",{"$nulls":5},{"$f":"SUM(K24:K28)","v":726815.48},{"$f":"SUM(L24:L28)","v":875905.48}]
[15,"3.1",5915321,"SICRO","TRANSPORTE COM CAMINHÃO BASCULANTE, EM RODOVIA PAVIMENTADA","SERV","TXKM",500000.00379999989,{"$f":"VLOOKUP(A24,'CPU-SERV'!A:K,11,0)","v":0.64},{"$f":"TRUNC(_xlfn.IFS(F24=\"SERV\",I24*(1+$L$5/100),F24=\"SERV DIF\",I24*(1+$L$6/100),F24=\"FORN\",I24*(1+$L$7/100)),2)","v":0.77},{"$f":"TRUNC(H24*I24,2)","v":320000},{"$f":"TRUNC(H24*J24,2)","v":385000}]
[16,"3.2",5915320,"SICRO","TRANSPORTE COM CAMINHÃO BASCULANTE, RODOVIA EM REVESTIMENTO PRIMÁRIO","SERV","TXKM",16499.995800000001,{"$f":"VLOOKUP(A25,'CPU-SERV'!A:K,11,0)","v":0.7},{"$f":"TRUNC(_xlfn.IFS(F25=\"SERV\",I25*(1+$L$5/100),F25=\"SERV DIF\",I25*(1+$L$6/100),F25=\"FORN\",I25*(1+$L$7/100)),2)","v":0.84},11549.99,13859.99]
[17,"3.3",5914434,"SICRO","TRANSPORTE COM CAMINHÃO CARROCERIA 9T, EM VIA URBANA PREDOMINANTEMENTE PAVIMENTADA","SERV","TXKM",599.99506240000017,{"$f":"VLOOKUP(A26,'CPU-SERV'!A:K,11,0)","v":0.73},{"$f":"TRUNC(_xlfn.IFS(F26=\"SERV\",I26*(1+$L$5/100),F26=\"SERV DIF\",I26*(1+$L$6/100),F26=\"FORN\",I26*(1+$L$7/100)),2)","v":0.88},437.99,527.99]
[18,"3.4",5914612,"SICRO","TRANSPORTE DE MASSA ASFÁLTICA COM CAMINHÃO BASCULANTE, EM VIA URBANA PREDOMINANTEMENTE PAVIMENTADA","SERV","TXKM",340000,{"$f":"VLOOKUP(A27,'CPU-SERV'!A:K,11,0)","v":1.1599999999999999},{"$f":"TRUNC(_xlfn.IFS(F27=\"SERV\",I27*(1+$L$5/100),F27=\"SERV DIF\",I27*(1+$L$6/100),F27=\"FORN\",I27*(1+$L$7/100)),2)","v":1.4},394400,476000]
[19,"3.5",5914622,"SICRO","TRANSPORTE COM CAMINHÃO TANQUE DE TRANSPORTE DE MATERIAL ASFÁLTICO DE 30000 L, EM VIA URBANA PREDOMINANTEMENTE PAVIMENTADA","SERV","TXKM",250,{"$f":"VLOOKUP(A28,'CPU-SERV'!A:K,11,0)","v":1.71},{"$f":"TRUNC(_xlfn.IFS(F28=\"SERV\",I28*(1+$L$5/100),F28=\"SERV DIF\",I28*(1+$L$6/100),F28=\"FORN\",I28*(1+$L$7/100)),2)","v":2.0699999999999998},427.5,517.5]
["E",4,null,null,"DRENAGEM E OBRAS COMPLEMENTARES",{"$nulls":5},{"$f":"SUM(K30:K34)","v":381958.91},{"$f":"SUM(L30:L34)","v":463426.86}]
[20,"4.1",94267,"SINAPI","GUIA (MEIO-FIO) E SARJETA CONJUGADOS DE CONCRETO, MOLDADA IN LOCO COM EXTRUSORA, 45 CM BASE (15 CM BASE DA GUIA + 30 CM BASE DA SARJETA) X 22 CM ALTURA","SERV","M",6000.0000000000009,{"$f":"VLOOKUP(A30,'CPU-SERV'!A:K,11,0)","v":48.29},{"$f":"TRUNC(_xlfn.IFS(F30=\"SERV\",I30*(1+$L$5/100),F30=\"SERV DIF\",I30*(1+$L$6/100),F30=\"FORN\",I30*(1+$L$7/100)),2)","v":58.59},{"$f":"TRUNC(H30*I30,2)","v":289740},{"$f":"TRUNC(H30*J30,2)","v":351540}]
[23,"4.2",94263,"SINAPI","GUIA (MEIO FIO) EM CONCRETO, MOLDADO IN LOCO COM EXTRUSORA - 13CM DE BASE X 22CM DE ALTURA","SERV","M",1200,{"$f":"VLOOKUP(A31,'CPU-SERV'!A:K,11,0)","v":24.06},{"$f":"TRUNC(_xlfn.IFS(F31=\"SERV\",I31*(1+$L$5/100),F31=\"SERV DIF\",I31*(1+$L$6/100),F31=\"FORN\",I31*(1+$L$7/100)),2)","v":29.19},28872,35028]
[46,"4.3",5213440,"SICRO","PLACA DE REGULAMENTAÇÃO EM AÇO, D=60CM - PELÍCULA RETRORREFLETIVA - FORNECIMENTO E INSTALAÇÃO, INCLUSIVE  SUPORTE","SERV","UN.",24,{"$f":"VLOOKUP(A32,'CPU-SERV'!A:K,11,0)","v":256.2},{"$f":"TRUNC(_xlfn.IFS(F32=\"SERV\",I32*(1+$L$5/100),F32=\"SERV DIF\",I32*(1+$L$6/100),F32=\"FORN\",I32*(1+$L$7/100)),2)","v":310.89},6148.8,7461.36]
[49,"4.4",5213401,"SICRO","PINTURA DE EIXO VIÁRIO SOBRE ASFALTO COM TINTA RETRORREFLETIVA A BASE DE RESINA ACRÍLICA COM MICROESFERAS DE VIDRO, APLICAÇÃO MECÂNICA COM DEMARCADORA AUTOPROPELIDA","SERV","M2",1099.9974999999999,{"$f":"VLOOKUP(A33,'CPU-SERV'!A:K,11,0)","v":32.409999999999997},{"$f":"TRUNC(_xlfn.IFS(F33=\"SERV\",I33*(1+$L$5/100),F33=\"SERV DIF\",I33*(1+$L$6/100),F33=\"FORN\",I33*(1+$L$7/100)),2)","v":39.32},35650.910000000003,43251.9]
[51,"4.5",5213405,"SICRO","PINTURA DE FAIXA DE PEDESTRE OU ZEBRADA TINTA RETRORREFLETIVA A BASE DE RESINA ACRÍLICA COM MICROESFERAS DE VIDRO, APLICAÇÃO MANUAL","SERV","M2",480,{"$f":"VLOOKUP(A34,'CPU-SERV'!A:K,11,0)","v":44.89},{"$f":"TRUNC(_xlfn.IFS(F34=\"SERV\",I34*(1+$L$5/100),F34=\"SERV DIF\",I34*(1+$L$6/100),F34=\"FORN\",I34*(1+$L$7/100)),2)","v":54.47},21547.200000000001,26145.599999999999]
["F",5,null,null,"FORNECIMENTOS - MATERIAL ASFÁLTICO (BDI DIFERENCIADO)",{"$nulls":5},{"$f":"SUM(K36:K41)","v":714319.6},{"$f":"SUM(L36:L41)","v":821465.94000000006}]
["F1","5.1","CPU.7","ANP","AQUISIÇÃO DE EMULSÃO ASFÁLTICA PARA IMPRIMAÇÃO (EAI) - EXCLUSIVE TRANSPORTE","FORN","T",32.000000000000007,{"$f":"VLOOKUP(A36,'CPU-FORNEC'!A:J,9,0)","v":3275.67},{"$f":"TRUNC(_xlfn.IFS(F36=\"SERV\",I36*(1+$L$5/100),F36=\"SERV DIF\",I36*(1+$L$6/100),F36=\"FORN\",I36*(1+$L$7/100)),2)","v":3767.02},{"$f":"TRUNC(H36*I36,2)","v":104821.44},{"$f":"TRUNC(H36*J36,2)","v":120544.64}]
["F2","5.2","CPU.8","CODEVASF","TRANSPORTE DE EMULSÃO ASFÁLTICA PARA IMPRIMAÇÃO (EAI)","SERV DIF","T",32.000000000000007,{"$f":"VLOOKUP(A37,'CPU-FORNEC'!A:J,9,0)","v":323.18},{"$f":"TRUNC(_xlfn.IFS(F37=\"SERV\",I37*(1+$L$5/100),F37=\"SERV DIF\",I37*(1+$L$6/100),F37=\"FORN\",I37*(1+$L$7/100)),2)","v":371.65},10341.76,11892.8]
["F3","5.3","CPU.9","ANP","AQUISIÇÃO DE EMULSAO ASFALTICA CATIONICA RR-1C - EXCLUSIVE TRANSPORTE","FORN","T",10,{"$f":"VLOOKUP(A38,'CPU-FORNEC'!A:J,9,0)","v":3478},{"$f":"TRUNC(_xlfn.IFS(F38=\"SERV\",I38*(1+$L$5/100),F38=\"SERV DIF\",I38*(1+$L$6/100),F38=\"FORN\",I38*(1+$L$7/100)),2)","v":3999.7},34780,39997]
["F4","5.4","CPU.10","CODEVASF","TRANSPORTE DE EMULSÃO ASFÁLTICA CATIONICA RR-1C","SERV DIF","T",10,{"$f":"VLOOKUP(A39,'CPU-FORNEC'!A:J,9,0)","v":338.96},{"$f":"TRUNC(_xlfn.IFS(F39=\"SERV\",I39*(1+$L$5/100),F39=\"SERV DIF\",I39*(1+$L$6/100),F39=\"FORN\",I39*(1+$L$7/100)),2)","v":389.8},3389.6,3898]
["F5","5.5","CPU.11","ANP","AQUISIÇÃO DE CONCRETO ASFÁLTICO DE PETRÓLEO - CAP 50/70 - EXCLUSIVE TRANSPORTE","FORN","T",110,{"$f":"VLOOKUP(A40,'CPU-FORNEC'!A:J,9,0)","v":4719.13},{"$f":"TRUNC(_xlfn.IFS(F40=\"SERV\",I40*(1+$L$5/100),F40=\"SERV DIF\",I40*(1+$L$6/100),F40=\"FORN\",I40*(1+$L$7/100)),2)","v":5426.99},519104.3,596968.9]
["F6","5.6","CPU.12","CODEVASF","TRANSPORTE DE CONCRETO ASFÁLTICO DE PETRÓLEO - CAP 50/70","SERV DIF","T",110,{"$f":"VLOOKUP(A41,'CPU-FORNEC'!A:J,9,0)","v":380.75},{"$f":"TRUNC(_xlfn.IFS(F41=\"SERV\",I41*(1+$L$5/100),F41=\"SERV DIF\",I41*(1+$L$6/100),F41=\"FORN\",I41*(1+$L$7/100)),2)","v":437.86},41882.5,48164.6]
[{"$nulls":4},"TOTAL GERAL DA OBRA COM BDI ",{"$nulls":5},{"$f":"SUM(K10,K16,K23,K29,K35)","v":3007491.6300000004},{"$f":"SUM(L10,L16,L23,L29,L35)","v":3597621.8699999996}]

{"sheet":"CPU-SERV","index":1,"n_rows":1719,"n_cols":16,"rows_kept":1719,"cut":false,"hidden":false,"merged":[[1516,11,1516,12],[1517,2,1517,9],[1517,11,1517,12],[1483,7,1483,9],[1489,3,1489,7],[1490,7,1490,9],[1518,1,1519,3],[1518,4,1518,5],[1519,4,1519,5],[1520,2,1520,7],[1494,3,1494,7],[1496,8,1496,9],[1503,3,1503,7],[1504,1,1505,2],[1504,3,1505,3],[1504,4,1505,4],[1504,5,1504,7],[1504,9,1505,9],[1563,3,1563,7],[1564,5,1564,7],[1545,3,1545,7],[1547,8,1547,9],[1554,3,1554,7],[1555,1,1556,2],[1555,3,1556,3],[1555,4,1556,4],[1555,5,1555,7],[1555,9,1556,9],[1540,3,1540,7],[1541,7,1541,9],[1469,2,1469,7],[1512,3,1512,7],[1513,5,1513,7],[1516,0,1565,0],[1438,3,1438,7],[1439,7,1439,9],[1529,3,1529,7],[1530,3,1530,7],[1531,3,1531,7],[1534,7,1534,9],[1526,7,1526,9],[1424,7,1424,9],[1478,3,1478,7],[1479,3,1479,7],[1480,3,1480,7],[1363,0,1412,0],[1465,0,1514,0],[1469,8,1469,9],[1470,1,1471,2],[1470,3,1471,3],[1470,4,1470,5],[1470,6,1470,7],[1475,7,1475,9],[1461,3,1461,7],[1462,5,1462,7],[1520,8,1520,9],[1521,1,1522,2],[1521,3,1522,3],[1521,4,1521,5],[1521,6,1521,7],[1467,4,1467,5],[1468,4,1468,5],[1363,11,1363,12],[1364,2,1364,9],[1364,11,1364,12],[1365,1,1366,3],[1365,4,1365,5],[1366,4,1366,5],[1367,2,1367,7],[1410,3,1410,7],[1411,5,1411,7],[1414,0,1463,0],[1414,11,1414,12],[1415,2,1415,9],[1415,11,1415,12],[1416,1,1417,3],[1416,4,1416,5],[1417,4,1417,5],[1418,2,1418,7],[1392,3,1392,7],[1394,8,1394,9],[1401,3,1401,7],[1402,1,1403,2],[1402,3,1403,3],[1419,1,1420,2],[1419,3,1420,3],[1419,4,1419,5],[1419,6,1419,7],[1453,5,1453,7],[1453,9,1454,9],[1427,3,1427,7],[1428,3,1428,7],[1429,3,1429,7],[1432,7,1432,9],[1465,11,1465,12],[1466,2,1466,9],[1466,11,1466,12],[1467,1,1468,3],[1402,4,1403,4],[1402,5,1402,7],[1402,9,1403,9],[1443,3,1443,7],[1445,8,1445,9],[1452,3,1452,7],[1453,1,1454,2],[1453,3,1454,3],[1453,4,1454,4],[1418,8,1418,9],[1317,3,1318,3],[1317,4,1317,5],[1317,6,1317,7],[1322,7,1322,9],[1376,3,1376,7],[1377,3,1377,7],[1378,3,1378,7],[1381,7,1381,9],[1387,3,1387,7],[1388,7,1388,9],[1367,8,1367,9],[1368,1,1369,2],[1368,3,1369,3],[1368,4,1368,5],[1368,6,1368,7],[1373,7,1373,9],[1359,3,1359,7],[1360,5,1360,7],[1312,0,1361,0],[1312,11,1312,12],[1313,2,1313,9],[1313,11,1313,12],[1314,1,1315,3],[1314,4,1314,5],[1315,4,1315,5],[1316,2,1316,7],[1290,3,1290,7],[1292,8,1292,9],[1299,3,1299,7],[1300,1,1301,2],[1300,3,1301,3],[1300,4,1301,4],[1300,5,1300,7],[1300,9,1301,9],[1341,3,1341,7],[1343,8,1343,9],[1350,3,1350,7],[1351,1,1352,2],[1351,3,1352,3],[1351,4,1352,4],[1351,5,1351,7],[1351,9,1352,9],[1325,3,1325,7],[1326,3,1326,7],[1327,3,1327,7],[1330,7,1330,9],[1336,3,1336,7],[1337,7,1337,9],[1316,8,1316,9],[1317,1,1318,2],[1279,7,1279,9],[1285,3,1285,7],[1286,7,1286,9],[1265,8,1265,9],[1266,1,1267,2],[1266,3,1267,3],[1266,4,1266,5],[1266,6,1266,7],[1271,7,1271,9],[1257,3,1257,7],[1258,5,1258,7],[1261,0,1310,0],[1261,11,1261,12],[1262,2,1262,9],[1262,11,1262,12],[1263,1,1264,3],[1263,4,1263,5],[1264,4,1264,5],[1265,2,1265,7],[1308,3,1308,7],[1309,5,1309,7],[1274,3,1274,7],[1275,3,1275,7],[1276,3,1276,7],[1249,5,1249,7],[1249,9,1250,9],[1223,3,1223,7],[1224,3,1224,7],[1225,3,1225,7],[1228,7,1228,9],[1234,3,1234,7],[1235,7,1235,9],[1214,8,1214,9],[1215,1,1216,2],[1215,3,1216,3],[1215,4,1215,5],[1215,6,1215,7],[1220,7,1220,9],[1113,3,1114,3],[1113,4,1113,5],[1113,6,1113,7],[1118,7,1118,9],[1172,3,1172,7],[1173,3,1173,7],[1174,3,1174,7],[1177,7,1177,9],[1183,3,1183,7],[1184,7,1184,9],[1163,8,1163,9],[1164,1,1165,2],[1164,3,1165,3],[1164,4,1164,5],[1164,6,1164,7],[1169,7,1169,9],[1155,3,1155,7],[1156,5,1156,7],[1159,0,1208,0],[1159,11,1159,12],[1160,2,1160,9],[1160,11,1160,12],[1161,1,1162,3],[1161,4,1161,5],[1162,4,1162,5],[1163,2,1163,7],[1206,3,1206,7],[1207,5,1207,7],[1210,0,1259,0],[1210,11,1210,12],[1211,2,1211,9],[1211,11,1211,12],[1212,1,1213,3],[1212,4,1212,5],[1213,4,1213,5],[1214,2,1214,7],[1188,3,1188,7],[1190,8,1190,9],[1197,3,1197,7],[1198,1,1199,2],[1198,3,1199,3],[1198,4,1199,4],[1198,5,1198,7],[1198,9,1199,9],[1239,3,1239,7],[1241,8,1241,9],[1248,3,1248,7],[1249,1,1250,2],[1249,3,1250,3],[1249,4,1250,4],[1108,0,1157,0],[1108,11,1108,12],[1109,2,1109,9],[1109,11,1109,12],[1110,1,1111,3],[1110,4,1110,5],[1111,4,1111,5],[1112,2,1112,7],[1086,3,1086,7],[1088,8,1088,9],[1095,3,1095,7],[1096,1,1097,2],[1096,3,1097,3],[1096,4,1097,4],[1096,5,1096,7],[1096,9,1097,9],[1137,3,1137,7],[1139,8,1139,9],[1146,3,1146,7],[1147,1,1148,2],[1147,3,1148,3],[1147,4,1148,4],[1147,5,1147,7],[1147,9,1148,9],[1121,3,1121,7],[1122,3,1122,7],[1059,4,1059,5],[1060,4,1060,5],[1061,2,1061,7],[1104,3,1104,7],[1105,5,1105,7],[1045,5,1045,7],[1045,9,1046,9],[1019,3,1019,7],[1020,3,1020,7],[1021,3,1021,7],[1024,7,1024,9],[1030,3,1030,7],[1031,7,1031,9],[1123,3,1123,7],[1126,7,1126,9],[1132,3,1132,7],[1133,7,1133,9],[1112,8,1112,9],[1113,1,1114,2],[1075,7,1075,9],[1081,3,1081,7],[1082,7,1082,9],[1061,8,1061,9],[1062,1,1063,2],[1062,3,1063,3],[1062,4,1062,5],[1062,6,1062,7],[1067,7,1067,9],[1053,3,1053,7],[1054,5,1054,7],[1016,7,1016,9],[1070,3,1070,7],[1071,3,1071,7],[1072,3,1072,7],[955,0,1004,0],[955,11,955,12],[956,2,956,9],[956,11,956,12],[957,1,958,3],[957,4,957,5],[958,4,958,5],[959,2,959,7],[1002,3,1002,7],[1003,5,1003,7],[1006,0,1055,0],[1006,11,1006,12],[1007,2,1007,9],[1007,11,1007,12],[1008,1,1009,3],[1008,4,1008,5],[1009,4,1009,5],[1010,2,1010,7],[984,3,984,7],[986,8,986,9],[993,3,993,7],[994,1,995,2],[994,3,995,3],[1057,0,1106,0],[1057,11,1057,12],[1058,2,1058,9],[1058,11,1058,12],[1059,1,1060,3],[994,4,995,4],[994,5,994,7],[994,9,995,9],[1035,3,1035,7],[1037,8,1037,9],[1044,3,1044,7],[1045,1,1046,2],[1045,3,1046,3],[1045,4,1046,4],[909,3,910,3],[909,4,909,5],[909,6,909,7],[914,7,914,9],[968,3,968,7],[969,3,969,7],[970,3,970,7],[973,7,973,9],[979,3,979,7],[980,7,980,9],[959,8,959,9],[960,1,961,2],[960,3,961,3],[960,4,960,5],[960,6,960,7],[965,7,965,9],[951,3,951,7],[952,5,952,7],[1010,8,1010,9],[1011,1,1012,2],[1011,3,1012,3],[1011,4,1011,5],[1011,6,1011,7],[904,0,953,0],[904,11,904,12],[905,2,905,9],[905,11,905,12],[906,1,907,3],[906,4,906,5],[907,4,907,5],[908,2,908,7],[886,3,886,7],[888,8,888,9],[893,3,893,7],[894,1,895,2],[894,3,895,3],[894,4,895,4],[894,5,894,7],[894,9,895,9],[933,3,933,7],[935,8,935,9],[942,3,942,7],[943,1,944,2],[943,3,944,3],[943,4,944,4],[943,5,943,7],[943,9,944,9],[917,3,917,7],[918,3,918,7],[919,3,919,7],[922,7,922,9],[928,3,928,7],[929,7,929,9],[908,8,908,9],[909,1,910,2],[848,3,849,3],[848,4,849,4],[848,5,848,7],[848,9,849,9],[871,3,871,7],[872,3,872,7],[873,3,873,7],[876,7,876,9],[882,3,882,7],[883,7,883,9],[862,8,862,9],[863,1,864,2],[863,3,864,3],[863,4,863,5],[863,6,863,7],[868,7,868,9],[858,0,902,0],[859,2,859,9],[860,1,861,3],[860,4,860,5],[861,4,861,5],[862,2,862,7],[900,3,900,7],[901,5,901,7],[808,3,808,7],[809,5,809,7],[773,0,810,0],[774,2,774,9],[775,1,776,3],[775,4,775,5],[776,4,776,5],[777,2,777,7],[825,3,825,7],[826,3,826,7],[827,3,827,7],[830,7,830,9],[836,3,836,7],[837,7,837,9],[816,8,816,9],[817,1,818,2],[817,3,818,3],[817,4,817,5],[817,6,817,7],[822,7,822,9],[812,0,856,0],[813,2,813,9],[814,1,815,3],[814,4,814,5],[815,4,815,5],[816,2,816,7],[854,3,854,7],[855,5,855,7],[840,3,840,7],[842,8,842,9],[847,3,847,7],[848,1,849,2],[765,3,766,3],[765,4,766,4],[765,5,765,7],[765,9,766,9],[798,3,798,7],[800,8,800,9],[803,3,803,7],[804,1,805,2],[804,3,805,3],[804,4,805,4],[804,5,804,7],[804,9,805,9],[786,3,786,7],[787,3,787,7],[788,3,788,7],[791,7,791,9],[794,3,794,7],[795,7,795,9],[777,8,777,9],[778,1,779,2],[778,3,779,3],[778,4,778,5],[778,6,778,7],[783,7,783,9],[729,3,729,7],[730,5,730,7],[693,0,731,0],[694,2,694,9],[695,1,696,3],[695,4,695,5],[696,4,696,5],[697,2,697,7],[747,3,747,7],[748,3,748,7],[749,3,749,7],[752,7,752,9],[755,3,755,7],[756,7,756,9],[737,8,737,9],[738,1,739,2],[738,3,739,3],[738,4,738,5],[738,6,738,7],[743,7,743,9],[733,0,771,0],[734,2,734,9],[735,1,736,3],[735,4,735,5],[736,4,736,5],[737,2,737,7],[769,3,769,7],[770,5,770,7],[759,3,759,7],[761,8,761,9],[764,3,764,7],[765,1,766,2],[685,3,686,3],[685,4,686,4],[685,5,685,7],[685,9,686,9],[719,3,719,7],[721,8,721,9],[724,3,724,7],[725,1,726,2],[725,3,726,3],[725,4,726,4],[725,5,725,7],[725,9,726,9],[707,3,707,7],[708,3,708,7],[709,3,709,7],[712,7,712,9],[715,3,715,7],[716,7,716,9],[697,8,697,9],[698,1,699,2],[698,3,699,3],[698,4,698,5],[698,6,698,7],[703,7,703,9],[667,3,667,7],[668,3,668,7],[669,3,669,7],[672,7,672,9],[675,3,675,7],[676,7,676,9],[658,8,658,9],[659,1,660,2],[659,3,660,3],[659,4,659,5],[659,6,659,7],[664,7,664,9],[650,3,650,7],[651,5,651,7],[654,0,691,0],[655,2,655,9],[656,1,657,3],[656,4,656,5],[657,4,657,5],[658,2,658,7],[689,3,689,7],[690,5,690,7],[615,0,652,0],[616,2,616,9],[617,1,618,3],[617,4,617,5],[618,4,618,5],[619,2,619,7],[679,3,679,7],[681,8,681,9],[684,3,684,7],[685,1,686,2],[640,3,640,7],[642,8,642,9],[645,3,645,7],[646,1,647,2],[646,3,647,3],[646,4,647,4],[646,5,646,7],[646,9,647,9],[628,3,628,7],[629,3,629,7],[630,3,630,7],[633,7,633,9],[636,3,636,7],[637,7,637,9],[619,8,619,9],[620,1,621,2],[620,3,621,3],[620,4,620,5],[620,6,620,7],[625,7,625,9],[598,7,598,9],[580,8,580,9],[581,1,582,2],[581,3,582,3],[581,4,581,5],[581,6,581,7],[586,7,586,9],[533,3,533,7],[534,5,534,7],[576,0,613,0],[577,2,577,9],[578,1,579,3],[578,4,578,5],[579,4,579,5],[580,2,580,7],[611,3,611,7],[612,5,612,7],[498,0,535,0],[499,2,499,9],[500,1,501,3],[500,4,500,5],[501,4,501,5],[601,3,601,7],[603,8,603,9],[606,3,606,7],[607,1,608,2],[607,3,608,3],[607,4,608,4],[607,5,607,7],[607,9,608,9],[512,3,512,7],[513,3,513,7],[516,7,516,9],[519,3,519,7],[520,7,520,9],[502,8,502,9],[503,1,504,2],[503,3,504,3],[503,4,503,5],[503,6,503,7],[508,7,508,9],[589,3,589,7],[590,3,590,7],[591,3,591,7],[594,7,594,9],[597,3,597,7],[502,2,502,7],[435,8,435,9],[438,3,438,7],[439,1,440,2],[439,3,440,3],[439,4,440,4],[439,5,439,7],[439,9,440,9],[487,1,488,2],[487,3,488,3],[487,4,488,4],[487,5,487,7],[487,9,488,9],[494,3,494,7],[478,3,478,7],[480,8,480,9],[486,3,486,7],[511,3,511,7],[472,7,472,8],[495,5,495,7],[523,3,523,7],[525,8,525,9],[528,3,528,7],[529,1,530,2],[529,3,530,3],[529,4,530,4],[529,5,529,7],[529,9,530,9],[373,6,373,7],[378,7,378,9],[421,3,421,7],[422,3,422,7],[423,3,423,7],[426,7,426,9],[429,3,429,7],[430,7,430,9],[411,8,411,9],[412,1,413,2],[412,3,413,3],[412,4,412,5],[412,6,412,7],[418,7,418,9],[403,3,403,7],[404,5,404,7],[382,3,382,7],[383,3,383,7],[386,7,386,9],[389,3,389,7],[390,7,390,9],[476,7,476,9],[433,3,433,7],[407,0,445,0],[408,2,408,9],[409,1,410,3],[409,4,409,5],[410,4,410,5],[411,2,411,7],[443,3,443,7],[444,5,444,7],[387,7,387,8],[368,0,405,0],[369,2,369,9],[370,1,371,3],[370,4,370,5],[371,4,371,5],[372,2,372,7],[354,3,354,7],[356,8,356,9],[359,3,359,7],[360,1,361,2],[360,3,361,3],[360,4,361,4],[360,5,360,7],[360,9,361,9],[393,3,393,7],[395,8,395,9],[398,3,398,7],[399,1,400,2],[399,3,400,3],[399,4,400,4],[399,5,399,7],[399,9,400,9],[381,3,381,7],[372,8,372,9],[373,1,374,2],[373,3,374,3],[373,4,373,5],[342,3,342,7],[343,3,343,7],[344,3,344,7],[347,7,347,9],[350,3,350,7],[351,7,351,9],[333,8,333,9],[334,1,335,2],[334,3,335,3],[334,4,334,5],[334,6,334,7],[339,7,339,9],[329,0,366,0],[330,2,330,9],[331,1,332,3],[331,4,331,5],[332,4,332,5],[333,2,333,7],[364,3,364,7],[365,5,365,7],[348,7,348,8],[315,3,315,7],[317,8,317,9],[320,3,320,7],[321,1,322,2],[321,3,322,3],[321,4,322,4],[321,5,321,7],[321,9,322,9],[278,5,278,7],[278,9,279,9],[260,3,260,7],[261,3,261,7],[248,6,248,7],[257,7,257,9],[303,3,303,7],[304,3,304,7],[305,3,305,7],[308,7,308,9],[311,3,311,7],[312,7,312,9],[290,8,290,9],[291,1,292,2],[291,3,292,3],[291,4,291,5],[291,6,291,7],[300,7,300,9],[282,3,282,7],[283,5,283,7],[262,3,262,7],[265,7,265,9],[268,3,268,7],[269,7,269,9],[247,8,247,9],[248,1,249,2],[248,3,249,3],[248,4,248,5],[209,6,209,7],[214,7,214,9],[239,3,239,7],[240,5,240,7],[219,3,219,7],[222,7,222,9],[225,3,225,7],[226,7,226,9],[286,0,327,0],[287,2,287,9],[288,1,289,3],[288,4,288,5],[289,4,289,5],[290,2,290,7],[325,3,325,7],[326,5,326,7],[243,0,284,0],[244,2,244,9],[245,1,246,3],[245,4,245,5],[246,4,246,5],[247,2,247,7],[272,3,272,7],[274,8,274,9],[277,3,277,7],[278,1,279,2],[278,3,279,3],[278,4,279,4],[204,0,241,0],[205,2,205,9],[206,1,207,3],[206,4,206,5],[207,4,207,5],[208,2,208,7],[190,3,190,7],[192,8,192,9],[195,3,195,7],[196,1,197,2],[196,3,197,3],[196,4,197,4],[196,5,196,7],[196,9,197,9],[229,3,229,7],[231,8,231,9],[234,3,234,7],[235,1,236,2],[235,3,236,3],[235,4,236,4],[235,5,235,7],[235,9,236,9],[217,3,217,7],[218,3,218,7],[208,8,208,9],[209,1,210,2],[209,3,210,3],[209,4,209,5],[163,0,202,0],[200,3,200,7],[201,5,201,7],[178,3,178,7],[179,3,179,7],[180,3,180,7],[183,7,183,9],[186,3,186,7],[187,7,187,9],[167,8,167,9],[168,1,169,2],[168,3,169,3],[168,4,168,5],[168,6,168,7],[173,7,173,9],[164,2,164,9],[165,1,166,3],[165,4,165,5],[166,4,166,5],[167,2,167,7],[151,8,151,9],[154,3,154,7],[155,1,156,2],[155,3,156,3],[155,4,156,4],[155,5,155,7],[155,9,156,9],[136,3,136,7],[137,3,137,7],[140,7,140,9],[145,3,145,7],[146,7,146,9],[149,3,149,7],[127,1,128,2],[127,3,128,3],[127,4,127,5],[127,6,127,7],[132,7,132,9],[135,3,135,7],[119,5,119,7],[122,0,161,0],[123,2,123,9],[124,1,125,3],[124,4,124,5],[125,4,125,5],[126,2,126,7],[126,8,126,9],[159,3,159,7],[160,5,160,7],[114,1,115,2],[114,3,115,3],[114,4,115,4],[114,5,114,7],[114,9,115,9],[118,3,118,7],[93,7,93,9],[98,3,98,7],[101,7,101,9],[104,3,104,7],[105,7,105,9],[108,3,108,7],[83,0,120,0],[84,2,84,9],[85,1,86,3],[86,4,86,5],[87,2,87,7],[87,8,87,9],[88,1,89,2],[110,8,110,9],[113,3,113,7],[96,3,96,7],[97,3,97,7],[88,3,89,3],[88,4,88,5],[88,6,88,7],[79,3,79,7],[80,5,80,7],[85,4,85,5],[74,3,74,7],[75,1,76,2],[75,3,76,3],[75,4,76,4],[75,5,75,7],[75,9,76,9],[57,3,57,7],[60,7,60,9],[63,3,63,7],[64,7,64,9],[69,3,69,7],[71,8,71,9],[44,3,45,3],[44,4,44,5],[44,6,44,7],[49,7,49,9],[55,3,55,7],[56,3,56,7],[41,1,42,3],[41,4,41,5],[42,4,42,5],[43,2,43,7],[43,8,43,9],[44,1,45,2],[0,0,37,0],[3,4,3,5],[0,11,0,12],[1,11,1,12],[2,4,2,5],[1,2,1,9],[2,1,3,3],[31,3,32,3],[31,4,32,4],[31,5,31,7],[31,9,32,9],[35,3,35,7],[36,5,36,7],[10,7,10,9],[13,3,13,7],[14,3,14,7],[15,3,15,7],[18,7,18,9],[30,3,30,7],[31,1,32,2],[22,7,22,9],[25,3,25,7],[2,10,2,11],[1606,5,1606,7],[1606,9,1607,9],[1614,3,1614,7],[1615,5,1615,7],[27,8,27,9],[21,3,21,7],[4,2,4,7],[4,8,4,9],[5,1,6,2],[5,3,6,3],[5,4,5,5],[5,6,5,7],[447,0,496,0],[448,2,448,9],[449,1,450,3],[449,4,449,5],[450,4,450,5],[451,2,451,7],[451,8,451,9],[452,1,453,2],[452,3,453,3],[452,4,452,5],[452,6,452,7],[460,7,460,9],[462,3,462,7],[463,3,463,7],[464,3,464,7],[467,7,467,9],[475,3,475,7],[39,0,81,0],[40,2,40,9],[537,0,574,0],[1618,11,1618,12],[1620,4,1620,5],[1631,3,1631,7],[1632,3,1632,7],[1618,0,1667,0],[1619,2,1619,9],[1567,0,1616,0],[1567,11,1567,12],[1568,2,1568,9],[1568,11,1568,12],[1569,1,1570,3]],"merged_total":1104,"flags":["merged_cut"]}
[1,"1ª/GRD",{"$nulls":8},{"$f":"J37","v":20151.82},"Minas Gerais"]
[null,"OBRA:"," PAVIMENTAÇÃO ASFÁLTICA EM CBUQ - VIAS DIVERSAS - BAIRROS: N. SRA. DO ROSÁRIO, CÍCERO PASSOS E COMUNIDADE PERNAMBUCO - PIRAPORA-MG",{"$nulls":8}," Outubro/2024 "]
[null,"Custo Unitário de Referência",null,null,"Minas Gerais",{"$nulls":5},"QUANT.MATERIAL:",null,{"$f":"SUM(M20:M904)","v":{"$error":"#VALUE!"}},{"$f":"M3/(ORÇAMENTO!L42-ORÇAMENTO!L35)/(1+ORÇAMENTO!L6)","v":{"$error":"#VALUE!"}}]
[{"$nulls":4}," Outubro/2024 ",null,null,"Produção da equipe ",0.5,{"$f":"VLOOKUP(A1,ORÇAMENTO!$A$10:$L$42,7,1)","v":"GL"}]
[null,"CPU.1","MOBILIZAÇÃO E DESMOBILIZAÇÃO",{"$nulls":5},"Valores em reais (R$)"]
[null,"A - EQUIPAMENTOS",null,"Quantidade","Utilização",null,"Custo Horário",null,null,"Custo"]
[{"$nulls":4},"Operativa","Improdutiva","Produtivo","Improdutivo",null,"Horário Total"]
[null,"E9687","Caminhão carroceria com capacidade de 5 t - 115 kW",8,0.6,0.4,142.93629999999999,55.767499999999998,null,{"$f":"D8*(E8*G8+F8*H8)","v":864.55023999999992},null,"distancia =",175,"MOC - PIRAPORA"]
[null,"E9575","Caminhão basculante com caçamba estanque com capacidade de 14 m³ - 210 kW",8,1,0,303.24970000000002,88.600399999999993,null,{"$f":"D9*(E9*G9+F9*H9)","v":2425.9976000000001},null,"Pá carregadeira ",null,null,10.1," ton"]
[{"$nulls":7},"Custo horário total de equipamentos",null,{"$f":"SUM(J8:J9)","v":3290.5478400000002},null,"Motoniveladora ",null,null,12.47," ton"]
[null,"B - MÃO DE OBRA",null,"Quantidade","Unidade",null,"Custo Horário","Custo Horário Total",null,null,null,"Trator de pneus",null,null,2.8," ton"]
[null,"P9824","Servente",16,"h",null,20.631399999999999,null,null,{"$f":"D12*G12","v":330.10239999999999},null,"Rolo Compactador ",null,null,15.33," ton"]
[{"$nulls":9},{"$f":"D13*G13","v":0},null,"Grade de disco",null,null,1," ton"]
[null,null,null,"Custo horário total de mão de obra",{"$nulls":5},{"$f":"SUM(J12:J13)","v":330.10239999999999},null,"Vibroacabadora",null,null,17.5," ton"]
[null,null,null,"Custo horário total de execução",{"$nulls":5},{"$f":"J10+J14","v":3620.6502399999999},null,"RETROESCAVADEIRA",null,null,6.67," ton"]
[null,null,null,"Custo unitário de execução",{"$nulls":5},{"$f":"J15/I4","v":7241.3004799999999},null,"MOBILIZAÇÃO + DESMOBILIZAÇÃO DOS EQUIPTOS",null,null,{"$f":"SUM(O9:O15)*M8","v":11527.25},"ton.km"]
[{"$nulls":7},"Custo do FIC",null,0]
[{"$nulls":7},"Custo do FIT",null,0]
[null,"C - MATERIAL",null,"Quantidade","Unidade",null,"Preço Unitário","Custo Unitário"]
[null,"-",0,null,0,null,0,null,null,{"$f":"D20*G20","v":0},null,{"$f":"VLOOKUP(A1,ORÇAMENTO!A$11:L$42,6,FALSE)","v":"SERV"},{"$f":"J20*L20","v":{"$error":"#VALUE!"}}]
[null,"-",0,null,0,null,0,null,null,{"$f":"D21*G21","v":0},null,{"$f":"VLOOKUP(A1,ORÇAMENTO!A$11:L$42,6,FALSE)","v":"SERV"},{"$f":"J21*L21","v":{"$error":"#VALUE!"}}]
[null,null,null,"Custo unitário total de material",{"$nulls":5},{"$f":"SUM(J20:J21)","v":0}]
[null,"D - ATIVIDADES AUXILIARES",null,"Quantidade","Unidade",null,"Custo Unitário","Custo Unitário"]
[null,5914640,"Transporte com cavalo mecânico com semirreboque com capacidade de 30 t - rodovia pavimentada",23054.5,"tkm",null,0.56000000000000005,null,null,{"$f":"D24*G24","v":12910.52}]
[null,"-",0,0,0,null,0,null,null,{"$f":"D25*G25","v":0}]
[null,null,null,"Custo total de atividades auxiliares",{"$nulls":5},{"$f":"SUM(J24:J25)","v":12910.52}]
[{"$nulls":7},"Subtotal",null,{"$f":"J16+J22+J26+J17+J18","v":20151.820480000002}]
[null,"E - TEMPO FIXO",null,"Código","Quantidade","Unidade",null,"Custo Unitário","Custo Unitário"]
[null,"-",0,"-",null,0,null,0,null,{"$f":"ROUNDDOWN(E29*H29,4)","v":0}]
[null,"-",0,"-",null,0,null,0,null,{"$f":"ROUNDDOWN(E30*H30,4)","v":0}]
[null,null,null,"Custo unitário total de tempo fixo",{"$nulls":5},{"$f":"SUM(J29:J30)","v":0}]
[null,"F - MOMENTO DE TRANSPORTE",null,"Quantidade","Unidade","DMT",null,null,null,"Custo Unitário"]
[{"$nulls":5},"LN","RP","P"]
[null,"-",0,null,"tkm"]
[null,"-",0,null,"tkm"]
[null,null,null,"Custo unitário total de transporte"]
[{"$nulls":5},"Custo unitário direto total",null,null,null,{"$f":"TRUNC(J27+J31,2)","v":20151.82}]
[null,"Obs."]
[]
[{"$f":"A1+1","v":2},"1ª/GRD",{"$nulls":8},{"$f":"J81","v":142227.89000000001}]
[null,"OBRA:"," PAVIMENTAÇÃO ASFÁLTICA EM CBUQ - VIAS DIVERSAS - BAIRROS: N. SRA. DO ROSÁRIO, CÍCERO PASSOS E COMUNIDADE PERNAMBUCO - PIRAPORA-MG"]
[null,"Custo Unitário de Referência",null,null,"Minas Gerais"]
[{"$nulls":4}," Outubro/2024 ",null,null,"Produção da equipe ",0.16666666666666666,{"$f":"VLOOKUP(A40,ORÇAMENTO!$A$10:$L$42,7,1)","v":"GL"},"6 MESES",{"$f":"ORÇAMENTO!L42","v":3597621.8699999996}]
[null,"CPU.2","ADMINISTRAÇÃO LOCAL ",{"$nulls":5},"Valores em reais (R$)"]
[null,"A - EQUIPAMENTOS",null,"Quantidade","Utilização",null,"Custo Horário",null,null,"Custo"]
[{"$nulls":4},"Operativa","Improdutiva","Produtivo","Improdutivo",null,"Horário Total"]
[null,"-",0,null,null,null,0,0,null,{"$f":"D47*(E47*G47+F47*H47)","v":0}]
[null,"-",0,null,null,null,0,0,null,{"$f":"D48*(E48*G48+F48*H48)","v":0}]
[{"$nulls":7},"Custo horário total de equipamentos",null,{"$f":"SUM(J47:J48)","v":0}]
[null,"B - MÃO DE OBRA",null,"Quantidade","Unidade",null,"Custo Horário","Custo Horário Total"]
[null,"P9812","Engenheiro",0.2468727582048626,"mês",null,25688.310600000001,null,null,{"$f":"D51*G51","v":6341.7440914452091},{"$f":"ORÇAMENTO!L42","v":3597621.8699999996}]
[null,"P9840","Encarregado geral",1,"mês",null,9786.5214749999996,null,null,{"$f":"D52*G52","v":9786.5214749999996}]
[null,"P9876","Técnico de segurança do trabalho",0.5,"mês",null,5758.8393750000005,null,null,2879.4196875000002]
[null,"P9858","Laboratorista",0.5,"mês",null,4732.1862000000001,null,null,2366.0931]
[null,"P9806","Auxiliar administrativo",0.5,"mês",null,3275.7017999999998,null,null,1637.8508999999999]
[null,null,null,"Custo horário total de mão de obra",{"$nulls":5},{"$f":"SUM(J51:J55)","v":23011.629253945208}]
[null,null,null,"Custo horário total de execução",{"$nulls":5},{"$f":"J49+J56","v":23011.629253945208}]
[null,null,null,"Custo unitário de execução",{"$nulls":5},{"$f":"J57/I43","v":138069.77552367127}]
[{"$nulls":7},"Custo do FIC",null,"-"]
[{"$nulls":7},"Custo do FIT",null,"-"]
[null,"C - MATERIAL",null,"Quantidade","Unidade",null,"Preço Unitário","Custo Unitário"]
[null,"-",0,0,0,null,0,null,null,{"$f":"D62*G62","v":0},null,{"$f":"VLOOKUP(A40,ORÇAMENTO!A$11:L$42,6,FALSE)","v":"SERV"},{"$f":"J62*L62","v":{"$error":"#VALUE!"}}]
[null,"-",0,0,0,null,0,null,null,0,null,{"$f":"VLOOKUP(A40,ORÇAMENTO!A$11:L$42,6,FALSE)","v":"SERV"},{"$f":"J63*L63","v":{"$error":"#VALUE!"}}]
[null,null,null,"Custo unitário total de material",{"$nulls":5},{"$f":"SUM(J62:J63)","v":0}]
[null,"D - ATIVIDADES AUXILIARES",null,"Quantidade","Unidade",null,"Custo Unitário","Custo Unitário"]
[null,14250,"Energia Elétrica",360,"kwh",null,0.95,null,null,{"$f":"D66*G66","v":342}]
[null,44480,"Tarifa A - Água e Esgoto",24,"m³",null,17.97,null,null,{"$f":"D67*G67","v":431.28}]
[null,5212560,"Placa de advertência para sinalização de obras montada em suporte metálico móvel, lado 1,00 m - utilização de 600 ciclos - fornecimento, 01 implantação e 01 retirada diária",792,"un.dia",null,3.82,null,null,{"$f":"D68*G68","v":3025.44}]
[null,"Cotação","Telefone",6,"mês",null,59.9,null,null,{"$f":"D69*G69","v":359.4}]
[null,null,null,"Custo total de atividades auxiliares",{"$nulls":5},{"$f":"SUM(J66:J69)","v":4158.12}]
[{"$nulls":7},"Subtotal",null,{"$f":"J58+J64+J70","v":142227.89552367126}]
[null,"E - TEMPO FIXO",null,"Código","Quantidade","Unidade",null,"Custo Unitário","Custo Unitário"]
[null,"-",0,"-",0,"t",null,0,null,{"$f":"ROUNDDOWN(E73*H73,4)","v":0}]
[null,"-",0,"-",0,"t",null,0,null,{"$f":"ROUNDDOWN(E74*H74,4)","v":0}]
[null,null,null,"Custo unitário total de tempo fixo",{"$nulls":5},{"$f":"SUM(J73:J74)","v":0}]
[null,"F - MOMENTO DE TRANSPORTE",null,"Quantidade","Unidade","DMT",null,null,null,"Custo Unitário"]
[{"$nulls":5},"LN","RP","P"]
[null,"-",0,null,"tkm"]
[null,"-",0,null,"tkm"]
[null,null,null,"Custo unitário total de transporte"]
[{"$nulls":5},"Custo unitário direto total",null,null,null,{"$f":"TRUNC(J71+J75,2)","v":142227.89000000001}]
[null,"Obs."]
[]
[{"$f":"A40+1","v":3},"1ª/GRD",{"$nulls":8},{"$f":"J120","v":13851.99}]
[null,"OBRA:"," PAVIMENTAÇÃO ASFÁLTICA EM CBUQ - VIAS DIVERSAS - BAIRROS: N. SRA. DO ROSÁRIO, CÍCERO PASSOS E COMUNIDADE PERNAMBUCO - PIRAPORA-MG"]
[null,"Custo Unitário de Referência",null,null,"Minas Gerais"]
[{"$nulls":4}," Outubro/2024 ",null,null,"Produção da equipe ",1,{"$f":"VLOOKUP(A84,ORÇAMENTO!$A$10:$L$42,7,1)","v":"GL"}]
[null,"CPU.3","CANTEIRO DE OBRAS ",{"$nulls":5},"Valores em reais (R$)"]
[null,"A - EQUIPAMENTOS",null,"Quantidade","Utilização",null,"Custo Horário",null,null,"Custo"]
[{"$nulls":4},"Operativa","Improdutiva","Produtivo","Improdutivo",null,"Horário Total"]
[null,"-",0,null,null,null,0,0,null,{"$f":"D91*(E91*G91+F91*H91)","v":0}]
[null,"-",0,null,null,null,0,0,null,{"$f":"D92*(E92*G92+F92*H92)","v":0}]
[{"$nulls":7},"Custo horário total de equipamentos",null,{"$f":"SUM(J91:J92)","v":0}]
[null,"B - MÃO DE OBRA",null,"Quantidade","Unidade",null,"Custo Horário","Custo Horário Total"]
[null,"P9824","Servente",8,"h",null,20.631399999999999,null,null,{"$f":"D95*G95","v":165.05119999999999}]
[null,"P9808","Carpinteiro",8,"h",null,25.901299999999999,null,null,{"$f":"D96*G96","v":207.21039999999999}]
[null,null,null,"Custo horário total de mão de obra",{"$nulls":5},{"$f":"SUM(J95:J96)","v":372.26159999999999}]
[null,null,null,"Custo horário total de execução",{"$nulls":5},{"$f":"J93+J97","v":372.26159999999999}]
[null,null,null,"Custo unitário de execução",{"$nulls":5},{"$f":"J98/I87","v":372.26159999999999}]
[{"$nulls":7},"Custo do FIC",null,"-"]
[{"$nulls":7},"Custo do FIT",null,"-"]
[null,"C - MATERIAL",null,"Quantidade","Unidade",null,"Preço Unitário","Custo Unitário"]
[null,"M0053","Tela plástica em polipropileno na cor laranja para tapume - L = 1,2 m",100,"m",null,1.8223,null,null,{"$f":"D103*G103","v":182.23},null,{"$f":"VLOOKUP(A84,ORÇAMENTO!A$11:L$42,6,FALSE)","v":"SERV"},{"$f":"J103*L103","v":{"$error":"#VALUE!"}}]
[null,"-",0,0,0,null,0,null,null,{"$f":"D104*G104","v":0},null,{"$f":"VLOOKUP(A84,ORÇAMENTO!A$11:L$42,6,FALSE)","v":"SERV"},{"$f":"J104*L104","v":{"$error":"#VALUE!"}}]
[null,null,null,"Custo unitário total de material",{"$nulls":5},{"$f":"SUM(J103:J104)","v":182.23}]
[null,"D - ATIVIDADES AUXILIARES",null,"Quantidade","Unidade",null,"Custo Unitário","Custo Unitário"]
[null,10775,"Locação de container 2,30 X 6,00 m, alt. 2,50 m, com 1 sanitário, para escritório, completo, sem divisórias internas",6,"mês",null,985,null,null,{"$f":"D107*G107","v":5910}]
[null,10779,"Locação de container 2,30 X 4,30 m, alt. 2,50 M, p/ sanitário, c/ 5 bacias, 1 lavatório e 4 mictórios",6,"mês",null,1231.25,null,null,{"$f":"D108*G108","v":7387.5}]
[null,null,null,"Custo total de atividades auxiliares",{"$nulls":5},{"$f":"SUM(J107:J108)","v":13297.5}]
[{"$nulls":7},"Subtotal",null,{"$f":"J99+J105+J109","v":13851.991599999999}]
[null,"E - TEMPO FIXO",null,"Código","Quantidade","Unidade",null,"Custo Unitário","Custo Unitário"]
[null,"-",0,"-",0,"t",null,0,null,{"$f":"ROUNDDOWN(E112*H112,4)","v":0}]
[null,"-",0,"-",0,"t",null,0,null,{"$f":"ROUNDDOWN(E113*H113,4)","v":0}]
[null,null,null,"Custo unitário total de tempo fixo",{"$nulls":5},{"$f":"SUM(J112:J113)","v":0}]
[null,"F - MOMENTO DE TRANSPORTE",null,"Quantidade","Unidade","DMT",null,null,null,"Custo Unitário"]
[{"$nulls":5},"LN","RP","P"]
[null,"-",0,0,"tkm"]
[null,"-",0,0,"tkm"]
[null,null,null,"Custo unitário total de transporte"]
[{"$nulls":5},"Custo unitário direto total",null,null,null,{"$f":"TRUNC(J110+J114,2)","v":13851.99}]
[null,"Obs."]
[]
[{"$f":"A84+1","v":4},"1ª/GRD",{"$nulls":8},{"$f":"J161","v":349.69}]
[null,"OBRA:"," PAVIMENTAÇÃO ASFÁLTICA EM CBUQ - VIAS DIVERSAS - BAIRROS: N. SRA. DO ROSÁRIO, CÍCERO PASSOS E COMUNIDADE PERNAMBUCO - PIRAPORA-MG"]
[null,"Custo Unitário de Referência",null,null,"Minas Gerais"]
[{"$nulls":4}," Outubro/2024 ",null,null,"Produção da equipe ",1,{"$f":"VLOOKUP(A123,ORÇAMENTO!$A$10:$L$42,7,1)","v":"M2"}]
[null,103689,"PLACA DE OBRA EM CHAPA DE AÇO GALVANIZADO",{"$nulls":5},"Valores em reais (R$)"]
[null,"A - EQUIPAMENTOS",null,"Quantidade","Utilização",null,"Custo Horário",null,null,"Custo"]
[{"$nulls":4},"Operativa","Improdutiva","Produtivo","Improdutivo",null,"Horário Total"]
[null,"-",0,null,null,null,0,0,null,{"$f":"D130*(E130*G130+F130*H130)","v":0}]
[null,"-",0,null,null,null,0,0,null,{"$f":"D131*(E131*G131+F131*H131)","v":0}]
[{"$nulls":7},"Custo horário total de equipamentos",null,{"$f":"SUM(J130:J131)","v":0}]
[null,"B - MÃO DE OBRA",null,"Quantidade","Unidade",null,"Custo Horário","Custo Horário Total"]
[null,"P9824","Servente",1.1186,"h",null,20.631399999999999,null,null,{"$f":"D134*G134","v":23.07828404}]
[null,"P9808","Carpinteiro",0.37290000000000001,"h",null,25.901299999999999,null,null,{"$f":"D135*G135","v":9.6585947700000006}]
[null,null,null,"Custo horário total de mão de obra",{"$nulls":5},{"$f":"SUM(J134:J135)","v":32.73687881}]
[null,null,null,"Custo horário total de execução",{"$nulls":5},{"$f":"J132+J136","v":32.73687881}]
[null,null,null,"Custo unitário de execução",{"$nulls":5},{"$f":"J137/I126","v":32.73687881}]
[{"$nulls":7},"Custo do FIC",null,"-"]
[{"$nulls":7},"Custo do FIT",null,"-"]
[null,"C - MATERIAL",null,"Quantidade","Unidade",null,"Preço Unitário","Custo Unitário"]
[null,"M1358","Sarrafo em madeira de terceira - E = 2,5 cm e L = 5 cm",6.4165999999999999,"m",null,2.0499999999999998,null,null,{"$f":"D142*G142","v":13.154029999999999},null,{"$f":"VLOOKUP(A$123,ORÇAMENTO!A$11:L$42,6,FALSE)","v":"SERV"},{"$f":"J142*L142","v":{"$error":"#VALUE!"}}]
[null,"M1205","Prego de ferro",2.4500000000000001E-2,"kg",null,16.54,null,null,{"$f":"D143*G143","v":0.40522999999999998},null,{"$f":"VLOOKUP(A$123,ORÇAMENTO!A$11:L$42,6,FALSE)","v":"SERV"},{"$f":"J143*L143","v":{"$error":"#VALUE!"}}]
[null,"M0998","Madeira estrutural de eucalipto",2.2608E-2,"m³",null,2361.8182000000002,null,null,{"$f":"D144*G144","v":53.395985865600004},null,{"$f":"VLOOKUP(A$123,ORÇAMENTO!A$11:L$42,6,FALSE)","v":"SERV"},{"$error":"#VALUE!"}]
[null,4813,"Placa de obra (para construção civil) em chapa galvanizada *N. 22*, adesivada, de *2,4 X 1,2* m (sem postes para fixação)",1,"m²",null,250,null,null,250,null,{"$f":"VLOOKUP(A$123,ORÇAMENTO!A$11:L$42,6,FALSE)","v":"SERV"},{"$error":"#VALUE!"}]
[null,null,null,"Custo unitário total de material",{"$nulls":5},{"$f":"SUM(J142:J145)","v":316.95524586559998}]
[null,"D - ATIVIDADES AUXILIARES",null,"Quantidade","Unidade",null,"Custo Unitário","Custo Unitário"]
[null,"-",0,0,0,null,0,null,null,{"$f":"D148*G148","v":0}]
[null,"-",0,0,0,null,0,null,null,{"$f":"D149*G149","v":0}]
[null,null,null,"Custo total de atividades auxiliares",{"$nulls":5},{"$f":"SUM(J148:J149)","v":0}]
[{"$nulls":7},"Subtotal",null,{"$f":"J138+J146+J150","v":349.69212467559998}]
[null,"E - TEMPO FIXO",null,"Código","Quantidade","Unidade",null,"Custo Unitário","Custo Unitário"]
[null,"-",0,"-",0,"t",null,0,null,{"$f":"ROUNDDOWN(E153*H153,4)","v":0}]
[null,"-",0,"-",0,"t",null,0,null,{"$f":"ROUNDDOWN(E154*H154,4)","v":0}]
[null,null,null,"Custo unitário total de tempo fixo",{"$nulls":5},{"$f":"SUM(J153:J154)","v":0}]
[null,"F - MOMENTO DE TRANSPORTE",null,"Quantidade","Unidade","DMT",null,null,null,"Custo Unitário"]
[{"$nulls":5},"LN","RP","P"]
[null,"-",0,0,"tkm"]
[null,"-",0,0,"tkm"]
[null,null,null,"Custo unitário total de transporte"]
[{"$nulls":5},"Custo unitário direto total",null,null,null,{"$f":"TRUNC(J151+J155,2)","v":349.69}]
[null,"Obs."]
[]
[6,"1ª/GRD",{"$nulls":8},{"$f":"J202","v":0.48}]
[null,"OBRA:"," PAVIMENTAÇÃO ASFÁLTICA EM CBUQ - VIAS DIVERSAS - BAIRROS: N. SRA. DO ROSÁRIO, CÍCERO PASSOS E COMUNIDADE PERNAMBUCO - PIRAPORA-MG"]
[null,"Custo Unitário de Referência",null,null,"Minas Gerais"]
[{"$nulls":4}," Outubro/2024 ",null,null,"Produção da equipe ",1,{"$f":"VLOOKUP(A164,ORÇAMENTO!$A$10:$L$42,7,1)","v":"M2"}]
[null,78472,"SERVIÇOS TOPOGRÁFICOS PARA PAVIMENTAÇÃO, INCLUSIVE LEVANTAMENTO PLANIALTIMÉTRICO CADASTRAL, GERAÇÃO DE NOTAS DE SERVIÇO, SEÇÕES TRANSVERSAIS E GREIDE, ESTAQUEAMENTO E ACOMPANHAMENTO EXECUTIVO",{"$nulls":5},"Valores em reais (R$)"]
[null,"A - EQUIPAMENTOS",null,"Quantidade","Utilização",null,"Custo Horário",null,null,"Custo"]
[{"$nulls":4},"Operativa","Improdutiva","Produtivo","Improdutivo",null,"Horário Total"]
[null,92145,"Caminhonete cabine simples com motor 1.6 flex, câmbio manual, potência 101/104 cv, 2 portas",5.0000000000000001E-4,1,0,76.5,0,null,{"$f":"D171*(E171*G171+F171*H171)","v":3.8249999999999999E-2}]
[null,"-",0,0,1,0,0,0,null,{"$f":"D172*(E172*G172+F172*H172)","v":0}]
[{"$nulls":7},"Custo horário total de equipamentos",null,{"$f":"SUM(J171:J172)","v":3.8249999999999999E-2}]
[null,"B - MÃO DE OBRA",null,"Quantidade","Unidade",null,"Custo Horário","Custo Horário Total"]
[null,"P9949","Topógrafo",1.590909090909091E-5,"mês",null,6687.3099000000002,27.863791250000002,null,{"$f":"D175*G175","v":0.10638902113636364}]
[null,"P9950","Auxiliar de topografia",1.590909090909091E-5,"mês",null,6143.6953000000003,22.75442703703704,null,{"$f":"D176*G176","v":9.7740607045454564E-2}]
[null,"P9824","Servente",7.4999999999999997E-3,"h",null,20.631399999999999,8.5964166666666661E-2,null,{"$f":"D177*G177","v":0.1547355}]
[null,"P9848","Desenhista",9.090909090909091E-6,"mês",null,9985.8701999999994,36.984704444444439,null,{"$f":"D178*G178","v":9.0780638181818182E-2}]
[null,null,null,"Custo horário total de mão de obra",{"$nulls":5},{"$f":"SUM(J175:J178)","v":0.4496457663636364}]
[null,null,null,"Custo horário total de execução",{"$nulls":5},{"$f":"J173+J179","v":0.48789576636363641}]
[null,null,null,"Custo unitário de execução",{"$nulls":5},{"$f":"J180/I167","v":0.48789576636363641}]
[{"$nulls":7},"Custo do FIC",null,"-"]
[{"$nulls":7},"Custo do FIT",null,"-"]
[null,"C - MATERIAL",null,"Quantidade","Unidade",null,"Preço Unitário","Custo Unitário"]
[null,"-",0,0,0,null,0,null,null,{"$f":"D185*G185","v":0},null,{"$f":"VLOOKUP(A$164,ORÇAMENTO!A$11:L$42,6,FALSE)","v":"SERV"},{"$f":"J185*L185","v":{"$error":"#VALUE!"}}]
[null,"-",0,0,0,null,0,null,null,0,null,{"$f":"VLOOKUP(A$164,ORÇAMENTO!A$11:L$42,6,FALSE)","v":"SERV"},{"$f":"J186*L186","v":{"$error":"#VALUE!"}}]
[null,null,null,"Custo unitário total de material",{"$nulls":5},{"$f":"SUM(J185:J186)","v":0}]
[null,"D - ATIVIDADES AUXILIARES",null,"Quantidade","Unidade",null,"Custo Unitário","Custo Unitário"]
[null,"-",0,0,0,null,0,null,null,{"$f":"D189*G189","v":0}]
[null,"-",0,0,0,null,0,null,null,{"$f":"D190*G190","v":0}]
[null,null,null,"Custo total de atividades auxiliares",{"$nulls":5},{"$f":"SUM(J189:J190)","v":0}]
[{"$nulls":7},"Subtotal",null,{"$f":"J181+J187+J191","v":0.48789576636363641}]
[null,"E - TEMPO FIXO",null,"Código","Quantidade","Unidade",null,"Custo Unitário","Custo Unitário"]
[null,"-",0,"-",0,"t",null,0,null,{"$f":"ROUNDDOWN(E194*H194,4)","v":0}]
[null,"-",0,"-",0,"t",null,0,null,{"$f":"ROUNDDOWN(E195*H195,4)","v":0}]
[null,null,null,"Custo unitário total de tempo fixo",{"$nulls":5},{"$f":"SUM(J194:J195)","v":0}]
[null,"F - MOMENTO DE TRANSPORTE",null,"Quantidade","Unidade","DMT",null,null,null,"Custo Unitário"]
[{"$nulls":5},"LN","RP","P"]
[null,"-",0,0,"tkm"]
[null,"-",0,0,"tkm"]
[null,null,null,"Custo unitário total de transporte"]
[{"$nulls":5},"Custo unitário direto total",null,null,null,{"$f":"TRUNC(J192+J196,2)","v":0.48}]
[null,"Obs."]
[]
[{"$f":"A164+1","v":7},"1ª/GRD",{"$nulls":8},{"$f":"J241","v":6.59}]
[null,"OBRA:"," PAVIMENTAÇÃO ASFÁLTICA EM CBUQ - VIAS DIVERSAS - BAIRROS: N. SRA. DO ROSÁRIO, CÍCERO PASSOS E COMUNIDADE PERNAMBUCO - PIRAPORA-MG"]
[null,"Custo Unitário de Referência",null,null,"Minas Gerais"]
[{"$nulls":4}," Outubro/2024 ",null,null,"Produção da equipe ",230.19,{"$f":"VLOOKUP(A205,ORÇAMENTO!$A$10:$L$42,7,1)","v":"M3"}]
[null,5502140,"ESCAVAÇÃO, CARGA E TRANSPORTE DE MATERIAL DE 1ª CATEGORIA - DMT 1.000 A 1.200M, CAMINHO DE SERVIÇO EM REVESTIMENTO PRIMÁRIO",{"$nulls":5},"Valores em reais (R$)"]
[null,"A - EQUIPAMENTOS",null,"Quantidade","Utilização",null,"Custo Horário",null,null,"Custo"]
[{"$nulls":4},"Operativa","Improdutiva","Produtivo","Improdutivo",null,"Horário Total"]
[null,"E9667","Caminhão basculante com capacidade de 14 m³ - 210 kW",4,0.97,0.03,302.11750000000001,88.006100000000004,null,{"$f":"D212*(E212*G212+F212*H212)","v":1182.7766319999998}]
[null,"E9515","Escavadeira hidráulica sobre esteiras com caçamba com capacidade de 1,56 m³ - 118 kW",1,1,0,284.76839999999999,128.20959999999999,null,{"$f":"D213*(E213*G213+F213*H213)","v":284.76839999999999}]
[{"$nulls":7},"Custo horário total de equipamentos",null,{"$f":"SUM(J212:J213)","v":1467.5450319999998}]
[null,"B - MÃO DE OBRA",null,"Quantidade","Unidade",null,"Custo Horário","Custo Horário Total"]
[null,"P9824","Servente",1,"h",null,20.631399999999999,null,null,{"$f":"D216*G216","v":20.631399999999999}]
[{"$nulls":9},{"$f":"D217*G217","v":0}]
[null,null,null,"Custo horário total de mão de obra",{"$nulls":5},{"$f":"SUM(J216:J217)","v":20.631399999999999}]
[null,null,null,"Custo horário total de execução",{"$nulls":5},{"$f":"J214+J218","v":1488.1764319999997}]
[null,null,null,"Custo unitário de execução",{"$nulls":5},{"$f":"J219/I208","v":6.4649916677527246}]
[{"$nulls":7},"Custo do FIC",null,0.1313]
[{"$nulls":7},"Custo do FIT",null,0]
[null,"C - MATERIAL",null,"Quantidade","Unidade",null,"Preço Unitário","Custo Unitário"]
[null,"-",0,null,0,null,0,null,null,{"$f":"D224*G224","v":0},null,{"$f":"VLOOKUP(A205,ORÇAMENTO!A$11:L$42,6,FALSE)","v":"SERV"},{"$f":"J224*L224","v":{"$error":"#VALUE!"}}]
[null,"-",0,null,0,null,0,null,null,{"$f":"D225*G225","v":0},null,{"$f":"VLOOKUP(A205,ORÇAMENTO!A$11:L$42,6,FALSE)","v":"SERV"},{"$f":"J225*L225","v":{"$error":"#VALUE!"}}]
[null,null,null,"Custo unitário total de material",{"$nulls":5},{"$f":"SUM(J224:J225)","v":0}]
[null,"D - ATIVIDADES AUXILIARES",null,"Quantidade","Unidade",null,"Custo Unitário","Custo Unitário"]
[null,"-",0,0,0,null,0,null,null,{"$f":"D228*G228","v":0}]
[null,"-",0,0,0,null,0,null,null,{"$f":"D229*G229","v":0}]
[null,null,null,"Custo total de atividades auxiliares",{"$nulls":5},{"$f":"SUM(J228:J229)","v":0}]
[{"$nulls":7},"Subtotal",null,{"$f":"J220+J226+J230+J221+J222","v":6.596291667752725}]
[null,"E - TEMPO FIXO",null,"Código","Quantidade","Unidade",null,"Custo Unitário","Custo Unitário"]
[null,"-",0,"-",0,"t",null,0,null,{"$f":"ROUNDDOWN(E233*H233,4)","v":0}]
[null,"-",0,"-",0,"t",null,0,null,{"$f":"ROUNDDOWN(E234*H234,4)","v":0}]
[null,null,null,"Custo unitário total de tempo fixo",{"$nulls":5},{"$f":"SUM(J233:J234)","v":0}]
[null,"F - MOMENTO DE TRANSPORTE",null,"Quantidade","Unidade","DMT",null,null,null,"Custo Unitário"]
[{"$nulls":5},"LN","RP","P"]
[null,"-",0,null,"tkm","5914449","5914464","5914479"]
[null,"-",0,null,"tkm","5914449","5914464","5914479"]
[null,null,null,"Custo unitário total de transporte"]
[{"$nulls":5},"Custo unitário direto total",null,null,null,{"$f":"TRUNC(J231+J235,2)","v":6.59}]
[null,"Obs."]
[]
[9,"1ª/GRD",{"$nulls":8},{"$f":"J284","v":1.1399999999999999}]
[null,"OBRA:"," PAVIMENTAÇÃO ASFÁLTICA EM CBUQ - VIAS DIVERSAS - BAIRROS: N. SRA. DO ROSÁRIO, CÍCERO PASSOS E COMUNIDADE PERNAMBUCO - PIRAPORA-MG"]
[null,"Custo Unitário de Referência",null,null,"Minas Gerais"]
[{"$nulls":4}," Outubro/2024 ",null,null,"Produção da equipe ",1121.33,{"$f":"VLOOKUP(A244,ORÇAMENTO!$A$10:$L$42,7,1)","v":"M2"}]
[null,4011209,"REGULARIZAÇÃO E COMPACTAÇÃO DO SUBLEITO ",{"$nulls":5},"Valores em reais (R$)"]
[null,"A - EQUIPAMENTOS",null,"Quantidade","Utilização",null,"Custo Horário",null,null,"Custo"]
[{"$nulls":4},"Operativa","Improdutiva","Produtivo","Improdutivo",null,"Horário Total"]
[null,"E9571","Caminhão tanque com capacidade de 10.000 l - 188 kW",2,0.51,0.49,318.0342,79.329300000000003,null,{"$f":"D251*(E251*G251+F251*H251)","v":402.13759800000003}]
[null,"E9518","Grade de 24 discos rebocável de D = 60 cm (24\")",1,0.69,0.31,4.9440999999999997,3.4430000000000001,null,{"$f":"D252*(E252*G252+F252*H252)","v":4.4787590000000002}]
[null,"E9524","Motoniveladora - 93 kW",1,0.71,0.28999999999999998,285.76339999999999,124.88290000000001,null,239.10805499999998]
[null,"E9762","Rolo compactador de pneus autopropelido de 27 t - 85 kW",1,0.96,0.04,253.3622,123.72410000000001,null,248.17667599999999]
[null,"E9685","Rolo compactador pé de carneiro vibratório autopropelido por pneus de 11,6 t - 82 kW",1,1,0,223.35149999999999,100.70740000000001,null,223.35149999999999]
[null,"E9577","Trator agrícola sobre pneus - 77 kW",1,0.69,0.31,150.32509999999999,54.863799999999998,null,120.73209699999998]
[{"$nulls":7},"Custo horário total de equipamentos",null,{"$f":"SUM(J251:J256)","v":1237.9846850000001}]
[null,"B - MÃO DE OBRA",null,"Quantidade","Unidade",null,"Custo Horário","Custo Horário Total"]
[null,"P9824","Servente",1,"h",null,20.631399999999999,null,null,{"$f":"D259*G259","v":20.631399999999999}]
[null,"-",null,0,0,null,0,null,null,{"$f":"D260*G260","v":0}]
[null,null,null,"Custo horário total de mão de obra",{"$nulls":5},{"$f":"SUM(J259:J260)","v":20.631399999999999}]
[null,null,null,"Custo horário total de execução",{"$nulls":5},{"$f":"J257+J261","v":1258.6160850000001}]
[null,null,null,"Custo unitário de execução",{"$nulls":5},{"$f":"J262/I247","v":1.1224314742314931}]
[{"$nulls":7},"Custo do FIC",null,2.2700000000000001E-2]
[{"$nulls":7},"Custo do FIT",null,0]
[null,"C - MATERIAL",null,"Quantidade","Unidade",null,"Preço Unitário","Custo Unitário"]
[null,"-",0,null,0,null,0,null,null,{"$f":"D267*G267","v":0},null,{"$f":"VLOOKUP(A$244,ORÇAMENTO!A$11:L$42,6,FALSE)","v":"SERV"},{"$f":"J267*L267","v":{"$error":"#VALUE!"}}]
[null,"-",0,null,0,null,0,null,null,{"$f":"D268*G268","v":0},null,{"$f":"VLOOKUP(A$244,ORÇAMENTO!A$11:L$42,6,FALSE)","v":"SERV"},{"$f":"J268*L268","v":{"$error":"#VALUE!"}}]
[null,null,null,"Custo unitário total de material",{"$nulls":5},{"$f":"SUM(J267:J268)","v":0}]
[null,"D - ATIVIDADES AUXILIARES",null,"Quantidade","Unidade",null,"Custo Unitário","Custo Unitário"]
[null,"-",0,0,0,null,0,null,null,{"$f":"D271*G271","v":0}]
[null,"-",0,0,0,null,0,null,null,{"$f":"D272*G272","v":0}]
[null,null,null,"Custo total de atividades auxiliares",{"$nulls":5},{"$f":"SUM(J271:J272)","v":0}]
[{"$nulls":7},"Subtotal",null,{"$f":"J263+J269+J273+J264+J265","v":1.1451314742314931}]
[null,"E - TEMPO FIXO",null,"Código","Quantidade","Unidade",null,"Custo Unitário","Custo Unitário"]
[null,"-",0,"-",0,"t",null,0,null,{"$f":"ROUNDDOWN(E276*H276,4)","v":0}]
[null,"-",0,"-",0,"t",null,0,null,{"$f":"ROUNDDOWN(E277*H277,4)","v":0}]
[null,null,null,"Custo unitário total de tempo fixo",{"$nulls":5},{"$f":"SUM(J276:J277)","v":0}]
[null,"F - MOMENTO DE TRANSPORTE",null,"Quantidade","Unidade","DMT",null,null,null,"Custo Unitário"]
[{"$nulls":5},"LN","RP","P"]
[null,"-",0,null,"tkm","5914449","5914464","5914479"]
[null,"-",0,null,"tkm","5914449","5914464","5914479"]
[null,null,null,"Custo unitário total de transporte"]
[{"$nulls":5},"Custo unitário direto total",null,null,null,{"$f":"TRUNC(J274+J278,2)","v":1.1399999999999999}]
[null,"Obs."]
[]
[{"$f":"A244+1","v":10},"1ª/GRD",{"$nulls":8},{"$f":"J327","v":133.88}]
[null,"OBRA:"," PAVIMENTAÇÃO ASFÁLTICA EM CBUQ - VIAS DIVERSAS - BAIRROS: N. SRA. DO ROSÁRIO, CÍCERO PASSOS E COMUNIDADE PERNAMBUCO - PIRAPORA-MG"]
[null,"Custo Unitário de Referência",null,null,"Minas Gerais"]
[{"$nulls":4}," Outubro/2024 ",null,null,"Produção da equipe ",150.88,{"$f":"VLOOKUP(A287,ORÇAMENTO!$A$10:$L$42,7,1)","v":"M3"}]
[null,"4011256a","EXECUÇÃO E COMPACTAÇÃO DE BASE E OU SUB ESTABILIZADA GRANULOMETRICAMENTE COM MISTURA SOLO BRITA (50%-50%), NA PISTA COM MATERIAL DE JAZIDA E BRITA COMERCIAL",{"$nulls":5},"Valores em reais (R$)"]
[null,"A - EQUIPAMENTOS",null,"Quantidade","Utilização",null,"Custo Horário",null,null,"Custo"]
[{"$nulls":4},"Operativa","Improdutiva","Produtivo","Improdutivo",null,"Horário Total"]
[null,"E9571","Caminhão tanque com capacidade de 10.000 l - 188 kW",1,0.83,0.17,318.0342,79.329300000000003,null,{"$f":"D294*(E294*G294+F294*H294)","v":277.45436699999999}]
[null,"E9518","Grade de 24 discos rebocável de D = 60 cm (24\")",1,0.62,0.38,4.9440999999999997,3.4430000000000001,null,{"$f":"D295*(E295*G295+F295*H295)","v":4.3736819999999996}]
[null,"E9524","Motoniveladora - 93 kW",1,1,0,285.76339999999999,124.88290000000001,null,{"$f":"D296*(E296*G296+F296*H296)","v":285.76339999999999}]
[null,"E9762","Rolo compactador de pneus autopropelido de 27 t - 85 kW",1,0.86,0.14000000000000001,253.3622,123.72410000000001,null,235.21286599999999]
[null,"E9685","Rolo compactador pé de carneiro vibratório autopropelido por pneus de 11,6 t - 82 kW",1,0.9,0.1,223.35149999999999,100.70740000000001,null,211.08708999999999]
[null,"E9577","Trator agrícola sobre pneus - 77 kW",1,0.62,0.38,150.32509999999999,54.863799999999998,null,114.04980599999999]
[{"$nulls":7},"Custo horário total de equipamentos",null,{"$f":"SUM(J294:J299)","v":1127.9412109999998}]
[null,"B - MÃO DE OBRA",null,"Quantidade","Unidade",null,"Custo Horário","Custo Horário Total"]
[null,"P9824","Servente",1,"h",null,20.631399999999999,null,null,{"$f":"D302*G302","v":20.631399999999999}]
[null,"-",0,0,0,null,0,null,null,{"$f":"D303*G303","v":0}]
[null,null,null,"Custo horário total de mão de obra",{"$nulls":5},{"$f":"SUM(J302:J303)","v":20.631399999999999}]
[null,null,null,"Custo horário total de execução",{"$nulls":5},{"$f":"J300+J304","v":1148.5726109999998}]
[null,null,null,"Custo unitário de execução",{"$nulls":5},{"$f":"J305/I290","v":7.6124907940084823}]
[{"$nulls":7},"Custo do FIC",null,0.13930000000000001]
[{"$nulls":7},"Custo do FIT",null,0]
[null,"C - MATERIAL",null,"Quantidade","Unidade",null,"Preço Unitário","Custo Unitário"]
[null,"M0191","Brita 1",0.68766666666666665,"m³",null,175.32830000000001,null,null,{"$f":"D310*G310","v":120.56742763333334},null,{"$f":"VLOOKUP(A$287,ORÇAMENTO!A$11:L$42,6,FALSE)","v":"SERV"},{"$f":"J310*L310","v":{"$error":"#VALUE!"}}]
[null,"-",0,null,0,null,0,null,null,{"$f":"D311*G311","v":0},null,{"$f":"VLOOKUP(A$287,ORÇAMENTO!A$11:L$42,6,FALSE)","v":"SERV"},{"$f":"J311*L311","v":{"$error":"#VALUE!"}}]
[null,null,null,"Custo unitário total de material",{"$nulls":5},{"$f":"SUM(J310:J311)","v":120.56742763333334}]
[null,"D - ATIVIDADES AUXILIARES",null,"Quantidade","Unidade",null,"Custo Unitário","Custo Unitário"]
[null,4016096,"Escavação e carga de material de jazida com escavadeira hidráulica de 1,56 m³",0.77019000000000004,"m³",null,1.35,null,null,{"$f":"D314*G314","v":1.0397565000000002}]
[null,"-",0,0,0,null,0,null,null,{"$f":"D315*G315","v":0}]
[null,null,null,"Custo total de atividades auxiliares",{"$nulls":5},{"$f":"SUM(J314:J315)","v":1.0397565000000002}]
[{"$nulls":7},"Subtotal",null,{"$f":"J306+J312+J316+J307+J308","v":129.35897492734182}]
[null,"E - TEMPO FIXO",null,"Código","Quantidade","Unidade",null,"Custo Unitário","Custo Unitário"]
[null,4016096,"Escavação e carga de material de jazida com escavadeira hidráulica de 1,56 m³",5914354,1.44411,"t",null,1.86,null,{"$f":"ROUNDDOWN(E319*H319,4)","v":2.6859999999999999}]
[null,"M0191","Brita 1",5914647,1.0315050000000001,"t",null,1.78,null,{"$f":"ROUNDDOWN(E320*H320,4)","v":1.8360000000000001}]
[null,null,null,"Custo unitário total de tempo fixo",{"$nulls":5},{"$f":"SUM(J319:J320)","v":4.5220000000000002}]
[null,"F - MOMENTO DE TRANSPORTE",null,"Quantidade","Unidade","DMT",null,null,null,"Custo Unitário"]
[{"$nulls":5},"LN","RP","P"]
[null,4016096,"Escavação e carga de material de jazida com escavadeira hidráulica de 1,56 m³",1.44411,"tkm","5914359","5914374","5914389"]
[null,"M0191","Brita 1",1.0315050000000001,"tkm"]
[null,null,null,"Custo unitário total de transporte"]
[{"$nulls":5},"Custo unitário direto total",null,null,null,{"$f":"TRUNC(J317+J321,2)","v":133.88}]
[null,"Obs."]
[]
[12,"1ª/GRD",{"$nulls":8},{"$f":"J366","v":0.39}]
[null,"OBRA:"," PAVIMENTAÇÃO ASFÁLTICA EM CBUQ - VIAS DIVERSAS - BAIRROS: N. SRA. DO ROSÁRIO, CÍCERO PASSOS E COMUNIDADE PERNAMBUCO - PIRAPORA-MG"]
[null,"Custo Unitário de Referência",null,null,"Minas Gerais"]
[{"$nulls":4}," Outubro/2024 ",null,null,"Produção da equipe ",1038.46,{"$f":"VLOOKUP(A330,ORÇAMENTO!$A$10:$L$42,7,1)","v":"M2"}]
[null,4011352,"IMPRIMAÇÃO COM EMULSÃO ASFÁLTICA (EAI)",{"$nulls":5},"Valores em reais (R$)"]
[null,"A - EQUIPAMENTOS",null,"Quantidade","Utilização",null,"Custo Horário",null,null,"Custo"]
[{"$nulls":4},"Operativa","Improdutiva","Produtivo","Improdutivo",null,"Horário Total"]
[null,"E9509","Caminhão tanque distribuidor de asfalto com capacidade de 6.000 l - 7 kW/136 kW",1,1,0,256.48719999999997,71.489999999999995,null,{"$f":"D337*(E337*G337+F337*H337)","v":256.48719999999997}]
[null,"E9558","Tanque de estocagem de asfalto com capacidade de 30.000 l",2,1,0,55.635300000000001,38.003,null,{"$f":"D338*(E338*G338+F338*H338)","v":111.2706}]
[{"$nulls":7},"Custo horário total de equipamentos",null,{"$f":"SUM(J337:J338)","v":367.75779999999997}]
[null,"B - MÃO DE OBRA",null,"Quantidade","Unidade",null,"Custo Horário","Custo Horário Total"]
[null,"P9824","Servente",2,"h",null,20.631399999999999,null,null,{"$f":"D341*G341","v":41.262799999999999}]
[null,"-",{"$nulls":7},{"$f":"D342*G342","v":0}]
[null,null,null,"Custo horário total de mão de obra",{"$nulls":5},{"$f":"SUM(J341:J342)","v":41.262799999999999}]
[null,null,null,"Custo horário total de execução",{"$nulls":5},{"$f":"J339+J343","v":409.02059999999994}]
[null,null,null,"Custo unitário de execução",{"$nulls":5},{"$f":"J344/I333","v":0.39387227240336647}]
[{"$nulls":7},"Custo do FIC",null,1.2999999999999999E-3]
[{"$nulls":7},"Custo do FIT",null,0]
[null,"C - MATERIAL",null,"Quantidade","Unidade",null,"Preço Unitário","Custo Unitário"]
[null,"M2092","Emulsão asfáltica para imprimação",1.2999999999999999E-3,"t",null,0,"FORNECIMENTO COM BDI DIFERENCIADO",null,{"$f":"D349*G349","v":0},null,{"$f":"VLOOKUP(A330,ORÇAMENTO!A$11:L$42,6,FALSE)","v":"SERV"},{"$f":"J349*L349","v":{"$error":"#VALUE!"}}]
[null,"-",0,89.28,0,null,0,null,null,{"$f":"D350*G350","v":0},null,{"$f":"VLOOKUP(A330,ORÇAMENTO!A$11:L$42,6,FALSE)","v":"SERV"},{"$f":"J350*L350","v":{"$error":"#VALUE!"}}]
[null,null,null,"Custo unitário total de material",{"$nulls":5},{"$f":"SUM(J349:J350)","v":0}]
[null,"D - ATIVIDADES AUXILIARES",null,"Quantidade","Unidade",null,"Custo Unitário","Custo Unitário"]
[null,"-",0,0,0,null,0,null,null,{"$f":"D353*G353","v":0}]
[null,"-",0,0,0,null,0,null,null,{"$f":"D354*G354","v":0}]
[null,null,null,"Custo total de atividades auxiliares",{"$nulls":5},{"$f":"SUM(J353:J354)","v":0}]
[{"$nulls":7},"Subtotal",null,{"$f":"J345+J351+J355+J346+J347","v":0.3951722724033665}]
[null,"E - TEMPO FIXO",null,"Código","Quantidade","Unidade",null,"Custo Unitário","Custo Unitário"]
[null,"-",0,"-",0,"t",null,0,null,{"$f":"ROUNDDOWN(E358*H358,4)","v":0}]
[null,"-",0,"-",0,"t",null,0,null,{"$f":"ROUNDDOWN(E359*H359,4)","v":0}]
[null,null,null,"Custo unitário total de tempo fixo",{"$nulls":5},{"$f":"SUM(J358:J359)","v":0}]
[null,"F - MOMENTO DE TRANSPORTE",null,"Quantidade","Unidade","DMT",null,null,null,"Custo Unitário"]
[{"$nulls":5},"LN","RP","P"]
[null,"-",0,null,"tkm"]
[null,"-",0,null,"tkm"]
[null,null,null,"Custo unitário total de transporte"]
[{"$nulls":5},"Custo unitário direto total",null,null,null,{"$f":"TRUNC(J356+J360,2)","v":0.39}]
[null,"Obs."]
[]
[{"$f":"A330+1","v":13},"1ª/GRD",{"$nulls":8},{"$f":"J405","v":0.27}]
[null,"OBRA:"," PAVIMENTAÇÃO ASFÁLTICA EM CBUQ - VIAS DIVERSAS - BAIRROS: N. SRA. DO ROSÁRIO, CÍCERO PASSOS E COMUNIDADE PERNAMBUCO - PIRAPORA-MG"]
[null,"Custo Unitário de Referência",null,null,"Minas Gerais"]
[{"$nulls":4}," Outubro/2024 ",null,null,"Produção da equipe ",1500,{"$f":"VLOOKUP(A369,ORÇAMENTO!$A$10:$L$42,7,1)","v":"M2"}]
[null,4011353,"PINTURA DE LIGAÇÃO COM EMULSÃO ASFÁLTICA RR-1C",{"$nulls":5},"Valores em reais (R$)"]
[null,"A - EQUIPAMENTOS",null,"Quantidade","Utilização",null,"Custo Horário",null,null,"Custo"]
[{"$nulls":4},"Operativa","Improdutiva","Produtivo","Improdutivo",null,"Horário Total"]
[null,"E9509","Caminhão tanque distribuidor de asfalto com capacidade de 6.000 l - 7 kW/136 kW",1,1,0,256.48719999999997,71.489999999999995,null,{"$f":"D376*(E376*G376+F376*H376)","v":256.48719999999997}]
[null,"E9558","Tanque de estocagem de asfalto com capacidade de 30.000 l",2,1,0,55.635300000000001,38.003,null,{"$f":"D377*(E377*G377+F377*H377)","v":111.2706}]
[{"$nulls":7},"Custo horário total de equipamentos",null,{"$f":"SUM(J376:J377)","v":367.75779999999997}]
[null,"B - MÃO DE OBRA",null,"Quantidade","Unidade",null,"Custo Horário","Custo Horário Total"]
[null,"P9824","Servente",2,"h",null,20.631399999999999,null,null,{"$f":"D380*G380","v":41.262799999999999}]
[null,"-",{"$nulls":7},{"$f":"D381*G381","v":0}]
[null,null,null,"Custo horário total de mão de obra",{"$nulls":5},{"$f":"SUM(J380:J381)","v":41.262799999999999}]
[null,null,null,"Custo horário total de execução",{"$nulls":5},{"$f":"J378+J382","v":409.02059999999994}]
[null,null,null,"Custo unitário de execução",{"$nulls":5},{"$f":"J383/I372","v":0.27268039999999999}]
[{"$nulls":7},"Custo do FIC",null,8.9999999999999998E-4]
[{"$nulls":7},"Custo do FIT",null,0]
[null,"C - MATERIAL",null,"Quantidade","Unidade",null,"Preço Unitário","Custo Unitário"]
[null,"M1946","Emulsão asfáltica - RR-1C",4.4999999999999999E-4,"t",null,0,"FORNECIMENTO COM BDI DIFERENCIADO",null,{"$f":"D388*G388","v":0},null,{"$f":"VLOOKUP(A369,ORÇAMENTO!A$11:L$42,6,FALSE)","v":"SERV"},{"$f":"J388*L388","v":{"$error":"#VALUE!"}}]
[null,"-",0,null,0,null,0,null,null,{"$f":"D389*G389","v":0},null,{"$f":"VLOOKUP(A369,ORÇAMENTO!A$11:L$42,6,FALSE)","v":"SERV"},{"$f":"J389*L389","v":{"$error":"#VALUE!"}}]
[null,null,null,"Custo unitário total de material",{"$nulls":5},{"$f":"SUM(J388:J389)","v":0}]
[null,"D - ATIVIDADES AUXILIARES",null,"Quantidade","Unidade",null,"Custo Unitário","Custo Unitário"]
[null,"-",0,0,0,null,0,null,null,{"$f":"D392*G392","v":0}]
[null,"-",0,0,0,null,0,null,null,{"$f":"D393*G393","v":0}]
[null,null,null,"Custo total de atividades auxiliares",{"$nulls":5},{"$f":"SUM(J392:J393)","v":0}]
[{"$nulls":7},"Subtotal",null,{"$f":"J384+J390+J394+J385+J386","v":0.2735804}]
[null,"E - TEMPO FIXO",null,"Código","Quantidade","Unidade",null,"Custo Unitário","Custo Unitário"]
[null,"-",0,"-",0,"t",null,0,null,{"$f":"ROUNDDOWN(E397*H397,4)","v":0}]
[null,"-",0,"-",0,"t",null,0,null,{"$f":"ROUNDDOWN(E398*H398,4)","v":0}]
[null,null,null,"Custo unitário total de tempo fixo",{"$nulls":5},{"$f":"SUM(J397:J398)","v":0}]
[null,"F - MOMENTO DE TRANSPORTE",null,"Quantidade","Unidade","DMT",null,null,null,"Custo Unitário"]
[{"$nulls":5},"LN","RP","P"]
[null,"-",0,null,"tkm"]
[null,"-",0,null,"tkm"]
[null,null,null,"Custo unitário total de transporte"]
[{"$nulls":5},"Custo unitário direto total",null,null,null,{"$f":"TRUNC(J395+J399,2)","v":0.27}]
[null,"Obs."]
[]
[{"$f":"A369+1","v":14},"1ª/GRD",{"$nulls":8},{"$f":"J445","v":229.97}]
[null,"OBRA:"," PAVIMENTAÇÃO ASFÁLTICA EM CBUQ - VIAS DIVERSAS - BAIRROS: N. SRA. DO ROSÁRIO, CÍCERO PASSOS E COMUNIDADE PERNAMBUCO - PIRAPORA-MG"]
[null,"Custo Unitário de Referência",null,null,"Minas Gerais"]
[{"$nulls":4}," Outubro/2024 ",null,null,"Produção da equipe ",99.6,{"$f":"VLOOKUP(A408,ORÇAMENTO!$A$10:$L$42,7,1)","v":"T"}]
[null,4011463,"EXECUÇÃO DE PAVIMENTO COM APLICAÇÃO DE CONCRETO ASFÁLTICO USINADO A QUENTE (CBUQ), CAMADA DE ROLAMENTO - EXCLUSIVE TRANSPORTE",{"$nulls":5},"Valores em reais (R$)"]
[null,"A - EQUIPAMENTOS",null,"Quantidade","Utilização",null,"Custo Horário",null,null,"Custo"]
[{"$nulls":4},"Operativa","Improdutiva","Produtivo","Improdutivo",null,"Horário Total"]
[null,"E9762","Rolo compactador de pneus autopropelido de 27 t - 85 kW",1,0.71,0.28999999999999998,253.3622,123.72410000000001,null,{"$f":"D415*(E415*G415+F415*H415)","v":215.76715099999998}]
[null,"E9681","Rolo compactador liso tandem vibratório autopropelido de 10,4 t - 82 kW",1,0.82,0.18,292.98790000000002,112.532,null,{"$f":"D416*(E416*G416+F416*H416)","v":260.50583799999998}]
[null,"E9545","Vibroacabadora de asfalto sobre esteiras - 97 kW",1,1,0,355.74560000000002,153.1112,null,{"$f":"D417*(E417*G417+F417*H417)","v":355.74560000000002}]
[{"$nulls":7},"Custo horário total de equipamentos",null,{"$f":"SUM(J415:J417)","v":832.01858900000002}]
[null,"B - MÃO DE OBRA",null,"Quantidade","Unidade",null,"Custo Horário","Custo Horário Total"]
[null,"P9824","Servente",8,"h",null,20.631399999999999,null,null,{"$f":"D420*G420","v":165.05119999999999}]
[null,"-",0,null,0,null,0,null,null,{"$f":"D421*G421","v":0}]
[null,null,null,"Custo horário total de mão de obra",{"$nulls":5},{"$f":"SUM(J420:J421)","v":165.05119999999999}]
[null,null,null,"Custo horário total de execução",{"$nulls":5},{"$f":"J418+J422","v":997.06978900000001}]
[null,null,null,"Custo unitário de execução",{"$nulls":5},{"$f":"J423/I411","v":10.010740853413655}]
[{"$nulls":7},"Custo do FIC",null,3.4000000000000002E-2]
[{"$nulls":7},"Custo do FIT",null,0]
[null,"C - MATERIAL",null,"Quantidade","Unidade",null,"Preço Unitário","Custo Unitário"]
[null,"-",0,null,0,null,0,null,null,{"$f":"D428*G428","v":0},null,{"$f":"VLOOKUP(A$408,ORÇAMENTO!A$11:L$42,6,FALSE)","v":"SERV"},{"$f":"J428*L428","v":{"$error":"#VALUE!"}}]
[null,"-",0,null,0,null,0,null,null,{"$f":"D429*G429","v":0},null,{"$f":"VLOOKUP(A$408,ORÇAMENTO!A$11:L$42,6,FALSE)","v":"SERV"},{"$f":"J429*L429","v":{"$error":"#VALUE!"}}]
[null,null,null,"Custo unitário total de material",{"$nulls":5},{"$f":"SUM(J428:J429)","v":0}]
[null,"D - ATIVIDADES AUXILIARES",null,"Quantidade","Unidade",null,"Custo Unitário","Custo Unitário"]
[null,6416078,"Usinagem de concreto asfáltico - faixa C - areia e brita comerciais",1,"t",null,212.08330273072286,null,null,{"$f":"D432*G432","v":212.08330273072286}]
[null,"-",0,0,0,null,0,null,null,{"$f":"D433*G433","v":0}]
[null,null,null,"Custo total de atividades auxiliares",{"$nulls":5},{"$f":"SUM(J432:J433)","v":212.08330273072286}]
[{"$nulls":7},"Subtotal",null,{"$f":"J424+J430+J434+J425+J426","v":222.12804358413652}]
[null,"E - TEMPO FIXO",null,"Código","Quantidade","Unidade",null,"Custo Unitário","Custo Unitário"]
[null,6416078,"Usinagem de concreto asfáltico - faixa C - areia e brita comerciais",5914649,1,"t",null,7.85,null,{"$f":"ROUNDDOWN(E437*H437,4)","v":7.85}]
[null,"-",0,"-",0,"t",null,0,null,{"$f":"ROUNDDOWN(E438*H438,4)","v":0}]
[null,null,null,"Custo unitário total de tempo fixo",{"$nulls":5},{"$f":"SUM(J437:J438)","v":7.85}]
[null,"F - MOMENTO DE TRANSPORTE",null,"Quantidade","Unidade","DMT",null,null,null,"Custo Unitário"]
[{"$nulls":5},"LN","RP","P"]
[null,6416078,"Usinagem de concreto asfáltico - faixa C - areia e brita comerciais",1,"tkm"]
[null,"-",0,0,"tkm"]
[null,null,null,"Custo unitário total de transporte"]
[{"$nulls":5},"Custo unitário direto total",null,null,null,{"$f":"TRUNC(J435+J439,2)","v":229.97}]
[null,"Obs."]
[]
[null,"1ª/GRD",{"$nulls":8},{"$f":"J496","v":212.08330273072286}]
[null,"OBRA:"," PAVIMENTAÇÃO ASFÁLTICA EM CBUQ - VIAS DIVERSAS - BAIRROS: N. SRA. DO ROSÁRIO, CÍCERO PASSOS E COMUNIDADE PERNAMBUCO - PIRAPORA-MG"]
[null,"Custo Unitário de Referência - Auxiliar",null,null,"Minas Gerais"]
[{"$nulls":4}," Outubro/2024 ",null,null,"Produção da equipe ",99.6,"t"]
[null,6416078,"Usinagem de concreto asfáltico - faixa C - areia e brita comerciais",{"$nulls":5},"Valores em reais (R$)"]
[null,"A - EQUIPAMENTOS",null,"Quantidade","Utilização",null,"Custo Horário",null,null,"Custo"]
[{"$nulls":4},"Operativa","Improdutiva","Produtivo","Improdutivo",null,"Horário Total"]
[null,"E9559","Aquecedor de fluido térmico - 12 kW",1,1,0,70.256299999999996,40.131300000000003,null,{"$f":"D455*(E455*G455+F455*H455)","v":70.256299999999996}]
[null,"E9584","Carregadeira de pneus com capacidade de 1,72 m³ - 113 kW",1,0.81,0.19,198.703,99.0672,null,{"$f":"D456*(E456*G456+F456*H456)","v":179.772198}]
[null,"E9021","Grupo gerador - 456 kVA",1,1,0,406.80880000000002,22.1935,null,406.80880000000002]
[null,"E9558","Tanque de estocagem de asfalto com capacidade de 30.000 l",2,1,0,55.635300000000001,38.003,null,111.2706]
[null,"E9689","Usina de asfalto a quente gravimétrica com capacidade de 100/140 t/h - 260 kW",1,1,0,1238.6309000000001,656.54520000000002,null,{"$f":"D459*(E459*G459+F459*H459)","v":1238.6309000000001}]
[{"$nulls":7},"Custo horário total de equipamentos",null,{"$f":"SUM(J455:J459)","v":2006.7387980000001}]
[null,"B - MÃO DE OBRA",null,"Quantidade","Unidade",null,"Custo Horário","Custo Horário Total"]
[null,"P9824","Servente",4,"h",null,20.631399999999999,null,null,{"$f":"D462*G462","v":82.525599999999997}]
[null,null,null,"Custo horário total de mão de obra",{"$nulls":5},{"$f":"SUM(J462:J462)","v":82.525599999999997}]
[null,null,null,"Custo horário total de execução",{"$nulls":5},{"$f":"J460+J463","v":2089.2643980000003}]
[null,null,null,"Custo unitário de execução",{"$nulls":5},{"$f":"J464/I451","v":20.976550180722896}]
[{"$nulls":7},"Custo do FIC",null,0]
[{"$nulls":7},"Custo do FIT",null,0]
[null,"C - MATERIAL",null,"Quantidade","Unidade",null,"Preço Unitário","Custo Unitário"]
[null,"M0028","Areia média",0.33123999999999998,"m³",null,161.85489999999999,null,null,{"$f":"D469*G469","v":53.612817075999992},null,{"$f":"VLOOKUP(A$408,ORÇAMENTO!A$11:L$42,6,FALSE)","v":"SERV"},{"$f":"J469*L469","v":{"$error":"#VALUE!"}}]
[null,"M0005","Brita 0",6.3700000000000007E-2,"m³",null,181.11600000000001,null,null,{"$f":"D470*G470","v":11.537089200000002},null,{"$f":"VLOOKUP(A$408,ORÇAMENTO!A$11:L$42,6,FALSE)","v":"SERV"},{"$error":"#VALUE!"}]
[null,"M0191","Brita 1",6.3700000000000007E-2,"m³",null,175.32830000000001,null,null,11.168412710000002,null,{"$f":"VLOOKUP(A$408,ORÇAMENTO!A$11:L$42,6,FALSE)","v":"SERV"},{"$error":"#VALUE!"}]
[null,"M0344","Cal hidratada - a granel",57.323999999999998,"kg",null,0.59379999999999999,null,null,34.038991199999998,null,{"$f":"VLOOKUP(A$408,ORÇAMENTO!A$11:L$42,6,FALSE)","v":"SERV"},{"$error":"#VALUE!"}]
[null,"M1943","Cimento asfáltico de petróleo - CAP 50/70",6.4490000000000006E-2,"t",null,0,"FORNECIMENTO COM BDI DIFERENCIADO",null,0,null,{"$f":"VLOOKUP(A$408,ORÇAMENTO!A$11:L$42,6,FALSE)","v":"SERV"},{"$error":"#VALUE!"}]
[null,"M1941","Óleo tipo A1",8,"l",null,6.6567999999999996,null,null,53.254399999999997,null,{"$f":"VLOOKUP(A$408,ORÇAMENTO!A$11:L$42,6,FALSE)","v":"SERV"},{"$error":"#VALUE!"}]
[null,"M1103","Pedrisco",0.14013999999999999,"m³",null,177.70259999999999,null,null,24.903242363999997,null,{"$f":"VLOOKUP(A$408,ORÇAMENTO!A$11:L$42,6,FALSE)","v":"SERV"},{"$error":"#VALUE!"}]
[null,null,null,"Custo unitário total de material",{"$nulls":5},{"$f":"SUM(J469:J475)","v":188.51495254999998}]
[null,"D - ATIVIDADES AUXILIARES",null,"Quantidade","Unidade",null,"Custo Unitário","Custo Unitário"]
[null,"-",0,0,0,null,0,null,null,{"$f":"D478*G478","v":0}]
[null,null,null,"Custo total de atividades auxiliares",{"$nulls":5},{"$f":"SUM(J478:J478)","v":0}]
[{"$nulls":7},"Subtotal",null,{"$f":"J465+J476+J479+J466+J467","v":209.49150273072286}]
[null,"E - TEMPO FIXO",null,"Código","Quantidade","Unidade",null,"Custo Unitário","Custo Unitário"]
[null,"M0028","Areia média",5914647,0.49686000000000002,"t",null,1.78,null,{"$f":"ROUNDDOWN(E482*H482,4)","v":0.88439999999999996}]
[null,"M0005","Brita 0",5914647,9.5549999999999996E-2,"t",null,1.78,null,0.17]
[null,"M0191","Brita 1",5914647,9.5549999999999996E-2,"t",null,1.78,null,0.17]
[null,"M0344","Cal hidratada - a granel",5914363,5.7320000000000003E-2,"t",null,17.329999999999998,null,0.99329999999999996]
[null,"M1103","Pedrisco",5914647,0.21021000000000001,"t",null,1.78,null,{"$f":"ROUNDDOWN(E486*H486,4)","v":0.37409999999999999}]
[null,null,null,"Custo unitário total de tempo fixo",{"$nulls":5},{"$f":"SUM(J482:J486)","v":2.5917999999999997}]
[null,"F - MOMENTO DE TRANSPORTE",null,"Quantidade","Unidade","DMT",null,null,null,"Custo Unitário"]
[{"$nulls":5},"LN","RP","P"]
[null,"M0028","Areia média",0.49686000000000002,"tkm"]
[null,"M0005","Brita 0",9.5549999999999996E-2,"tkm"]
[null,"M0191","Brita 1",9.5549999999999996E-2,"tkm"]
[null,"M0344","Cal hidratada - a granel",5.7320000000000003E-2,"tkm"]
[null,"M1103","Pedrisco",0.21021000000000001,"tkm"]
[null,null,null,"Custo unitário total de transporte"]
[{"$nulls":5},"Custo unitário direto total",null,null,null,{"$f":"J480+J487","v":212.08330273072286}]
[null,"Obs."]
[]
[{"$f":"A408+1","v":15},"1ª/GRD",{"$nulls":8},{"$f":"J535","v":0.64}]
[null,"OBRA:"," PAVIMENTAÇÃO ASFÁLTICA EM CBUQ - VIAS DIVERSAS - BAIRROS: N. SRA. DO ROSÁRIO, CÍCERO PASSOS E COMUNIDADE PERNAMBUCO - PIRAPORA-MG"]
[null,"Custo Unitário de Referência",null,null,"Minas Gerais"]
[{"$nulls":4}," Outubro/2024 ",null,null,"Produção da equipe ",470.61,{"$f":"VLOOKUP(A499,ORÇAMENTO!$A$10:$L$42,7,1)","v":"TXKM"}]
[null,5915321,"TRANSPORTE COM CAMINHÃO BASCULANTE, EM RODOVIA PAVIMENTADA",{"$nulls":5},"Valores em reais (R$)"]
[null,"A - EQUIPAMENTOS",null,"Quantidade","Utilização",null,"Custo Horário",null,null,"Custo"]
[{"$nulls":4},"Operativa","Improdutiva","Produtivo","Improdutivo",null,"Horário Total"]
[null,"E9667","Caminhão basculante com capacidade de 14 m³ - 210 kW",1,1,0,302.11750000000001,88.006100000000004,null,{"$f":"D506*(E506*G506+F506*H506)","v":302.11750000000001}]
[null,"-",0,null,null,null,0,0,null,{"$f":"D507*(E507*G507+F507*H507)","v":0}]
[{"$nulls":7},"Custo horário total de equipamentos",null,{"$f":"SUM(J506:J507)","v":302.11750000000001}]
[null,"B - MÃO DE OBRA",null,"Quantidade","Unidade",null,"Custo Horário","Custo Horário Total"]
[null,"-",0,null,0,null,0,null,null,{"$f":"D510*G510","v":0}]
[null,"-",0,null,0,null,0,null,null,{"$f":"D511*G511","v":0}]
[null,null,null,"Custo horário total de mão de obra",{"$nulls":5},{"$f":"SUM(J510:J511)","v":0}]
[null,null,null,"Custo horário total de execução",{"$nulls":5},{"$f":"J508+J512","v":302.11750000000001}]
[null,null,null,"Custo unitário de execução",{"$nulls":5},{"$f":"J513/I502","v":0.64196999638766705}]
[{"$nulls":7},"Custo do FIC",null,0]
[{"$nulls":7},"Custo do FIT",null,0]
[null,"C - MATERIAL",null,"Quantidade","Unidade",null,"Preço Unitário","Custo Unitário"]
[null,"-",0,0,0,null,0,null,null,{"$f":"D518*G518","v":0}]
[null,"-",0,0,0,null,0,null,null,{"$f":"D519*G519","v":0}]
[null,null,null,"Custo unitário total de material",{"$nulls":5},{"$f":"SUM(J518:J519)","v":0}]
[null,"D - ATIVIDADES AUXILIARES",null,"Quantidade","Unidade",null,"Custo Unitário","Custo Unitário"]
[null,"-",0,0,0,null,0,null,null,{"$f":"D522*G522","v":0}]
[null,"-",0,0,0,null,0,null,null,{"$f":"D523*G523","v":0}]
[null,null,null,"Custo total de atividades auxiliares",{"$nulls":5},{"$f":"SUM(J522:J523)","v":0}]
[{"$nulls":7},"Subtotal",null,{"$f":"J514+J520+J524+J515+J516","v":0.64196999638766705}]
[null,"E - TEMPO FIXO",null,"Código","Quantidade","Unidade",null,"Custo Unitário","Custo Unitário"]
[null,"-",0,"-",0,"t",null,0,null,{"$f":"ROUNDDOWN(E527*H527,4)","v":0}]
[null,"-",0,"-",0,"t",null,0,null,{"$f":"ROUNDDOWN(E528*H528,4)","v":0}]
[null,null,null,"Custo unitário total de tempo fixo",{"$nulls":5},{"$f":"SUM(J527:J528)","v":0}]
[null,"F - MOMENTO DE TRANSPORTE",null,"Quantidade","Unidade","DMT",null,null,null,"Custo Unitário"]
[{"$nulls":5},"LN","RP","P"]
[null,"-",0,0,"tkm"]
[null,"-",0,0,"tkm"]
[null,null,null,"Custo unitário total de transporte"]
[{"$nulls":5},"Custo unitário direto total",null,null,null,{"$f":"TRUNC(J525+J529,2)","v":0.64}]
[null,"Obs."]
[]
[16,"1ª/GRD",{"$nulls":8},{"$f":"J574","v":0.7}]
[null,"OBRA:"," PAVIMENTAÇÃO ASFÁLTICA EM CBUQ - VIAS DIVERSAS - BAIRROS: N. SRA. DO ROSÁRIO, CÍCERO PASSOS E COMUNIDADE PERNAMBUCO - PIRAPORA-MG"]
[null,"Custo Unitário de Referência",null,null,"Minas Gerais"]
[{"$nulls":4}," Outubro/2024 ",null,null,"Produção da equipe ",435.75,{"$f":"VLOOKUP(A538,ORÇAMENTO!$A$10:$L$42,7,1)","v":"TXKM"}]
[null,5915320,"TRANSPORTE COM CAMINHÃO BASCULANTE, RODOVIA EM REVESTIMENTO PRIMÁRIO",{"$nulls":5},"Valores em reais (R$)"]
[null,"A - EQUIPAMENTOS",null,"Quantidade","Utilização",null,"Custo Horário",null,null,"Custo"]
[{"$nulls":4},"Operativa","Improdutiva","Produtivo","Improdutivo",null,"Horário Total"]
[null,"E9667","Caminhão basculante com capacidade de 14 m³ - 210 kW",1,1,0,302.11750000000001,88.006100000000004,null,{"$f":"D545*(E545*G545+F545*H545)","v":302.11750000000001}]
[null,"-",0,null,null,null,0,0,null,{"$f":"D546*(E546*G546+F546*H546)","v":0}]
[{"$nulls":7},"Custo horário total de equipamentos",null,{"$f":"SUM(J545:J546)","v":302.11750000000001}]
[null,"B - MÃO DE OBRA",null,"Quantidade","Unidade",null,"Custo Horário","Custo Horário Total"]
[null,"-",0,null,0,null,0,null,null,{"$f":"D549*G549","v":0}]
[null,"-",0,null,0,null,0,null,null,{"$f":"D550*G550","v":0}]
[null,null,null,"Custo horário total de mão de obra",{"$nulls":5},{"$f":"SUM(J549:J550)","v":0}]
[null,null,null,"Custo horário total de execução",{"$nulls":5},{"$f":"J547+J551","v":302.11750000000001}]
[null,null,null,"Custo unitário de execução",{"$nulls":5},{"$f":"J552/I541","v":0.69332759609868044}]
[{"$nulls":7},"Custo do FIC",null,1.4200000000000001E-2]
[{"$nulls":7},"Custo do FIT",null,0]
[null,"C - MATERIAL",null,"Quantidade","Unidade",null,"Preço Unitário","Custo Unitário"]
[null,"-",0,0,0,null,0,null,null,{"$f":"D557*G557","v":0}]
[null,"-",0,0,0,null,0,null,null,{"$f":"D558*G558","v":0}]
[null,null,null,"Custo unitário total de material",{"$nulls":5},{"$f":"SUM(J557:J558)","v":0}]
[null,"D - ATIVIDADES AUXILIARES",null,"Quantidade","Unidade",null,"Custo Unitário","Custo Unitário"]
[null,"-",0,0,0,null,0,null,null,{"$f":"D561*G561","v":0}]
[null,"-",0,0,0,null,0,null,null,{"$f":"D562*G562","v":0}]
[null,null,null,"Custo total de atividades auxiliares",{"$nulls":5},{"$f":"SUM(J561:J562)","v":0}]
[{"$nulls":7},"Subtotal",null,{"$f":"J553+J559+J563+J554+J555","v":0.70752759609868043}]
[null,"E - TEMPO FIXO",null,"Código","Quantidade","Unidade",null,"Custo Unitário","Custo Unitário"]
[null,"-",0,"-",0,"t",null,0,null,{"$f":"ROUNDDOWN(E566*H566,4)","v":0}]
[null,"-",0,"-",0,"t",null,0,null,{"$f":"ROUNDDOWN(E567*H567,4)","v":0}]
[null,null,null,"Custo unitário total de tempo fixo",{"$nulls":5},{"$f":"SUM(J566:J567)","v":0}]
[null,"F - MOMENTO DE TRANSPORTE",null,"Quantidade","Unidade","DMT",null,null,null,"Custo Unitário"]
[{"$nulls":5},"LN","RP","P"]
[null,"-",0,0,"tkm"]
[null,"-",0,0,"tkm"]
[null,null,null,"Custo unitário total de transporte"]
[{"$nulls":5},"Custo unitário direto total",null,null,null,{"$f":"TRUNC(J564+J568,2)","v":0.7}]
[null,"Obs."]
[]
[{"$f":"A538+1","v":17},"1ª/GRD",{"$nulls":8},{"$f":"J613","v":0.73}]
[null,"OBRA:"," PAVIMENTAÇÃO ASFÁLTICA EM CBUQ - VIAS DIVERSAS - BAIRROS: N. SRA. DO ROSÁRIO, CÍCERO PASSOS E COMUNIDADE PERNAMBUCO - PIRAPORA-MG"]
[null,"Custo Unitário de Referência",null,null,"Minas Gerais"]
[{"$nulls":4}," Outubro/2024 ",null,null,"Produção da equipe ",241.03,{"$f":"VLOOKUP(A577,ORÇAMENTO!$A$10:$L$42,7,1)","v":"TXKM"}]
[null,5914434,"TRANSPORTE COM CAMINHÃO CARROCERIA 9T, EM VIA URBANA PREDOMINANTEMENTE PAVIMENTADA",{"$nulls":5},"Valores em reais (R$)"]
[null,"A - EQUIPAMENTOS",null,"Quantidade","Utilização",null,"Custo Horário",null,null,"Custo"]
[{"$nulls":4},"Operativa","Improdutiva","Produtivo","Improdutivo",null,"Horário Total"]
[null,"E9508","Caminhão carroceria com capacidade de 9 t - 136 kW",1,1,0,176.18940000000001,67.083100000000002,null,{"$f":"D584*(E584*G584+F584*H584)","v":176.18940000000001}]
[null,"-",0,null,null,null,0,0,null,{"$f":"D585*(E585*G585+F585*H585)","v":0}]
[{"$nulls":7},"Custo horário total de equipamentos",null,{"$f":"SUM(J584:J585)","v":176.18940000000001}]
[null,"B - MÃO DE OBRA",null,"Quantidade","Unidade",null,"Custo Horário","Custo Horário Total"]
[null,"-",0,0,0,null,0,null,null,{"$f":"D588*G588","v":0}]
[null,"-",0,0,0,null,0,null,null,{"$f":"D589*G589","v":0}]
[null,null,null,"Custo horário total de mão de obra",{"$nulls":5},{"$f":"SUM(J588:J589)","v":0}]
[null,null,null,"Custo horário total de execução",{"$nulls":5},{"$f":"J586+J590","v":176.18940000000001}]
[null,null,null,"Custo unitário de execução",{"$nulls":5},{"$f":"J591/I580","v":0.73098535452018421}]
[{"$nulls":7},"Custo do FIC",null,0]
[{"$nulls":7},"Custo do FIT",null,0]
[null,"C - MATERIAL",null,"Quantidade","Unidade",null,"Preço Unitário","Custo Unitário"]
[null,"-",0,0,0,null,0,null,null,{"$f":"D596*G596","v":0},null,{"$f":"VLOOKUP(A577,ORÇAMENTO!A$11:L$42,6,FALSE)","v":"SERV"},{"$f":"J596*L596","v":{"$error":"#VALUE!"}}]
[null,"-",0,0,0,null,0,null,null,{"$f":"D597*G597","v":0},null,{"$f":"VLOOKUP(A577,ORÇAMENTO!A$11:L$42,6,FALSE)","v":"SERV"},{"$f":"J597*L597","v":{"$error":"#VALUE!"}}]
[null,null,null,"Custo unitário total de material",{"$nulls":5},{"$f":"SUM(J596:J597)","v":0}]
[null,"D - ATIVIDADES AUXILIARES",null,"Quantidade","Unidade",null,"Custo Unitário","Custo Unitário"]
[null,"-",0,0,0,null,0,null,null,{"$f":"D600*G600","v":0}]
[null,"-",0,0,0,null,0,null,null,{"$f":"D601*G601","v":0}]
[null,null,null,"Custo total de atividades auxiliares",{"$nulls":5},{"$f":"SUM(J600:J601)","v":0}]
[{"$nulls":7},"Subtotal",null,{"$f":"J592+J598+J602+J593+J594","v":0.73098535452018421}]
[null,"E - TEMPO FIXO",null,"Código","Quantidade","Unidade",null,"Custo Unitário","Custo Unitário"]
[null,"-",0,"-",0,"t",null,0,null,{"$f":"ROUNDDOWN(E605*H605,4)","v":0}]
[null,"-",0,"-",0,"t",null,0,null,{"$f":"ROUNDDOWN(E606*H606,4)","v":0}]
[null,null,null,"Custo unitário total de tempo fixo",{"$nulls":5},{"$f":"SUM(J605:J606)","v":0}]
[null,"F - MOMENTO DE TRANSPORTE",null,"Quantidade","Unidade","DMT",null,null,null,"Custo Unitário"]
[{"$nulls":5},"LN","RP","P"]
[null,"-",0,0,"tkm"]
[null,"-",0,0,"tkm"]
[null,null,null,"Custo unitário total de transporte"]
[{"$nulls":5},"Custo unitário direto total",null,null,null,{"$f":"TRUNC(J603+J607,2)","v":0.73}]
[null,"Obs."]
[]
[{"$f":"A577+1","v":18},"1ª/GRD",{"$nulls":8},{"$f":"J652","v":1.1599999999999999}]
[null,"OBRA:"," PAVIMENTAÇÃO ASFÁLTICA EM CBUQ - VIAS DIVERSAS - BAIRROS: N. SRA. DO ROSÁRIO, CÍCERO PASSOS E COMUNIDADE PERNAMBUCO - PIRAPORA-MG"]
[null,"Custo Unitário de Referência",null,null,"Minas Gerais"]
[{"$nulls":4}," Outubro/2024 ",null,null,"Produção da equipe ",224.1,{"$f":"VLOOKUP(A616,ORÇAMENTO!$A$10:$L$42,7,1)","v":"TXKM"}]
[null,5914612,"TRANSPORTE DE MASSA ASFÁLTICA COM CAMINHÃO BASCULANTE, EM VIA URBANA PREDOMINANTEMENTE PAVIMENTADA",{"$nulls":5},"Valores em reais (R$)"]
[null,"A - EQUIPAMENTOS",null,"Quantidade","Utilização",null,"Custo Horário",null,null,"Custo"]
[{"$nulls":4},"Operativa","Improdutiva","Produtivo","Improdutivo",null,"Horário Total"]
[null,"E9520","Caminhão com caçamba térmica com capacidade de 6 m³ - 188 kW",1,1,0,261.73930000000001,75.977099999999993,null,{"$f":"D623*(E623*G623+F623*H623)","v":261.73930000000001}]
[null,"-",0,null,null,null,0,0,null,{"$f":"D624*(E624*G624+F624*H624)","v":0}]
[{"$nulls":7},"Custo horário total de equipamentos",null,{"$f":"SUM(J623:J624)","v":261.73930000000001}]
[null,"B - MÃO DE OBRA",null,"Quantidade","Unidade",null,"Custo Horário","Custo Horário Total"]
[null,"-",0,0,0,null,0,null,null,{"$f":"D627*G627","v":0}]
[null,"-",0,0,0,null,0,null,null,{"$f":"D628*G628","v":0}]
[null,null,null,"Custo horário total de mão de obra",{"$nulls":5},{"$f":"SUM(J627:J628)","v":0}]
[null,null,null,"Custo horário total de execução",{"$nulls":5},{"$f":"J625+J629","v":261.73930000000001}]
[null,null,null,"Custo unitário de execução",{"$nulls":5},{"$f":"J630/I619","v":1.1679576082106204}]
[{"$nulls":7},"Custo do FIC",null,0]
[{"$nulls":7},"Custo do FIT",null,0]
[null,"C - MATERIAL",null,"Quantidade","Unidade",null,"Preço Unitário","Custo Unitário"]
[null,"-",0,0,0,null,0,null,null,{"$f":"D635*G635","v":0},null,{"$f":"VLOOKUP(A616,ORÇAMENTO!A$11:L$42,6,FALSE)","v":"SERV"},{"$f":"J635*L635","v":{"$error":"#VALUE!"}}]
[null,"-",0,0,0,null,0,null,null,{"$f":"D636*G636","v":0},null,{"$f":"VLOOKUP(A616,ORÇAMENTO!A$11:L$42,6,FALSE)","v":"SERV"},{"$f":"J636*L636","v":{"$error":"#VALUE!"}}]
[null,null,null,"Custo unitário total de material",{"$nulls":5},{"$f":"SUM(J635:J636)","v":0}]
[null,"D - ATIVIDADES AUXILIARES",null,"Quantidade","Unidade",null,"Custo Unitário","Custo Unitário"]
[null,"-",0,0,0,null,0,null,null,{"$f":"D639*G639","v":0}]
[null,"-",0,0,0,null,0,null,null,{"$f":"D640*G640","v":0}]
[null,null,null,"Custo total de atividades auxiliares",{"$nulls":5},{"$f":"SUM(J639:J640)","v":0}]
[{"$nulls":7},"Subtotal",null,{"$f":"J631+J637+J641+J632+J633","v":1.1679576082106204}]
[null,"E - TEMPO FIXO",null,"Código","Quantidade","Unidade",null,"Custo Unitário","Custo Unitário"]
[null,"-",0,"-",0,"t",null,0,null,{"$f":"ROUNDDOWN(E644*H644,4)","v":0}]
[null,"-",0,"-",0,"t",null,0,null,{"$f":"ROUNDDOWN(E645*H645,4)","v":0}]
[null,null,null,"Custo unitário total de tempo fixo",{"$nulls":5},{"$f":"SUM(J644:J645)","v":0}]
[null,"F - MOMENTO DE TRANSPORTE",null,"Quantidade","Unidade","DMT",null,null,null,"Custo Unitário"]
[{"$nulls":5},"LN","RP","P"]
[null,"-",0,0,"tkm"]
[null,"-",0,0,"tkm"]
[null,null,null,"Custo unitário total de transporte"]
[{"$nulls":5},"Custo unitário direto total",null,null,null,{"$f":"TRUNC(J642+J646,2)","v":1.1599999999999999}]
[null,"Obs."]
[]
[{"$f":"A616+1","v":19},"1ª/GRD",{"$nulls":8},{"$f":"J691","v":1.71}]
[null,"OBRA:"," PAVIMENTAÇÃO ASFÁLTICA EM CBUQ - VIAS DIVERSAS - BAIRROS: N. SRA. DO ROSÁRIO, CÍCERO PASSOS E COMUNIDADE PERNAMBUCO - PIRAPORA-MG"]
[null,"Custo Unitário de Referência",null,null,"Minas Gerais"]
[{"$nulls":4}," Outubro/2024 ",null,null,"Produção da equipe ",149.4,{"$f":"VLOOKUP(A655,ORÇAMENTO!$A$10:$L$42,7,1)","v":"TXKM"}]
[null,5914622,"TRANSPORTE COM CAMINHÃO TANQUE DE TRANSPORTE DE MATERIAL ASFÁLTICO DE 30000 L, EM VIA URBANA PREDOMINANTEMENTE PAVIMENTADA",{"$nulls":5},"Valores em reais (R$)"]
[null,"A - EQUIPAMENTOS",null,"Quantidade","Utilização",null,"Custo Horário",null,null,"Custo"]
[{"$nulls":4},"Operativa","Improdutiva","Produtivo","Improdutivo",null,"Horário Total"]
[null,"E9509","Caminhão tanque distribuidor de asfalto com capacidade de 6.000 l - 7 kW/136 kW",1,1,0,256.48719999999997,71.489999999999995,null,{"$f":"D662*(E662*G662+F662*H662)","v":256.48719999999997}]
[null,"-",0,null,null,null,0,0,null,{"$f":"D663*(E663*G663+F663*H663)","v":0}]
[{"$nulls":7},"Custo horário total de equipamentos",null,{"$f":"SUM(J662:J663)","v":256.48719999999997}]
[null,"B - MÃO DE OBRA",null,"Quantidade","Unidade",null,"Custo Horário","Custo Horário Total"]
[null,"-",0,0,0,null,0,null,null,{"$f":"D666*G666","v":0}]
[null,"-",0,0,0,null,0,null,null,{"$f":"D667*G667","v":0}]
[null,null,null,"Custo horário total de mão de obra",{"$nulls":5},{"$f":"SUM(J666:J667)","v":0}]
[null,null,null,"Custo horário total de execução",{"$nulls":5},{"$f":"J664+J668","v":256.48719999999997}]
[null,null,null,"Custo unitário de execução",{"$nulls":5},{"$f":"J669/I658","v":1.7167817938420347}]
[{"$nulls":7},"Custo do FIC",null,0]
[{"$nulls":7},"Custo do FIT",null,0]
[null,"C - MATERIAL",null,"Quantidade","Unidade",null,"Preço Unitário","Custo Unitário"]
[null,"-",0,996,0,null,0,null,null,{"$f":"D674*G674","v":0},null,{"$f":"VLOOKUP(A655,ORÇAMENTO!A$11:L$42,6,FALSE)","v":"SERV"},{"$f":"J674*L674","v":{"$error":"#VALUE!"}}]
[null,"-",0,89.28,0,null,0,null,null,{"$f":"D675*G675","v":0},null,{"$f":"VLOOKUP(A655,ORÇAMENTO!A$11:L$42,6,FALSE)","v":"SERV"},{"$f":"J675*L675","v":{"$error":"#VALUE!"}}]
[null,null,null,"Custo unitário total de material",{"$nulls":5},{"$f":"SUM(J674:J675)","v":0}]
[null,"D - ATIVIDADES AUXILIARES",null,"Quantidade","Unidade",null,"Custo Unitário","Custo Unitário"]
[null,"-",0,0,0,null,0,null,null,{"$f":"D678*G678","v":0}]
[null,"-",0,0,0,null,0,null,null,{"$f":"D679*G679","v":0}]
[null,null,null,"Custo total de atividades auxiliares",{"$nulls":5},{"$f":"SUM(J678:J679)","v":0}]
[{"$nulls":7},"Subtotal",null,{"$f":"J670+J676+J680+J671+J672","v":1.7167817938420347}]
[null,"E - TEMPO FIXO",null,"Código","Quantidade","Unidade",null,"Custo Unitário","Custo Unitário"]
[null,"-",0,"-",0,"t",null,0,null,{"$f":"ROUNDDOWN(E683*H683,4)","v":0}]
[null,"-",0,"-",0,"t",null,0,null,{"$f":"ROUNDDOWN(E684*H684,4)","v":0}]
[null,null,null,"Custo unitário total de tempo fixo",{"$nulls":5},{"$f":"SUM(J683:J684)","v":0}]
[null,"F - MOMENTO DE TRANSPORTE",null,"Quantidade","Unidade","DMT",null,null,null,"Custo Unitário"]
[{"$nulls":5},"LN","RP","P"]
[null,"-",0,0,"tkm"]
[null,"-",0,0,"tkm"]
[null,null,null,"Custo unitário total de transporte"]
[{"$nulls":5},"Custo unitário direto total",null,null,null,{"$f":"TRUNC(J681+J685,2)","v":1.71}]
[null,"Obs."]
[]
[{"$f":"A655+1","v":20},"1ª/GRD",{"$nulls":8},{"$f":"J731","v":48.29},61.5]
[null,"OBRA:"," PAVIMENTAÇÃO ASFÁLTICA EM CBUQ - VIAS DIVERSAS - BAIRROS: N. SRA. DO ROSÁRIO, CÍCERO PASSOS E COMUNIDADE PERNAMBUCO - PIRAPORA-MG"]
[null,"Custo Unitário de Referência",null,null,"Minas Gerais"]
[{"$nulls":4}," Outubro/2024 ",null,null,"Produção da equipe ",9.1491000000000007,{"$f":"VLOOKUP(A694,ORÇAMENTO!$A$10:$L$42,7,1)","v":"M"}]
[null,94267,"GUIA (MEIO-FIO) E SARJETA CONJUGADOS DE CONCRETO, MOLDADA IN LOCO COM EXTRUSORA, 45 CM BASE (15 CM BASE DA GUIA + 30 CM BASE DA SARJETA) X 22 CM ALTURA",{"$nulls":5},"Valores em reais (R$)"]
[null,"A - EQUIPAMENTOS",null,"Quantidade","Utilização",null,"Custo Horário",null,null,"Custo"]
[{"$nulls":4},"Operativa","Improdutiva","Produtivo","Improdutivo",null,"Horário Total"]
[null,"E9102","Extrusora para sarjeta de concreto - 10,44 kW",1,0.17,0.83,46.516599999999997,32.439100000000003,null,{"$f":"D701*(E701*G701+F701*H701)","v":34.832275000000003}]
[null,"-",0,null,null,null,0,0,null,{"$f":"D702*(E702*G702+F702*H702)","v":0}]
[{"$nulls":7},"Custo horário total de equipamentos",null,{"$f":"SUM(J701:J702)","v":34.832275000000003}]
[null,"B - MÃO DE OBRA",null,"Quantidade","Unidade",null,"Custo Horário","Custo Horário Total"]
[null,"P9824","Servente",0.45300000000000001,"h",null,20.631399999999999,null,null,{"$f":"D705*G705","v":9.3460242000000004}]
[null,"P9802","Ajudante especializado",0.10929999999999999,"h",null,26.619499999999999,null,null,{"$f":"D706*G706","v":2.9095113499999998}]
[null,"P9821","Pedreiro",0.22650000000000001,"h",null,26.1035,null,null,{"$f":"D707*G707","v":5.9124427500000003}]
[null,null,null,"Custo horário total de mão de obra",{"$nulls":5},{"$f":"SUM(J705:J707)","v":18.167978300000001}]
[null,null,null,"Custo horário total de execução",{"$nulls":5},{"$f":"J703+J708","v":53.000253300000004}]
[null,null,null,"Custo unitário de execução",{"$nulls":5},{"$f":"J709/I697","v":5.7929472079220909}]
[{"$nulls":7},"Custo do FIC",null,0]
[{"$nulls":7},"Custo do FIT",null,0]
[null,"C - MATERIAL",null,"Quantidade","Unidade",null,"Preço Unitário","Custo Unitário"]
[null,"M0082","Areia média lavada",1.49E-2,"m³",null,165.2723,null,null,{"$f":"D714*G714","v":2.46255727},null,{"$f":"VLOOKUP(A$694,ORÇAMENTO!A$11:L$42,6,FALSE)","v":"SERV"},{"$f":"J714*L714","v":{"$error":"#VALUE!"}}]
[null,"M0451","Concreto usinado - fck = 20 MPa (comercial)",6.7299999999999999E-2,"m³",null,570,null,null,{"$f":"D715*G715","v":38.360999999999997},null,{"$f":"VLOOKUP(A$694,ORÇAMENTO!A$11:L$42,6,FALSE)","v":"SERV"},{"$f":"J715*L715","v":{"$error":"#VALUE!"}}]
[null,null,null,"Custo unitário total de material",{"$nulls":5},{"$f":"SUM(J714:J715)","v":40.823557269999995}]
[null,"D - ATIVIDADES AUXILIARES",null,"Quantidade","Unidade",null,"Custo Unitário","Custo Unitário"]
[null,1109669,"Argamassa de cimento e areia 1:3 - confecção em betoneira e lançamento manual - areia comercial",3.3E-3,"m³",null,508.55,null,null,{"$f":"D718*G718","v":1.678215},null,{"$f":"VLOOKUP(A$694,ORÇAMENTO!A$11:L$42,6,FALSE)","v":"SERV"},{"$f":"J718*L718","v":{"$error":"#VALUE!"}}]
[null,"-",0,0,0,null,0,null,null,{"$f":"D719*G719","v":0}]
[null,null,null,"Custo total de atividades auxiliares",{"$nulls":5},{"$f":"SUM(J718:J719)","v":1.678215}]
[{"$nulls":7},"Subtotal",null,{"$f":"J710+J716+J720+J711+J712","v":48.294719477922087}]
[null,"E - TEMPO FIXO",null,"Código","Quantidade","Unidade",null,"Custo Unitário","Custo Unitário"]
[null,"-",0,"-",0,"t",null,0,null,{"$f":"ROUNDDOWN(E723*H723,4)","v":0}]
[null,"-",0,"-",0,"t",null,0,null,{"$f":"ROUNDDOWN(E724*H724,4)","v":0}]
[null,null,null,"Custo unitário total de tempo fixo",{"$nulls":5},{"$f":"SUM(J723:J724)","v":0}]
[null,"F - MOMENTO DE TRANSPORTE",null,"Quantidade","Unidade","DMT",null,null,null,"Custo Unitário"]
[{"$nulls":5},"LN","RP","P"]
[null,"-",0,0,"tkm","5914449","5914464","5914479"]
[null,"-",0,0,"tkm","5914449","5914464","5914479"]
[null,null,null,"Custo unitário total de transporte"]
[{"$nulls":5},"Custo unitário direto total",null,null,null,{"$f":"TRUNC(J721+J725,2)","v":48.29}]
[null,"Obs."]
[]
[23,"1ª/GRD",{"$nulls":8},{"$f":"J771","v":24.06}]
[null,"OBRA:"," PAVIMENTAÇÃO ASFÁLTICA EM CBUQ - VIAS DIVERSAS - BAIRROS: N. SRA. DO ROSÁRIO, CÍCERO PASSOS E COMUNIDADE PERNAMBUCO - PIRAPORA-MG"]
[null,"Custo Unitário de Referência",null,null,"Minas Gerais"]
[{"$nulls":4}," Outubro/2024 ",null,null,"Produção da equipe ",11.534000000000001,{"$f":"VLOOKUP(A734,ORÇAMENTO!$A$10:$L$42,7,1)","v":"M"}]
[null,94263,"GUIA (MEIO FIO) EM CONCRETO, MOLDADO IN LOCO COM EXTRUSORA - 13CM DE BASE X 22CM DE ALTURA",{"$nulls":5},"Valores em reais (R$)"]
[null,"A - EQUIPAMENTOS",null,"Quantidade","Utilização",null,"Custo Horário",null,null,"Custo"]
[{"$nulls":4},"Operativa","Improdutiva","Produtivo","Improdutivo",null,"Horário Total"]
[null,"E9103","Extrusora para meio-fio de concreto - 10,44 kW",1,0.17,0.83,43.981299999999997,30.957000000000001,null,{"$f":"D741*(E741*G741+F741*H741)","v":33.171130999999995}]
[null,"-",0,null,null,null,0,0,null,{"$f":"D742*(E742*G742+F742*H742)","v":0}]
[{"$nulls":7},"Custo horário total de equipamentos",null,{"$f":"SUM(J741:J742)","v":33.171130999999995}]
[null,"B - MÃO DE OBRA",null,"Quantidade","Unidade",null,"Custo Horário","Custo Horário Total"]
[null,"P9821","Pedreiro",0.2039,"h",null,26.1035,null,null,{"$f":"D745*G745","v":5.3225036499999998}]
[null,"P9802","Ajudante especializado",8.6699999999999999E-2,"H",null,26.619499999999999,null,null,{"$f":"D746*G746","v":2.3079106499999997}]
[null,"P9824","Servente",0.4078,"h",null,20.631399999999999,null,null,{"$f":"D747*G747","v":8.4134849200000001}]
[null,null,null,"Custo horário total de mão de obra",{"$nulls":5},{"$f":"SUM(J745:J747)","v":16.04389922}]
[null,null,null,"Custo horário total de execução",{"$nulls":5},{"$f":"J743+J748","v":49.215030219999996}]
[null,null,null,"Custo unitário de execução",{"$nulls":5},{"$f":"J749/I737","v":4.2669525073695151}]
[{"$nulls":7},"Custo do FIC",null,0]
[{"$nulls":7},"Custo do FIT",null,0]
[null,"C - MATERIAL",null,"Quantidade","Unidade",null,"Preço Unitário","Custo Unitário"]
[null,"M0082","Areia média lavada",6.6E-3,"m³",null,165.2723,null,null,{"$f":"D754*G754","v":1.09079718},null,{"$f":"VLOOKUP(A$734,ORÇAMENTO!A$11:L$42,6,FALSE)","v":"SERV"},{"$f":"J754*L754","v":{"$error":"#VALUE!"}}]
[null,"M0451","Concreto usinado - fck = 20 MPa (comercial)",3.1399999999999997E-2,"m³",null,570,null,null,{"$f":"D755*G755","v":17.898}]
[null,null,null,"Custo unitário total de material",{"$nulls":5},{"$f":"SUM(J754:J755)","v":18.988797179999999}]
[null,"D - ATIVIDADES AUXILIARES",null,"Quantidade","Unidade",null,"Custo Unitário","Custo Unitário"]
[null,1109669,"Argamassa de cimento e areia 1:3 - confecção em betoneira e lançamento manual - areia comercial",1.6000000000000001E-3,"m³",null,508.55,null,null,{"$f":"D758*G758","v":0.81368000000000007},null,{"$f":"VLOOKUP(A$734,ORÇAMENTO!A$11:L$42,6,FALSE)","v":"SERV"},{"$f":"J758*L758","v":{"$error":"#VALUE!"}}]
[null,"-",0,null,0,null,0,null,null,{"$f":"D759*G759","v":0},null,{"$f":"VLOOKUP(A$734,ORÇAMENTO!A$11:L$42,6,FALSE)","v":"SERV"},{"$f":"J759*L759","v":{"$error":"#VALUE!"}}]
[null,null,null,"Custo total de atividades auxiliares",{"$nulls":5},{"$f":"SUM(J758:J759)","v":0.81368000000000007}]
[{"$nulls":7},"Subtotal",null,{"$f":"J750+J756+J760+J751+J752","v":24.069429687369517}]
[null,"E - TEMPO FIXO",null,"Código","Quantidade","Unidade",null,"Custo Unitário","Custo Unitário"]
[null,"-",0,"-",0,"t",null,0,null,{"$f":"ROUNDDOWN(E763*H763,4)","v":0}]
[null,"-",0,"-",0,"t",null,0,null,{"$f":"ROUNDDOWN(E764*H764,4)","v":0}]
[null,null,null,"Custo unitário total de tempo fixo",{"$nulls":5},{"$f":"SUM(J763:J764)","v":0}]
[null,"F - MOMENTO DE TRANSPORTE",null,"Quantidade","Unidade","DMT",null,null,null,"Custo Unitário"]
[{"$nulls":5},"LN","RP","P"]
[null,"-",0,0,"tkm"]
[null,"-",0,0,"tkm"]
[null,null,null,"Custo unitário total de transporte"]
[{"$nulls":5},"Custo unitário direto total",null,null,null,{"$f":"TRUNC(J761+J765,2)","v":24.06}]
[null,"Obs."]
[]
[46,"1ª/GRD",{"$nulls":8},{"$f":"J810","v":256.2}]
[null,"OBRA:"," PAVIMENTAÇÃO ASFÁLTICA EM CBUQ - VIAS DIVERSAS - BAIRROS: N. SRA. DO ROSÁRIO, CÍCERO PASSOS E COMUNIDADE PERNAMBUCO - PIRAPORA-MG"]
[null,"Custo Unitário de Referência",null,null,"Minas Gerais"]
[{"$nulls":4}," Outubro/2024 ",null,null,"Produção da equipe ",3,{"$f":"VLOOKUP(A774,ORÇAMENTO!$A$10:$L$42,7,1)","v":"UN."}]
[null,5213440,"PLACA DE REGULAMENTAÇÃO EM AÇO, D=60CM - PELÍCULA RETRORREFLETIVA - FORNECIMENTO E INSTALAÇÃO, INCLUSIVE  SUPORTE",{"$nulls":5},"Valores em reais (R$)"]
[null,"A - EQUIPAMENTOS",null,"Quantidade","Utilização",null,"Custo Horário",null,null,"Custo"]
[{"$nulls":4},"Operativa","Improdutiva","Produtivo","Improdutivo",null,"Horário Total"]
[null,"E9687","Caminhão carroceria com capacidade de 5 t - 115 kW",1,0.3,0.7,142.93629999999999,55.767499999999998,null,{"$f":"D781*(E781*G781+F781*H781)","v":81.918139999999994}]
[null,"-",0,null,null,null,0,0,null,{"$f":"D782*(E782*G782+F782*H782)","v":0}]
[{"$nulls":7},"Custo horário total de equipamentos",null,{"$f":"SUM(J781:J782)","v":81.918139999999994}]
[null,"B - MÃO DE OBRA",null,"Quantidade","Unidade",null,"Custo Horário","Custo Horário Total"]
[null,"P9830","Montador",1,"h",null,36.365400000000001,null,null,{"$f":"D785*G785","v":36.365400000000001}]
[null,"P9824","Servente",2,"h",null,20.631399999999999,null,null,{"$f":"D786*G786","v":41.262799999999999}]
[null,null,null,"Custo horário total de mão de obra",{"$nulls":5},{"$f":"SUM(J785:J786)","v":77.628199999999993}]
[null,null,null,"Custo horário total de execução",{"$nulls":5},{"$f":"J783+J787","v":159.54633999999999}]
[null,null,null,"Custo unitário de execução",{"$nulls":5},{"$f":"J788/I777","v":53.182113333333326}]
[{"$nulls":7},"Custo do FIC",null,0]
[{"$nulls":7},"Custo do FIT",null,0]
[null,"C - MATERIAL",null,"Quantidade","Unidade",null,"Preço Unitário","Custo Unitário"]
[null,"-",0,null,0,null,0,null,null,{"$f":"D793*G793","v":0},null,{"$f":"VLOOKUP(A$774,ORÇAMENTO!A$11:L$42,6,FALSE)","v":"SERV"},{"$f":"J793*L793","v":{"$error":"#VALUE!"}}]
[null,"-",0,null,0,null,0,null,null,{"$f":"D794*G794","v":0},null,{"$f":"VLOOKUP(A$774,ORÇAMENTO!A$11:L$42,6,FALSE)","v":"SERV"},{"$f":"J794*L794","v":{"$error":"#VALUE!"}}]
[null,null,null,"Custo unitário total de material",{"$nulls":5},{"$f":"SUM(J793:J794)","v":0}]
[null,"D - ATIVIDADES AUXILIARES",null,"Quantidade","Unidade",null,"Custo Unitário","Custo Unitário"]
[null,5213414,"Placa em aço nº 16 galvanizado com película retrorrefletiva tipo I + SI - confecção",0.35993999999999998,"m²",null,564.05999999999995,null,null,{"$f":"D797*G797","v":203.02775639999996},null,{"$f":"VLOOKUP(A$774,ORÇAMENTO!A$11:L$42,6,FALSE)","v":"SERV"},{"$f":"J797*L797","v":{"$error":"#VALUE!"}}]
[null,"-",0,null,0,null,0,null,null,{"$f":"D798*G798","v":0},null,{"$f":"VLOOKUP(A$774,ORÇAMENTO!A$11:L$42,6,FALSE)","v":"SERV"},{"$error":"#VALUE!"}]
[null,null,null,"Custo total de atividades auxiliares",{"$nulls":5},{"$f":"SUM(J797:J798)","v":203.02775639999996}]
[{"$nulls":7},"Subtotal",null,{"$f":"J789+J795+J799+J790+J791","v":256.20986973333328}]
[null,"E - TEMPO FIXO",null,"Código","Quantidade","Unidade",null,"Custo Unitário","Custo Unitário"]
[null,"-",0,"-",null,"t",null,0,null,{"$f":"ROUNDDOWN(E802*H802,4)","v":0}]
[null,"-",0,"-",null,"t",null,0,null,{"$f":"ROUNDDOWN(E803*H803,4)","v":0}]
[null,null,null,"Custo unitário total de tempo fixo",{"$nulls":5},{"$f":"SUM(J802:J803)","v":0}]
[null,"F - MOMENTO DE TRANSPORTE",null,"Quantidade","Unidade","DMT",null,null,null,"Custo Unitário"]
[{"$nulls":5},"LN","RP","P"]
[null,"-",0,null,"tkm"]
[null,"-",0,null,"tkm"]
[null,null,null,"Custo unitário total de transporte"]
[{"$nulls":5},"Custo unitário direto total",null,null,null,{"$f":"TRUNC(J800+J804,2)","v":256.2}]
[null,"Obs."]
[]
[49,"1ª/GRD",{"$nulls":8},{"$f":"J856","v":32.409999999999997}]
[null,"OBRA:"," PAVIMENTAÇÃO ASFÁLTICA EM CBUQ - VIAS DIVERSAS - BAIRROS: N. SRA. DO ROSÁRIO, CÍCERO PASSOS E COMUNIDADE PERNAMBUCO - PIRAPORA-MG"]
[null,"Custo Unitário de Referência",null,null,"Minas Gerais"]
[{"$nulls":4}," Outubro/2024 ",null,null,"Produção da equipe ",149.4,{"$f":"VLOOKUP(A813,ORÇAMENTO!$A$10:$L$42,7,1)","v":"M2"}]
[null,5213401,"PINTURA DE EIXO VIÁRIO SOBRE ASFALTO COM TINTA RETRORREFLETIVA A BASE DE RESINA ACRÍLICA COM MICROESFERAS DE VIDRO, APLICAÇÃO MECÂNICA COM DEMARCADORA AUTOPROPELIDA",{"$nulls":5},"Valores em reais (R$)"]
[null,"A - EQUIPAMENTOS",null,"Quantidade","Utilização",null,"Custo Horário",null,null,"Custo"]
[{"$nulls":4},"Operativa","Improdutiva","Produtivo","Improdutivo",null,"Horário Total"]
[null,"E9644","Caminhão demarcador de faixas com sistema de pintura a frio - 28 kW/115 kW",1,1,0,366.9502,152.35400000000001,null,{"$f":"D820*(E820*G820+F820*H820)","v":366.9502}]
[null,"-",0,null,null,null,0,0,null,{"$f":"D821*(E821*G821+F821*H821)","v":0}]
[{"$nulls":7},"Custo horário total de equipamentos",null,{"$f":"SUM(J820:J821)","v":366.9502}]
[null,"B - MÃO DE OBRA",null,"Quantidade","Unidade",null,"Custo Horário","Custo Horário Total"]
[null,"P9853","Pré-marcador",1,"h",null,22.472100000000001,null,null,{"$f":"D824*G824","v":22.472100000000001}]
[null,"P9824","Servente",4,"h",null,20.631399999999999,null,null,{"$f":"D825*G825","v":82.525599999999997}]
[null,null,null,"Custo horário total de mão de obra",{"$nulls":5},{"$f":"SUM(J824:J825)","v":104.99769999999999}]
[null,null,null,"Custo horário total de execução",{"$nulls":5},{"$f":"J822+J826","v":471.9479}]
[null,null,null,"Custo unitário de execução",{"$nulls":5},{"$f":"J827/I816","v":3.1589551539491296}]
[{"$nulls":7},"Custo do FIC",null,0]
[{"$nulls":7},"Custo do FIT",null,0]
[null,"C - MATERIAL",null,"Quantidade","Unidade",null,"Preço Unitário","Custo Unitário"]
[null,"M2037","Microesferas refletivas de vidro tipo I-B",0.12,"kg",null,9.0991,null,null,{"$f":"D832*G832","v":1.0918919999999999},null,{"$f":"VLOOKUP(A$813,ORÇAMENTO!A$11:L$42,6,FALSE)","v":"SERV"},{"$f":"J832*L832","v":{"$error":"#VALUE!"}}]
[null,"M2038","Microesferas refletivas de vidro tipo II-A",0.35,"kg",null,9.2805999999999997,null,null,{"$f":"D833*G833","v":3.2482099999999998},null,{"$f":"VLOOKUP(A$813,ORÇAMENTO!A$11:L$42,6,FALSE)","v":"SERV"},{"$f":"J833*L833","v":{"$error":"#VALUE!"}}]
[null,"M2034","Solvente para tinta à base de resina acrílica",0.03,"l",null,16.705500000000001,null,null,0.50116499999999997,null,{"$f":"VLOOKUP(A$813,ORÇAMENTO!A$11:L$42,6,FALSE)","v":"SERV"},{"$error":"#VALUE!"}]
[null,"M2044","Tinta à base de resina acrílica emulsionada em água para pré-marcação viária",9.7000000000000005E-4,"l",null,21.940899999999999,null,null,2.1282673000000002E-2,null,{"$f":"VLOOKUP(A$813,ORÇAMENTO!A$11:L$42,6,FALSE)","v":"SERV"},{"$error":"#VALUE!"}]
[null,"M2027","Tinta à base de resina acrílica estirenada para demarcação viária",0.6,"l",null,40.589599999999997,null,null,24.353759999999998,null,{"$f":"VLOOKUP(A$813,ORÇAMENTO!A$11:L$42,6,FALSE)","v":"SERV"},{"$error":"#VALUE!"}]
[null,null,null,"Custo unitário total de material",{"$nulls":5},{"$f":"SUM(J832:J836)","v":29.216309672999998}]
[null,"D - ATIVIDADES AUXILIARES",null,"Quantidade","Unidade",null,"Custo Unitário","Custo Unitário"]
[null,"-",0,null,0,null,0,null,null,{"$f":"D839*G839","v":0}]
[null,"-",0,null,0,null,0,null,null,{"$f":"D840*G840","v":0}]
[null,null,null,"Custo total de atividades auxiliares",{"$nulls":5},{"$f":"SUM(J839:J840)","v":0}]
[{"$nulls":7},"Subtotal",null,{"$f":"J828+J837+J841+J829+J830","v":32.375264826949127}]
[null,"E - TEMPO FIXO",null,"Código","Quantidade","Unidade",null,"Custo Unitário","Custo Unitário"]
[null,"M2037","Microesferas refletivas de vidro tipo I-B",5914655,1.2E-4,"t",null,31.73,null,{"$f":"ROUNDDOWN(E844*H844,4)","v":3.8E-3}]
[null,"M2038","Microesferas refletivas de vidro tipo II-A",5914655,3.5E-4,"t",null,31.73,null,{"$f":"ROUNDDOWN(E845*H845,4)","v":1.11E-2}]
[null,"M2034","Solvente para tinta à base de resina acrílica",5914655,3.0000000000000001E-5,"t",null,31.73,null,8.9999999999999998E-4]
[null,"M2027","Tinta à base de resina acrílica estirenada para demarcação viária",5914655,8.3000000000000001E-4,"t",null,31.73,null,2.63E-2]
[null,null,null,"Custo unitário total de tempo fixo",{"$nulls":5},{"$f":"SUM(J844:J847)","v":4.2099999999999999E-2}]
[null,"F - MOMENTO DE TRANSPORTE",null,"Quantidade","Unidade","DMT",null,null,null,"Custo Unitário"]
[{"$nulls":5},"LN","RP","P"]
[null,"M2037","Microesferas refletivas de vidro tipo I-B",1.2E-4,"tkm"]
[null,"M2038","Microesferas refletivas de vidro tipo II-A",3.5E-4,"tkm"]
[null,"M2034","Solvente para tinta à base de resina acrílica",3.0000000000000001E-5,"tkm"]
[null,"M2027","Tinta à base de resina acrílica estirenada para demarcação viária",8.3000000000000001E-4,"tkm"]
[null,null,null,"Custo unitário total de transporte"]
[{"$nulls":5},"Custo unitário direto total",null,null,null,{"$f":"TRUNC(J842+J848,2)","v":32.409999999999997}]
[null,"Obs."]
[]
[51,"1ª/GRD",{"$nulls":8},{"$f":"J902","v":44.89}]
[null,"OBRA:"," PAVIMENTAÇÃO ASFÁLTICA EM CBUQ - VIAS DIVERSAS - BAIRROS: N. SRA. DO ROSÁRIO, CÍCERO PASSOS E COMUNIDADE PERNAMBUCO - PIRAPORA-MG"]
[null,"Custo Unitário de Referência",null,null,"Minas Gerais"]
[{"$nulls":4}," Outubro/2024 ",null,null,"Produção da equipe ",30.18,{"$f":"VLOOKUP(A859,ORÇAMENTO!$A$10:$L$42,7,1)","v":"M2"}]
[null,5213405,"PINTURA DE FAIXA DE PEDESTRE OU ZEBRADA TINTA RETRORREFLETIVA A BASE DE RESINA ACRÍLICA COM MICROESFERAS DE VIDRO, APLICAÇÃO MANUAL",{"$nulls":5},"Valores em reais (R$)"]
[null,"A - EQUIPAMENTOS",null,"Quantidade","Utilização",null,"Custo Horário",null,null,"Custo"]
[{"$nulls":4},"Operativa","Improdutiva","Produtivo","Improdutivo",null,"Horário Total"]
[null,"E9644","Caminhão demarcador de faixas com sistema de pintura a frio - 28 kW/115 kW",1,1,0,366.9502,152.35400000000001,null,{"$f":"D866*(E866*G866+F866*H866)","v":366.9502}]
[null,"-",0,null,null,null,0,0,null,{"$f":"D867*(E867*G867+F867*H867)","v":0}]
[{"$nulls":7},"Custo horário total de equipamentos",null,{"$f":"SUM(J866:J867)","v":366.9502}]
[null,"B - MÃO DE OBRA",null,"Quantidade","Unidade",null,"Custo Horário","Custo Horário Total"]
[null,"P9853","Pré-marcador",1,"h",null,22.472100000000001,null,null,{"$f":"D870*G870","v":22.472100000000001}]
[null,"P9824","Servente",4,"h",null,20.631399999999999,null,null,{"$f":"D871*G871","v":82.525599999999997}]
[null,null,null,"Custo horário total de mão de obra",{"$nulls":5},{"$f":"SUM(J870:J871)","v":104.99769999999999}]
[null,null,null,"Custo horário total de execução",{"$nulls":5},{"$f":"J868+J872","v":471.9479}]
[null,null,null,"Custo unitário de execução",{"$nulls":5},{"$f":"J873/I862","v":15.637770046388336}]
[{"$nulls":7},"Custo do FIC",null,0]
[{"$nulls":7},"Custo do FIT",null,0]
[null,"C - MATERIAL",null,"Quantidade","Unidade",null,"Preço Unitário","Custo Unitário"]
[null,"M2037","Microesferas refletivas de vidro tipo I-B",0.12,"kg",null,9.0991,null,null,{"$f":"D878*G878","v":1.0918919999999999},null,{"$f":"VLOOKUP(A859,ORÇAMENTO!A$11:L$42,6,FALSE)","v":"SERV"},{"$f":"J878*L878","v":{"$error":"#VALUE!"}}]
[null,"M2038","Microesferas refletivas de vidro tipo II-A",0.35,"kg",null,9.2805999999999997,null,null,{"$f":"D879*G879","v":3.2482099999999998},null,{"$f":"VLOOKUP(A$859,ORÇAMENTO!A$11:L$42,6,FALSE)","v":"SERV"},{"$f":"J879*L879","v":{"$error":"#VALUE!"}}]
[null,"M2034","Solvente para tinta à base de resina acrílica",0.03,"l",null,16.705500000000001,null,null,0.50116499999999997,null,{"$f":"VLOOKUP(A$859,ORÇAMENTO!A$11:L$42,6,FALSE)","v":"SERV"},{"$f":"J880*L880","v":{"$error":"#VALUE!"}}]
[null,"M2044","Tinta à base de resina acrílica emulsionada em água para pré-marcação viária",9.7000000000000005E-4,"l",null,21.940899999999999,null,null,2.1282673000000002E-2,null,{"$f":"VLOOKUP(A$859,ORÇAMENTO!A$11:L$42,6,FALSE)","v":"SERV"},{"$error":"#VALUE!"}]
[null,"M2027","Tinta à base de resina acrílica estirenada para demarcação viária",0.6,"l",null,40.589599999999997,null,null,24.353759999999998,null,{"$f":"VLOOKUP(A$859,ORÇAMENTO!A$11:L$42,6,FALSE)","v":"SERV"},{"$error":"#VALUE!"}]
[null,null,null,"Custo unitário total de material",{"$nulls":5},{"$f":"SUM(J878:J882)","v":29.216309672999998}]
[null,"D - ATIVIDADES AUXILIARES",null,"Quantidade","Unidade",null,"Custo Unitário","Custo Unitário"]
[null,"-",0,null,0,null,0,null,null,{"$f":"D885*G885","v":0}]
[null,"-",0,null,0,null,0,null,null,{"$f":"D886*G886","v":0}]
[null,null,null,"Custo total de atividades auxiliares",{"$nulls":5},{"$f":"SUM(J885:J886)","v":0}]
[{"$nulls":7},"Subtotal",null,{"$f":"J874+J883+J887+J875+J876","v":44.854079719388338}]
[null,"E - TEMPO FIXO",null,"Código","Quantidade","Unidade",null,"Custo Unitário","Custo Unitário"]
[null,"M2037","Microesferas refletivas de vidro tipo I-B",5914655,1.2E-4,"t",null,31.73,null,{"$f":"ROUNDDOWN(E890*H890,4)","v":3.8E-3}]
[null,"M2038","Microesferas refletivas de vidro tipo II-A",5914655,3.5E-4,"t",null,31.73,null,{"$f":"ROUNDDOWN(E891*H891,4)","v":1.11E-2}]
[null,"M2034","Solvente para tinta à base de resina acrílica",5914655,3.0000000000000001E-5,"t",null,31.73,null,8.9999999999999998E-4]
[null,"M2027","Tinta à base de resina acrílica estirenada para demarcação viária",5914655,8.3000000000000001E-4,"t",null,31.73,null,2.63E-2]
[null,null,null,"Custo unitário total de tempo fixo",{"$nulls":5},{"$f":"SUM(J890:J893)","v":4.2099999999999999E-2}]
[null,"F - MOMENTO DE TRANSPORTE",null,"Quantidade","Unidade","DMT",null,null,null,"Custo Unitário"]
[{"$nulls":5},"LN","RP","P"]
[null,"M2037","Microesferas refletivas de vidro tipo I-B",1.2E-4,"tkm"]
[null,"M2038","Microesferas refletivas de vidro tipo II-A",3.5E-4,"tkm"]
[null,"M2034","Solvente para tinta à base de resina acrílica",3.0000000000000001E-5,"tkm"]
[null,"M2027","Tinta à base de resina acrílica estirenada para demarcação viária",8.3000000000000001E-4,"tkm"]
[null,null,null,"Custo unitário total de transporte"]
[{"$nulls":5},"Custo unitário direto total",null,null,null,{"$f":"TRUNC(J888+J894,2)","v":44.89}]
[null,"Obs."]
[]
[{"$f":"A859+1","v":52},"1ª/GRD",{"$nulls":8},{"$f":"J953","v":0}]
[null,"OBRA:"," PAVIMENTAÇÃO ASFÁLTICA EM CBUQ - VIAS DIVERSAS - BAIRROS: N. SRA. DO ROSÁRIO, CÍCERO PASSOS E COMUNIDADE PERNAMBUCO - PIRAPORA-MG"]
[null,"Custo Unitário de Referência",null,null,"Minas Gerais"]
[{"$nulls":4}," Outubro/2024 ",null,null,"Produção da equipe ",1,{"$f":"VLOOKUP(A905,ORÇAMENTO!$A$10:$L$42,7,1)","v":"M2"}]
[null,5213405,"PINTURA DE FAIXA DE PEDESTRE OU ZEBRADA TINTA RETRORREFLETIVA A BASE DE RESINA ACRÍLICA COM MICROESFERAS DE VIDRO, APLICAÇÃO MANUAL",{"$nulls":5},"Valores em reais (R$)"]
[null,"A - EQUIPAMENTOS",null,"Quantidade","Utilização",null,"Custo Horário",null,null,"Custo"]
[{"$nulls":4},"Operativa","Improdutiva","Produtivo","Improdutivo",null,"Horário Total"]
[null,"-",0,null,null,null,0,0,null,{"$f":"D912*(E912*G912+F912*H912)","v":0}]
[null,"-",0,null,null,null,0,0,null,{"$f":"D913*(E913*G913+F913*H913)","v":0}]
[{"$nulls":7},"Custo horário total de equipamentos",null,{"$f":"SUM(J912:J913)","v":0}]
[null,"B - MÃO DE OBRA",null,"Quantidade","Unidade",null,"Custo Horário","Custo Horário Total"]
[null,"-",0,null,0,null,0,null,null,{"$f":"D916*G916","v":0}]
[null,"-",0,null,0,null,0,null,null,{"$f":"D917*G917","v":0}]
[null,null,null,"Custo horário total de mão de obra",{"$nulls":5},{"$f":"SUM(J916:J917)","v":0}]
[null,null,null,"Custo horário total de execução",{"$nulls":5},{"$f":"J914+J918","v":0}]
[null,null,null,"Custo unitário de execução",{"$nulls":5},{"$f":"J919/I908","v":0}]
[{"$nulls":7},"Custo do FIC",null,0]
[{"$nulls":7},"Custo do FIT",null,0]
[null,"C - MATERIAL",null,"Quantidade","Unidade",null,"Preço Unitário","Custo Unitário"]
[null,"-",0,null,0,null,0,null,null,{"$f":"D924*G924","v":0}]
[null,"-",0,null,0,null,0,null,null,{"$f":"D925*G925","v":0}]
[null,"-",0,null,0,null,0,null,null,0]
[null,"-",0,null,0,null,0,null,null,0]
[null,"-",0,null,0,null,0,null,null,0]
[null,null,null,"Custo unitário total de material",{"$nulls":5},{"$f":"SUM(J924:J928)","v":0}]
[null,"D - ATIVIDADES AUXILIARES",null,"Quantidade","Unidade",null,"Custo Unitário","Custo Unitário"]
[null,"-",0,null,0,null,0,null,null,{"$f":"D931*G931","v":0}]
[null,"-",0,null,0,null,0,null,null,{"$f":"D932*G932","v":0}]
[null,"-",0,null,0,null,0,null,null,{"$f":"D933*G933","v":0}]
[null,null,null,"Custo total de atividades auxiliares",{"$nulls":5},{"$f":"SUM(J931:J933)","v":0}]
[{"$nulls":7},"Subtotal",null,{"$f":"J920+J929+J934+J921+J922","v":0}]
[null,"E - TEMPO FIXO",null,"Código","Quantidade","Unidade",null,"Custo Unitário","Custo Unitário"]
[null,"-",0,"-",null,"t",null,0,null,{"$f":"ROUNDDOWN(E937*H937,4)","v":0}]
[null,"-",0,"-",null,"t",null,0,null,{"$f":"ROUNDDOWN(E938*H938,4)","v":0}]
[null,"-",0,"-",null,"t",null,0,null,0]
[null,"-",0,"-",null,"t",null,0,null,0]
[null,"-",0,"-",null,"t",null,0,null,0]
[null,"-",0,"-",null,"t",null,0,null,0]
[null,null,null,"Custo unitário total de tempo fixo",{"$nulls":5},{"$f":"SUM(J937:J942)","v":0}]
[null,"F - MOMENTO DE TRANSPORTE",null,"Quantidade","Unidade","DMT",null,null,null,"Custo Unitário"]
[{"$nulls":5},"LN","RP","P"]
[null,"-",0,null,"tkm"]
[null,"-",0,null,"tkm"]
[null,"-",0,null,"tkm"]
[null,"-",0,null,"tkm"]
[null,"-",0,null,"tkm"]
[null,"-",0,null,"tkm"]
[null,null,null,"Custo unitário total de transporte"]
[{"$nulls":5},"Custo unitário direto total",null,null,null,{"$f":"J935+J943","v":0}]
[null,"Obs."]
[]
[{"$f":"A905+1","v":53},"1ª/GRD",{"$nulls":8},{"$f":"J1004","v":0}]
[null,"OBRA:"," PAVIMENTAÇÃO ASFÁLTICA EM CBUQ - VIAS DIVERSAS - BAIRROS: N. SRA. DO ROSÁRIO, CÍCERO PASSOS E COMUNIDADE PERNAMBUCO - PIRAPORA-MG"]
[null,"Custo Unitário de Referência",null,null,"Minas Gerais"]
[{"$nulls":4}," Outubro/2024 ",null,null,"Produção da equipe ",1,{"$f":"VLOOKUP(A956,ORÇAMENTO!$A$10:$L$42,7,1)","v":"M2"}]
[null,5213405,"PINTURA DE FAIXA DE PEDESTRE OU ZEBRADA TINTA RETRORREFLETIVA A BASE DE RESINA ACRÍLICA COM MICROESFERAS DE VIDRO, APLICAÇÃO MANUAL",{"$nulls":5},"Valores em reais (R$)"]
[null,"A - EQUIPAMENTOS",null,"Quantidade","Utilização",null,"Custo Horário",null,null,"Custo"]
[{"$nulls":4},"Operativa","Improdutiva","Produtivo","Improdutivo",null,"Horário Total"]
[null,"-",0,null,null,null,0,0,null,{"$f":"D963*(E963*G963+F963*H963)","v":0}]
[null,"-",0,null,null,null,0,0,null,{"$f":"D964*(E964*G964+F964*H964)","v":0}]
[{"$nulls":7},"Custo horário total de equipamentos",null,{"$f":"SUM(J963:J964)","v":0}]
[null,"B - MÃO DE OBRA",null,"Quantidade","Unidade",null,"Custo Horário","Custo Horário Total"]
[null,"-",0,null,0,null,0,null,null,{"$f":"D967*G967","v":0}]
[null,"-",0,null,0,null,0,null,null,{"$f":"D968*G968","v":0}]
[null,null,null,"Custo horário total de mão de obra",{"$nulls":5},{"$f":"SUM(J967:J968)","v":0}]
[null,null,null,"Custo horário total de execução",{"$nulls":5},{"$f":"J965+J969","v":0}]
[null,null,null,"Custo unitário de execução",{"$nulls":5},{"$f":"J970/I959","v":0}]
[{"$nulls":7},"Custo do FIC",null,0]
[{"$nulls":7},"Custo do FIT",null,0]
[null,"C - MATERIAL",null,"Quantidade","Unidade",null,"Preço Unitário","Custo Unitário"]
[null,"-",0,null,0,null,0,null,null,{"$f":"D975*G975","v":0}]
[null,"-",0,null,0,null,0,null,null,{"$f":"D976*G976","v":0}]
[null,"-",0,null,0,null,0,null,null,0]
[null,"-",0,null,0,null,0,null,null,0]
[null,"-",0,null,0,null,0,null,null,0]
[null,null,null,"Custo unitário total de material",{"$nulls":5},{"$f":"SUM(J975:J979)","v":0}]
[null,"D - ATIVIDADES AUXILIARES",null,"Quantidade","Unidade",null,"Custo Unitário","Custo Unitário"]
[null,"-",0,null,0,null,0,null,null,{"$f":"D982*G982","v":0}]
[null,"-",0,null,0,null,0,null,null,{"$f":"D983*G983","v":0}]
[null,"-",0,null,0,null,0,null,null,{"$f":"D984*G984","v":0}]
[null,null,null,"Custo total de atividades auxiliares",{"$nulls":5},{"$f":"SUM(J982:J984)","v":0}]
[{"$nulls":7},"Subtotal",null,{"$f":"J971+J980+J985+J972+J973","v":0}]
[null,"E - TEMPO FIXO",null,"Código","Quantidade","Unidade",null,"Custo Unitário","Custo Unitário"]
[null,"-",0,"-",null,"t",null,0,null,{"$f":"ROUNDDOWN(E988*H988,4)","v":0}]
[null,"-",0,"-",null,"t",null,0,null,{"$f":"ROUNDDOWN(E989*H989,4)","v":0}]
[null,"-",0,"-",null,"t",null,0,null,0]
[null,"-",0,"-",null,"t",null,0,null,0]
[null,"-",0,"-",null,"t",null,0,null,0]
[null,"-",0,"-",null,"t",null,0,null,0]
[null,null,null,"Custo unitário total de tempo fixo",{"$nulls":5},{"$f":"SUM(J988:J993)","v":0}]
[null,"F - MOMENTO DE TRANSPORTE",null,"Quantidade","Unidade","DMT",null,null,null,"Custo Unitário"]
[{"$nulls":5},"LN","RP","P"]
[null,"-",0,null,"tkm"]
[null,"-",0,null,"tkm"]
[null,"-",0,null,"tkm"]
[null,"-",0,null,"tkm"]
[null,"-",0,null,"tkm"]
[null,"-",0,null,"tkm"]
[null,null,null,"Custo unitário total de transporte"]
[{"$nulls":5},"Custo unitário direto total",null,null,null,{"$f":"J986+J994","v":0}]
[null,"Obs."]
[]
[{"$f":"A956+1","v":54},"1ª/GRD",{"$nulls":8},{"$f":"J1055","v":0}]
[null,"OBRA:"," PAVIMENTAÇÃO ASFÁLTICA EM CBUQ - VIAS DIVERSAS - BAIRROS: N. SRA. DO ROSÁRIO, CÍCERO PASSOS E COMUNIDADE PERNAMBUCO - PIRAPORA-MG"]
[null,"Custo Unitário de Referência",null,null,"Minas Gerais"]
[{"$nulls":4}," Outubro/2024 ",null,null,"Produção da equipe ",1,{"$f":"VLOOKUP(A1007,ORÇAMENTO!$A$10:$L$42,7,1)","v":"M2"}]
[null,5213405,"PINTURA DE FAIXA DE PEDESTRE OU ZEBRADA TINTA RETRORREFLETIVA A BASE DE RESINA ACRÍLICA COM MICROESFERAS DE VIDRO, APLICAÇÃO MANUAL",{"$nulls":5},"Valores em reais (R$)"]
[null,"A - EQUIPAMENTOS",null,"Quantidade","Utilização",null,"Custo Horário",null,null,"Custo"]
[{"$nulls":4},"Operativa","Improdutiva","Produtivo","Improdutivo",null,"Horário Total"]
[null,"-",0,null,null,null,0,0,null,{"$f":"D1014*(E1014*G1014+F1014*H1014)","v":0}]
[null,"-",0,null,null,null,0,0,null,{"$f":"D1015*(E1015*G1015+F1015*H1015)","v":0}]
[{"$nulls":7},"Custo horário total de equipamentos",null,{"$f":"SUM(J1014:J1015)","v":0}]
[null,"B - MÃO DE OBRA",null,"Quantidade","Unidade",null,"Custo Horário","Custo Horário Total"]
[null,"-",0,null,0,null,0,null,null,{"$f":"D1018*G1018","v":0}]
[null,"-",0,null,0,null,0,null,null,{"$f":"D1019*G1019","v":0}]
[null,null,null,"Custo horário total de mão de obra",{"$nulls":5},{"$f":"SUM(J1018:J1019)","v":0}]
[null,null,null,"Custo horário total de execução",{"$nulls":5},{"$f":"J1016+J1020","v":0}]
[null,null,null,"Custo unitário de execução",{"$nulls":5},{"$f":"J1021/I1010","v":0}]
[{"$nulls":7},"Custo do FIC",null,0]
[{"$nulls":7},"Custo do FIT",null,0]
[null,"C - MATERIAL",null,"Quantidade","Unidade",null,"Preço Unitário","Custo Unitário"]
[null,"-",0,null,0,null,0,null,null,{"$f":"D1026*G1026","v":0}]
[null,"-",0,null,0,null,0,null,null,{"$f":"D1027*G1027","v":0}]
[null,"-",0,null,0,null,0,null,null,0]
[null,"-",0,null,0,null,0,null,null,0]
[null,"-",0,null,0,null,0,null,null,0]
[null,null,null,"Custo unitário total de material",{"$nulls":5},{"$f":"SUM(J1026:J1030)","v":0}]
[null,"D - ATIVIDADES AUXILIARES",null,"Quantidade","Unidade",null,"Custo Unitário","Custo Unitário"]
[null,"-",0,null,0,null,0,null,null,{"$f":"D1033*G1033","v":0}]
[null,"-",0,null,0,null,0,null,null,{"$f":"D1034*G1034","v":0}]
[null,"-",0,null,0,null,0,null,null,{"$f":"D1035*G1035","v":0}]
[null,null,null,"Custo total de atividades auxiliares",{"$nulls":5},{"$f":"SUM(J1033:J1035)","v":0}]
[{"$nulls":7},"Subtotal",null,{"$f":"J1022+J1031+J1036+J1023+J1024","v":0}]
[null,"E - TEMPO FIXO",null,"Código","Quantidade","Unidade",null,"Custo Unitário","Custo Unitário"]
[null,"-",0,"-",null,"t",null,0,null,{"$f":"ROUNDDOWN(E1039*H1039,4)","v":0}]
[null,"-",0,"-",null,"t",null,0,null,{"$f":"ROUNDDOWN(E1040*H1040,4)","v":0}]
[null,"-",0,"-",null,"t",null,0,null,0]
[null,"-",0,"-",null,"t",null,0,null,0]
[null,"-",0,"-",null,"t",null,0,null,0]
[null,"-",0,"-",null,"t",null,0,null,0]
[null,null,null,"Custo unitário total de tempo fixo",{"$nulls":5},{"$f":"SUM(J1039:J1044)","v":0}]
[null,"F - MOMENTO DE TRANSPORTE",null,"Quantidade","Unidade","DMT",null,null,null,"Custo Unitário"]
[{"$nulls":5},"LN","RP","P"]
[null,"-",0,null,"tkm"]
[null,"-",0,null,"tkm"]
[null,"-",0,null,"tkm"]
[null,"-",0,null,"tkm"]
[null,"-",0,null,"tkm"]
[null,"-",0,null,"tkm"]
[null,null,null,"Custo unitário total de transporte"]
[{"$nulls":5},"Custo unitário direto total",null,null,null,{"$f":"J1037+J1045","v":0}]
[null,"Obs."]
[]
[{"$f":"A1007+1","v":55},"1ª/GRD",{"$nulls":8},{"$f":"J1106","v":0}]
[null,"OBRA:"," PAVIMENTAÇÃO ASFÁLTICA EM CBUQ - VIAS DIVERSAS - BAIRROS: N. SRA. DO ROSÁRIO, CÍCERO PASSOS E COMUNIDADE PERNAMBUCO - PIRAPORA-MG"]
[null,"Custo Unitário de Referência",null,null,"Minas Gerais"]
[{"$nulls":4}," Outubro/2024 ",null,null,"Produção da equipe ",1,{"$f":"VLOOKUP(A1058,ORÇAMENTO!$A$10:$L$42,7,1)","v":"M2"}]
[null,5213405,"PINTURA DE FAIXA DE PEDESTRE OU ZEBRADA TINTA RETRORREFLETIVA A BASE DE RESINA ACRÍLICA COM MICROESFERAS DE VIDRO, APLICAÇÃO MANUAL",{"$nulls":5},"Valores em reais (R$)"]
[null,"A - EQUIPAMENTOS",null,"Quantidade","Utilização",null,"Custo Horário",null,null,"Custo"]
[{"$nulls":4},"Operativa","Improdutiva","Produtivo","Improdutivo",null,"Horário Total"]
[null,"-",0,null,null,null,0,0,null,{"$f":"D1065*(E1065*G1065+F1065*H1065)","v":0}]
[null,"-",0,null,null,null,0,0,null,{"$f":"D1066*(E1066*G1066+F1066*H1066)","v":0}]
[{"$nulls":7},"Custo horário total de equipamentos",null,{"$f":"SUM(J1065:J1066)","v":0}]
[null,"B - MÃO DE OBRA",null,"Quantidade","Unidade",null,"Custo Horário","Custo Horário Total"]
[null,"-",0,null,0,null,0,null,null,{"$f":"D1069*G1069","v":0}]
[null,"-",0,null,0,null,0,null,null,{"$f":"D1070*G1070","v":0}]
[null,null,null,"Custo horário total de mão de obra",{"$nulls":5},{"$f":"SUM(J1069:J1070)","v":0}]
[null,null,null,"Custo horário total de execução",{"$nulls":5},{"$f":"J1067+J1071","v":0}]
[null,null,null,"Custo unitário de execução",{"$nulls":5},{"$f":"J1072/I1061","v":0}]
[{"$nulls":7},"Custo do FIC",null,0]
[{"$nulls":7},"Custo do FIT",null,0]
[null,"C - MATERIAL",null,"Quantidade","Unidade",null,"Preço Unitário","Custo Unitário"]
[null,"-",0,null,0,null,0,null,null,{"$f":"D1077*G1077","v":0}]
[null,"-",0,null,0,null,0,null,null,{"$f":"D1078*G1078","v":0}]
[null,"-",0,null,0,null,0,null,null,0]
[null,"-",0,null,0,null,0,null,null,0]
[null,"-",0,null,0,null,0,null,null,0]
[null,null,null,"Custo unitário total de material",{"$nulls":5},{"$f":"SUM(J1077:J1081)","v":0}]
[null,"D - ATIVIDADES AUXILIARES",null,"Quantidade","Unidade",null,"Custo Unitário","Custo Unitário"]
[null,"-",0,null,0,null,0,null,null,{"$f":"D1084*G1084","v":0}]
[null,"-",0,null,0,null,0,null,null,{"$f":"D1085*G1085","v":0}]
[null,"-",0,null,0,null,0,null,null,{"$f":"D1086*G1086","v":0}]
[null,null,null,"Custo total de atividades auxiliares",{"$nulls":5},{"$f":"SUM(J1084:J1086)","v":0}]
[{"$nulls":7},"Subtotal",null,{"$f":"J1073+J1082+J1087+J1074+J1075","v":0}]
[null,"E - TEMPO FIXO",null,"Código","Quantidade","Unidade",null,"Custo Unitário","Custo Unitário"]
[null,"-",0,"-",null,"t",null,0,null,{"$f":"ROUNDDOWN(E1090*H1090,4)","v":0}]
[null,"-",0,"-",null,"t",null,0,null,{"$f":"ROUNDDOWN(E1091*H1091,4)","v":0}]
[null,"-",0,"-",null,"t",null,0,null,0]
[null,"-",0,"-",null,"t",null,0,null,0]
[null,"-",0,"-",null,"t",null,0,null,0]
[null,"-",0,"-",null,"t",null,0,null,0]
[null,null,null,"Custo unitário total de tempo fixo",{"$nulls":5},{"$f":"SUM(J1090:J1095)","v":0}]
[null,"F - MOMENTO DE TRANSPORTE",null,"Quantidade","Unidade","DMT",null,null,null,"Custo Unitário"]
[{"$nulls":5},"LN","RP","P"]
[null,"-",0,null,"tkm"]
[null,"-",0,null,"tkm"]
[null,"-",0,null,"tkm"]
[null,"-",0,null,"tkm"]
[null,"-",0,null,"tkm"]
[null,"-",0,null,"tkm"]
[null,null,null,"Custo unitário total de transporte"]
[{"$nulls":5},"Custo unitário direto total",null,null,null,{"$f":"J1088+J1096","v":0}]
[null,"Obs."]
[]
[{"$f":"A1058+1","v":56},"1ª/GRD",{"$nulls":8},{"$f":"J1157","v":0}]
[null,"OBRA:"," PAVIMENTAÇÃO ASFÁLTICA EM CBUQ - VIAS DIVERSAS - BAIRROS: N. SRA. DO ROSÁRIO, CÍCERO PASSOS E COMUNIDADE PERNAMBUCO - PIRAPORA-MG"]
[null,"Custo Unitário de Referência",null,null,"Minas Gerais"]
[{"$nulls":4}," Outubro/2024 ",null,null,"Produção da equipe ",1,{"$f":"VLOOKUP(A1109,ORÇAMENTO!$A$10:$L$42,7,1)","v":"M2"}]
[null,5213405,"PINTURA DE FAIXA DE PEDESTRE OU ZEBRADA TINTA RETRORREFLETIVA A BASE DE RESINA ACRÍLICA COM MICROESFERAS DE VIDRO, APLICAÇÃO MANUAL",{"$nulls":5},"Valores em reais (R$)"]
[null,"A - EQUIPAMENTOS",null,"Quantidade","Utilização",null,"Custo Horário",null,null,"Custo"]
[{"$nulls":4},"Operativa","Improdutiva","Produtivo","Improdutivo",null,"Horário Total"]
[null,"-",0,null,null,null,0,0,null,{"$f":"D1116*(E1116*G1116+F1116*H1116)","v":0}]
[null,"-",0,null,null,null,0,0,null,{"$f":"D1117*(E1117*G1117+F1117*H1117)","v":0}]
[{"$nulls":7},"Custo horário total de equipamentos",null,{"$f":"SUM(J1116:J1117)","v":0}]
[null,"B - MÃO DE OBRA",null,"Quantidade","Unidade",null,"Custo Horário","Custo Horário Total"]
[null,"-",0,null,0,null,0,null,null,{"$f":"D1120*G1120","v":0}]
[null,"-",0,null,0,null,0,null,null,{"$f":"D1121*G1121","v":0}]
[null,null,null,"Custo horário total de mão de obra",{"$nulls":5},{"$f":"SUM(J1120:J1121)","v":0}]
[null,null,null,"Custo horário total de execução",{"$nulls":5},{"$f":"J1118+J1122","v":0}]
[null,null,null,"Custo unitário de execução",{"$nulls":5},{"$f":"J1123/I1112","v":0}]
[{"$nulls":7},"Custo do FIC",null,0]
[{"$nulls":7},"Custo do FIT",null,0]
[null,"C - MATERIAL",null,"Quantidade","Unidade",null,"Preço Unitário","Custo Unitário"]
[null,"-",0,null,0,null,0,null,null,{"$f":"D1128*G1128","v":0}]
[null,"-",0,null,0,null,0,null,null,{"$f":"D1129*G1129","v":0}]
[null,"-",0,null,0,null,0,null,null,0]
[null,"-",0,null,0,null,0,null,null,0]
[null,"-",0,null,0,null,0,null,null,0]
[null,null,null,"Custo unitário total de material",{"$nulls":5},{"$f":"SUM(J1128:J1132)","v":0}]
[null,"D - ATIVIDADES AUXILIARES",null,"Quantidade","Unidade",null,"Custo Unitário","Custo Unitário"]
[null,"-",0,null,0,null,0,null,null,{"$f":"D1135*G1135","v":0}]
[null,"-",0,null,0,null,0,null,null,{"$f":"D1136*G1136","v":0}]
[null,"-",0,null,0,null,0,null,null,{"$f":"D1137*G1137","v":0}]
[null,null,null,"Custo total de atividades auxiliares",{"$nulls":5},{"$f":"SUM(J1135:J1137)","v":0}]
[{"$nulls":7},"Subtotal",null,{"$f":"J1124+J1133+J1138+J1125+J1126","v":0}]
[null,"E - TEMPO FIXO",null,"Código","Quantidade","Unidade",null,"Custo Unitário","Custo Unitário"]
[null,"-",0,"-",null,"t",null,0,null,{"$f":"ROUNDDOWN(E1141*H1141,4)","v":0}]
[null,"-",0,"-",null,"t",null,0,null,{"$f":"ROUNDDOWN(E1142*H1142,4)","v":0}]
[null,"-",0,"-",null,"t",null,0,null,0]
[null,"-",0,"-",null,"t",null,0,null,0]
[null,"-",0,"-",null,"t",null,0,null,0]
[null,"-",0,"-",null,"t",null,0,null,0]
[null,null,null,"Custo unitário total de tempo fixo",{"$nulls":5},{"$f":"SUM(J1141:J1146)","v":0}]
[null,"F - MOMENTO DE TRANSPORTE",null,"Quantidade","Unidade","DMT",null,null,null,"Custo Unitário"]
[{"$nulls":5},"LN","RP","P"]
[null,"-",0,null,"tkm"]
[null,"-",0,null,"tkm"]
[null,"-",0,null,"tkm"]
[null,"-",0,null,"tkm"]
[null,"-",0,null,"tkm"]
[null,"-",0,null,"tkm"]
[null,null,null,"Custo unitário total de transporte"]
[{"$nulls":5},"Custo unitário direto total",null,null,null,{"$f":"J1139+J1147","v":0}]
[null,"Obs."]
[]
[{"$f":"A1109+1","v":57},"1ª/GRD",{"$nulls":8},{"$f":"J1208","v":0}]
[null,"OBRA:"," PAVIMENTAÇÃO ASFÁLTICA EM CBUQ - VIAS DIVERSAS - BAIRROS: N. SRA. DO ROSÁRIO, CÍCERO PASSOS E COMUNIDADE PERNAMBUCO - PIRAPORA-MG"]
[null,"Custo Unitário de Referência",null,null,"Minas Gerais"]
[{"$nulls":4}," Outubro/2024 ",null,null,"Produção da equipe ",1,{"$f":"VLOOKUP(A1160,ORÇAMENTO!$A$10:$L$42,7,1)","v":"M2"}]
[null,5213405,"PINTURA DE FAIXA DE PEDESTRE OU ZEBRADA TINTA RETRORREFLETIVA A BASE DE RESINA ACRÍLICA COM MICROESFERAS DE VIDRO, APLICAÇÃO MANUAL",{"$nulls":5},"Valores em reais (R$)"]
[null,"A - EQUIPAMENTOS",null,"Quantidade","Utilização",null,"Custo Horário",null,null,"Custo"]
[{"$nulls":4},"Operativa","Improdutiva","Produtivo","Improdutivo",null,"Horário Total"]
[null,"-",0,null,null,null,0,0,null,{"$f":"D1167*(E1167*G1167+F1167*H1167)","v":0}]
[null,"-",0,null,null,null,0,0,null,{"$f":"D1168*(E1168*G1168+F1168*H1168)","v":0}]
[{"$nulls":7},"Custo horário total de equipamentos",null,{"$f":"SUM(J1167:J1168)","v":0}]
[null,"B - MÃO DE OBRA",null,"Quantidade","Unidade",null,"Custo Horário","Custo Horário Total"]
[null,"-",0,null,0,null,0,null,null,{"$f":"D1171*G1171","v":0}]
[null,"-",0,null,0,null,0,null,null,{"$f":"D1172*G1172","v":0}]
[null,null,null,"Custo horário total de mão de obra",{"$nulls":5},{"$f":"SUM(J1171:J1172)","v":0}]
[null,null,null,"Custo horário total de execução",{"$nulls":5},{"$f":"J1169+J1173","v":0}]
[null,null,null,"Custo unitário de execução",{"$nulls":5},{"$f":"J1174/I1163","v":0}]
[{"$nulls":7},"Custo do FIC",null,0]
[{"$nulls":7},"Custo do FIT",null,0]
[null,"C - MATERIAL",null,"Quantidade","Unidade",null,"Preço Unitário","Custo Unitário"]
[null,"-",0,null,0,null,0,null,null,{"$f":"D1179*G1179","v":0}]
[null,"-",0,null,0,null,0,null,null,{"$f":"D1180*G1180","v":0}]
[null,"-",0,null,0,null,0,null,null,0]
[null,"-",0,null,0,null,0,null,null,0]
[null,"-",0,null,0,null,0,null,null,0]
[null,null,null,"Custo unitário total de material",{"$nulls":5},{"$f":"SUM(J1179:J1183)","v":0}]
[null,"D - ATIVIDADES AUXILIARES",null,"Quantidade","Unidade",null,"Custo Unitário","Custo Unitário"]
[null,"-",0,null,0,null,0,null,null,{"$f":"D1186*G1186","v":0}]
[null,"-",0,null,0,null,0,null,null,{"$f":"D1187*G1187","v":0}]
[null,"-",0,null,0,null,0,null,null,{"$f":"D1188*G1188","v":0}]
[null,null,null,"Custo total de atividades auxiliares",{"$nulls":5},{"$f":"SUM(J1186:J1188)","v":0}]
[{"$nulls":7},"Subtotal",null,{"$f":"J1175+J1184+J1189+J1176+J1177","v":0}]
[null,"E - TEMPO FIXO",null,"Código","Quantidade","Unidade",null,"Custo Unitário","Custo Unitário"]
[null,"-",0,"-",null,"t",null,0,null,{"$f":"ROUNDDOWN(E1192*H1192,4)","v":0}]
[null,"-",0,"-",null,"t",null,0,null,{"$f":"ROUNDDOWN(E1193*H1193,4)","v":0}]
[null,"-",0,"-",null,"t",null,0,null,0]
[null,"-",0,"-",null,"t",null,0,null,0]
[null,"-",0,"-",null,"t",null,0,null,0]
[null,"-",0,"-",null,"t",null,0,null,0]
[null,null,null,"Custo unitário total de tempo fixo",{"$nulls":5},{"$f":"SUM(J1192:J1197)","v":0}]
[null,"F - MOMENTO DE TRANSPORTE",null,"Quantidade","Unidade","DMT",null,null,null,"Custo Unitário"]
[{"$nulls":5},"LN","RP","P"]
[null,"-",0,null,"tkm"]
[null,"-",0,null,"tkm"]
[null,"-",0,null,"tkm"]
[null,"-",0,null,"tkm"]
[null,"-",0,null,"tkm"]
[null,"-",0,null,"tkm"]
[null,null,null,"Custo unitário total de transporte"]
[{"$nulls":5},"Custo unitário direto total",null,null,null,{"$f":"J1190+J1198","v":0}]
[null,"Obs."]
[]
[{"$f":"A1160+1","v":58},"1ª/GRD",{"$nulls":8},{"$f":"J1259","v":0}]
[null,"OBRA:"," PAVIMENTAÇÃO ASFÁLTICA EM CBUQ - VIAS DIVERSAS - BAIRROS: N. SRA. DO ROSÁRIO, CÍCERO PASSOS E COMUNIDADE PERNAMBUCO - PIRAPORA-MG"]
[null,"Custo Unitário de Referência",null,null,"Minas Gerais"]
[{"$nulls":4}," Outubro/2024 ",null,null,"Produção da equipe ",1,{"$f":"VLOOKUP(A1211,ORÇAMENTO!$A$10:$L$42,7,1)","v":"M2"}]
[null,5213405,"PINTURA DE FAIXA DE PEDESTRE OU ZEBRADA TINTA RETRORREFLETIVA A BASE DE RESINA ACRÍLICA COM MICROESFERAS DE VIDRO, APLICAÇÃO MANUAL",{"$nulls":5},"Valores em reais (R$)"]
[null,"A - EQUIPAMENTOS",null,"Quantidade","Utilização",null,"Custo Horário",null,null,"Custo"]
[{"$nulls":4},"Operativa","Improdutiva","Produtivo","Improdutivo",null,"Horário Total"]
[null,"-",0,null,null,null,0,0,null,{"$f":"D1218*(E1218*G1218+F1218*H1218)","v":0}]
[null,"-",0,null,null,null,0,0,null,{"$f":"D1219*(E1219*G1219+F1219*H1219)","v":0}]
[{"$nulls":7},"Custo horário total de equipamentos",null,{"$f":"SUM(J1218:J1219)","v":0}]
[null,"B - MÃO DE OBRA",null,"Quantidade","Unidade",null,"Custo Horário","Custo Horário Total"]
[null,"-",0,null,0,null,0,null,null,{"$f":"D1222*G1222","v":0}]
[null,"-",0,null,0,null,0,null,null,{"$f":"D1223*G1223","v":0}]
[null,null,null,"Custo horário total de mão de obra",{"$nulls":5},{"$f":"SUM(J1222:J1223)","v":0}]
[null,null,null,"Custo horário total de execução",{"$nulls":5},{"$f":"J1220+J1224","v":0}]
[null,null,null,"Custo unitário de execução",{"$nulls":5},{"$f":"J1225/I1214","v":0}]
[{"$nulls":7},"Custo do FIC",null,0]
[{"$nulls":7},"Custo do FIT",null,0]
[null,"C - MATERIAL",null,"Quantidade","Unidade",null,"Preço Unitário","Custo Unitário"]
[null,"-",0,null,0,null,0,null,null,{"$f":"D1230*G1230","v":0}]
[null,"-",0,null,0,null,0,null,null,{"$f":"D1231*G1231","v":0}]
[null,"-",0,null,0,null,0,null,null,0]
[null,"-",0,null,0,null,0,null,null,0]
[null,"-",0,null,0,null,0,null,null,0]
[null,null,null,"Custo unitário total de material",{"$nulls":5},{"$f":"SUM(J1230:J1234)","v":0}]
[null,"D - ATIVIDADES AUXILIARES",null,"Quantidade","Unidade",null,"Custo Unitário","Custo Unitário"]
[null,"-",0,null,0,null,0,null,null,{"$f":"D1237*G1237","v":0}]
[null,"-",0,null,0,null,0,null,null,{"$f":"D1238*G1238","v":0}]
[null,"-",0,null,0,null,0,null,null,{"$f":"D1239*G1239","v":0}]
[null,null,null,"Custo total de atividades auxiliares",{"$nulls":5},{"$f":"SUM(J1237:J1239)","v":0}]
[{"$nulls":7},"Subtotal",null,{"$f":"J1226+J1235+J1240+J1227+J1228","v":0}]
[null,"E - TEMPO FIXO",null,"Código","Quantidade","Unidade",null,"Custo Unitário","Custo Unitário"]
[null,"-",0,"-",null,"t",null,0,null,{"$f":"ROUNDDOWN(E1243*H1243,4)","v":0}]
[null,"-",0,"-",null,"t",null,0,null,{"$f":"ROUNDDOWN(E1244*H1244,4)","v":0}]
[null,"-",0,"-",null,"t",null,0,null,0]
[null,"-",0,"-",null,"t",null,0,null,0]
[null,"-",0,"-",null,"t",null,0,null,0]
[null,"-",0,"-",null,"t",null,0,null,0]
[null,null,null,"Custo unitário total de tempo fixo",{"$nulls":5},{"$f":"SUM(J1243:J1248)","v":0}]
[null,"F - MOMENTO DE TRANSPORTE",null,"Quantidade","Unidade","DMT",null,null,null,"Custo Unitário"]
[{"$nulls":5},"LN","RP","P"]
[null,"-",0,null,"tkm"]
[null,"-",0,null,"tkm"]
[null,"-",0,null,"tkm"]
[null,"-",0,null,"tkm"]
[null,"-",0,null,"tkm"]
[null,"-",0,null,"tkm"]
[null,null,null,"Custo unitário total de transporte"]
[{"$nulls":5},"Custo unitário direto total",null,null,null,{"$f":"J1241+J1249","v":0}]
[null,"Obs."]
[]
[{"$f":"A1211+1","v":59},"1ª/GRD",{"$nulls":8},{"$f":"J1310","v":0}]
[null,"OBRA:"," PAVIMENTAÇÃO ASFÁLTICA EM CBUQ - VIAS DIVERSAS - BAIRROS: N. SRA. DO ROSÁRIO, CÍCERO PASSOS E COMUNIDADE PERNAMBUCO - PIRAPORA-MG"]
[null,"Custo Unitário de Referência",null,null,"Minas Gerais"]
[{"$nulls":4}," Outubro/2024 ",null,null,"Produção da equipe ",1,{"$f":"VLOOKUP(A1262,ORÇAMENTO!$A$10:$L$42,7,1)","v":"M2"}]
[null,5213405,"PINTURA DE FAIXA DE PEDESTRE OU ZEBRADA TINTA RETRORREFLETIVA A BASE DE RESINA ACRÍLICA COM MICROESFERAS DE VIDRO, APLICAÇÃO MANUAL",{"$nulls":5},"Valores em reais (R$)"]
[null,"A - EQUIPAMENTOS",null,"Quantidade","Utilização",null,"Custo Horário",null,null,"Custo"]
[{"$nulls":4},"Operativa","Improdutiva","Produtivo","Improdutivo",null,"Horário Total"]
[null,"-",0,null,null,null,0,0,null,{"$f":"D1269*(E1269*G1269+F1269*H1269)","v":0}]
[null,"-",0,null,null,null,0,0,null,{"$f":"D1270*(E1270*G1270+F1270*H1270)","v":0}]
[{"$nulls":7},"Custo horário total de equipamentos",null,{"$f":"SUM(J1269:J1270)","v":0}]
[null,"B - MÃO DE OBRA",null,"Quantidade","Unidade",null,"Custo Horário","Custo Horário Total"]
[null,"-",0,null,0,null,0,null,null,{"$f":"D1273*G1273","v":0}]
[null,"-",0,null,0,null,0,null,null,{"$f":"D1274*G1274","v":0}]
[null,null,null,"Custo horário total de mão de obra",{"$nulls":5},{"$f":"SUM(J1273:J1274)","v":0}]
[null,null,null,"Custo horário total de execução",{"$nulls":5},{"$f":"J1271+J1275","v":0}]
[null,null,null,"Custo unitário de execução",{"$nulls":5},{"$f":"J1276/I1265","v":0}]
[{"$nulls":7},"Custo do FIC",null,0]
[{"$nulls":7},"Custo do FIT",null,0]
[null,"C - MATERIAL",null,"Quantidade","Unidade",null,"Preço Unitário","Custo Unitário"]
[null,"-",0,null,0,null,0,null,null,{"$f":"D1281*G1281","v":0}]
[null,"-",0,null,0,null,0,null,null,{"$f":"D1282*G1282","v":0}]
[null,"-",0,null,0,null,0,null,null,0]
[null,"-",0,null,0,null,0,null,null,0]
[null,"-",0,null,0,null,0,null,null,0]
[null,null,null,"Custo unitário total de material",{"$nulls":5},{"$f":"SUM(J1281:J1285)","v":0}]
[null,"D - ATIVIDADES AUXILIARES",null,"Quantidade","Unidade",null,"Custo Unitário","Custo Unitário"]
[null,"-",0,null,0,null,0,null,null,{"$f":"D1288*G1288","v":0}]
[null,"-",0,null,0,null,0,null,null,{"$f":"D1289*G1289","v":0}]
[null,"-",0,null,0,null,0,null,null,{"$f":"D1290*G1290","v":0}]
[null,null,null,"Custo total de atividades auxiliares",{"$nulls":5},{"$f":"SUM(J1288:J1290)","v":0}]
[{"$nulls":7},"Subtotal",null,{"$f":"J1277+J1286+J1291+J1278+J1279","v":0}]
[null,"E - TEMPO FIXO",null,"Código","Quantidade","Unidade",null,"Custo Unitário","Custo Unitário"]
[null,"-",0,"-",null,"t",null,0,null,{"$f":"ROUNDDOWN(E1294*H1294,4)","v":0}]
[null,"-",0,"-",null,"t",null,0,null,{"$f":"ROUNDDOWN(E1295*H1295,4)","v":0}]
[null,"-",0,"-",null,"t",null,0,null,0]
[null,"-",0,"-",null,"t",null,0,null,0]
[null,"-",0,"-",null,"t",null,0,null,0]
[null,"-",0,"-",null,"t",null,0,null,0]
[null,null,null,"Custo unitário total de tempo fixo",{"$nulls":5},{"$f":"SUM(J1294:J1299)","v":0}]
[null,"F - MOMENTO DE TRANSPORTE",null,"Quantidade","Unidade","DMT",null,null,null,"Custo Unitário"]
[{"$nulls":5},"LN","RP","P"]
[null,"-",0,null,"tkm"]
[null,"-",0,null,"tkm"]
[null,"-",0,null,"tkm"]
[null,"-",0,null,"tkm"]
[null,"-",0,null,"tkm"]
[null,"-",0,null,"tkm"]
[null,null,null,"Custo unitário total de transporte"]
[{"$nulls":5},"Custo unitário direto total",null,null,null,{"$f":"J1292+J1300","v":0}]
[null,"Obs."]
[]
[{"$f":"A1262+1","v":60},"1ª/GRD",{"$nulls":8},{"$f":"J1361","v":0}]
[null,"OBRA:"," PAVIMENTAÇÃO ASFÁLTICA EM CBUQ - VIAS DIVERSAS - BAIRROS: N. SRA. DO ROSÁRIO, CÍCERO PASSOS E COMUNIDADE PERNAMBUCO - PIRAPORA-MG"]
[null,"Custo Unitário de Referência",null,null,"Minas Gerais"]
[{"$nulls":4}," Outubro/2024 ",null,null,"Produção da equipe ",1,{"$f":"VLOOKUP(A1313,ORÇAMENTO!$A$10:$L$42,7,1)","v":"M2"}]
[null,5213405,"PINTURA DE FAIXA DE PEDESTRE OU ZEBRADA TINTA RETRORREFLETIVA A BASE DE RESINA ACRÍLICA COM MICROESFERAS DE VIDRO, APLICAÇÃO MANUAL",{"$nulls":5},"Valores em reais (R$)"]
[null,"A - EQUIPAMENTOS",null,"Quantidade","Utilização",null,"Custo Horário",null,null,"Custo"]
[{"$nulls":4},"Operativa","Improdutiva","Produtivo","Improdutivo",null,"Horário Total"]
[null,"-",0,null,null,null,0,0,null,{"$f":"D1320*(E1320*G1320+F1320*H1320)","v":0}]
[null,"-",0,null,null,null,0,0,null,{"$f":"D1321*(E1321*G1321+F1321*H1321)","v":0}]
[{"$nulls":7},"Custo horário total de equipamentos",null,{"$f":"SUM(J1320:J1321)","v":0}]
[null,"B - MÃO DE OBRA",null,"Quantidade","Unidade",null,"Custo Horário","Custo Horário Total"]
[null,"-",0,null,0,null,0,null,null,{"$f":"D1324*G1324","v":0}]
[null,"-",0,null,0,null,0,null,null,{"$f":"D1325*G1325","v":0}]
[null,null,null,"Custo horário total de mão de obra",{"$nulls":5},{"$f":"SUM(J1324:J1325)","v":0}]
[null,null,null,"Custo horário total de execução",{"$nulls":5},{"$f":"J1322+J1326","v":0}]
[null,null,null,"Custo unitário de execução",{"$nulls":5},{"$f":"J1327/I1316","v":0}]
[{"$nulls":7},"Custo do FIC",null,0]
[{"$nulls":7},"Custo do FIT",null,0]
[null,"C - MATERIAL",null,"Quantidade","Unidade",null,"Preço Unitário","Custo Unitário"]
[null,"-",0,null,0,null,0,null,null,{"$f":"D1332*G1332","v":0}]
[null,"-",0,null,0,null,0,null,null,{"$f":"D1333*G1333","v":0}]
[null,"-",0,null,0,null,0,null,null,0]
[null,"-",0,null,0,null,0,null,null,0]
[null,"-",0,null,0,null,0,null,null,0]
[null,null,null,"Custo unitário total de material",{"$nulls":5},{"$f":"SUM(J1332:J1336)","v":0}]
[null,"D - ATIVIDADES AUXILIARES",null,"Quantidade","Unidade",null,"Custo Unitário","Custo Unitário"]
[null,"-",0,null,0,null,0,null,null,{"$f":"D1339*G1339","v":0}]
[null,"-",0,null,0,null,0,null,null,{"$f":"D1340*G1340","v":0}]
[null,"-",0,null,0,null,0,null,null,{"$f":"D1341*G1341","v":0}]
[null,null,null,"Custo total de atividades auxiliares",{"$nulls":5},{"$f":"SUM(J1339:J1341)","v":0}]
[{"$nulls":7},"Subtotal",null,{"$f":"J1328+J1337+J1342+J1329+J1330","v":0}]
[null,"E - TEMPO FIXO",null,"Código","Quantidade","Unidade",null,"Custo Unitário","Custo Unitário"]
[null,"-",0,"-",null,"t",null,0,null,{"$f":"ROUNDDOWN(E1345*H1345,4)","v":0}]
[null,"-",0,"-",null,"t",null,0,null,{"$f":"ROUNDDOWN(E1346*H1346,4)","v":0}]
[null,"-",0,"-",null,"t",null,0,null,0]
[null,"-",0,"-",null,"t",null,0,null,0]
[null,"-",0,"-",null,"t",null,0,null,0]
[null,"-",0,"-",null,"t",null,0,null,0]
[null,null,null,"Custo unitário total de tempo fixo",{"$nulls":5},{"$f":"SUM(J1345:J1350)","v":0}]
[null,"F - MOMENTO DE TRANSPORTE",null,"Quantidade","Unidade","DMT",null,null,null,"Custo Unitário"]
[{"$nulls":5},"LN","RP","P"]
[null,"-",0,null,"tkm"]
[null,"-",0,null,"tkm"]
[null,"-",0,null,"tkm"]
[null,"-",0,null,"tkm"]
[null,"-",0,null,"tkm"]
[null,"-",0,null,"tkm"]
[null,null,null,"Custo unitário total de transporte"]
[{"$nulls":5},"Custo unitário direto total",null,null,null,{"$f":"J1343+J1351","v":0}]
[null,"Obs."]
[]
[{"$f":"A1313+1","v":61},"1ª/GRD",{"$nulls":8},{"$f":"J1412","v":0}]
[null,"OBRA:"," PAVIMENTAÇÃO ASFÁLTICA EM CBUQ - VIAS DIVERSAS - BAIRROS: N. SRA. DO ROSÁRIO, CÍCERO PASSOS E COMUNIDADE PERNAMBUCO - PIRAPORA-MG"]
[null,"Custo Unitário de Referência",null,null,"Minas Gerais"]
[{"$nulls":4}," Outubro/2024 ",null,null,"Produção da equipe ",1,{"$f":"VLOOKUP(A1364,ORÇAMENTO!$A$10:$L$42,7,1)","v":"M2"}]
[null,5213405,"PINTURA DE FAIXA DE PEDESTRE OU ZEBRADA TINTA RETRORREFLETIVA A BASE DE RESINA ACRÍLICA COM MICROESFERAS DE VIDRO, APLICAÇÃO MANUAL",{"$nulls":5},"Valores em reais (R$)"]
[null,"A - EQUIPAMENTOS",null,"Quantidade","Utilização",null,"Custo Horário",null,null,"Custo"]
[{"$nulls":4},"Operativa","Improdutiva","Produtivo","Improdutivo",null,"Horário Total"]
[null,"-",0,null,null,null,0,0,null,{"$f":"D1371*(E1371*G1371+F1371*H1371)","v":0}]
[null,"-",0,null,null,null,0,0,null,{"$f":"D1372*(E1372*G1372+F1372*H1372)","v":0}]
[{"$nulls":7},"Custo horário total de equipamentos",null,{"$f":"SUM(J1371:J1372)","v":0}]
[null,"B - MÃO DE OBRA",null,"Quantidade","Unidade",null,"Custo Horário","Custo Horário Total"]
[null,"-",0,null,0,null,0,null,null,{"$f":"D1375*G1375","v":0}]
[null,"-",0,null,0,null,0,null,null,{"$f":"D1376*G1376","v":0}]
[null,null,null,"Custo horário total de mão de obra",{"$nulls":5},{"$f":"SUM(J1375:J1376)","v":0}]
[null,null,null,"Custo horário total de execução",{"$nulls":5},{"$f":"J1373+J1377","v":0}]
[null,null,null,"Custo unitário de execução",{"$nulls":5},{"$f":"J1378/I1367","v":0}]
[{"$nulls":7},"Custo do FIC",null,0]
[{"$nulls":7},"Custo do FIT",null,0]
[null,"C - MATERIAL",null,"Quantidade","Unidade",null,"Preço Unitário","Custo Unitário"]
[null,"-",0,null,0,null,0,null,null,{"$f":"D1383*G1383","v":0}]
[null,"-",0,null,0,null,0,null,null,{"$f":"D1384*G1384","v":0}]
[null,"-",0,null,0,null,0,null,null,0]
[null,"-",0,null,0,null,0,null,null,0]
[null,"-",0,null,0,null,0,null,null,0]
[null,null,null,"Custo unitário total de material",{"$nulls":5},{"$f":"SUM(J1383:J1387)","v":0}]
[null,"D - ATIVIDADES AUXILIARES",null,"Quantidade","Unidade",null,"Custo Unitário","Custo Unitário"]
[null,"-",0,null,0,null,0,null,null,{"$f":"D1390*G1390","v":0}]
[null,"-",0,null,0,null,0,null,null,{"$f":"D1391*G1391","v":0}]
[null,"-",0,null,0,null,0,null,null,{"$f":"D1392*G1392","v":0}]
[null,null,null,"Custo total de atividades auxiliares",{"$nulls":5},{"$f":"SUM(J1390:J1392)","v":0}]
[{"$nulls":7},"Subtotal",null,{"$f":"J1379+J1388+J1393+J1380+J1381","v":0}]
[null,"E - TEMPO FIXO",null,"Código","Quantidade","Unidade",null,"Custo Unitário","Custo Unitário"]
[null,"-",0,"-",null,"t",null,0,null,{"$f":"ROUNDDOWN(E1396*H1396,4)","v":0}]
[null,"-",0,"-",null,"t",null,0,null,{"$f":"ROUNDDOWN(E1397*H1397,4)","v":0}]
[null,"-",0,"-",null,"t",null,0,null,0]
[null,"-",0,"-",null,"t",null,0,null,0]
[null,"-",0,"-",null,"t",null,0,null,0]
[null,"-",0,"-",null,"t",null,0,null,0]
[null,null,null,"Custo unitário total de tempo fixo",{"$nulls":5},{"$f":"SUM(J1396:J1401)","v":0}]
[null,"F - MOMENTO DE TRANSPORTE",null,"Quantidade","Unidade","DMT",null,null,null,"Custo Unitário"]
[{"$nulls":5},"LN","RP","P"]
[null,"-",0,null,"tkm"]
[null,"-",0,null,"tkm"]
[null,"-",0,null,"tkm"]
[null,"-",0,null,"tkm"]
[null,"-",0,null,"tkm"]
[null,"-",0,null,"tkm"]
[null,null,null,"Custo unitário total de transporte"]
[{"$nulls":5},"Custo unitário direto total",null,null,null,{"$f":"J1394+J1402","v":0}]
[null,"Obs."]
[]
[{"$f":"A1364+1","v":62},"1ª/GRD",{"$nulls":8},{"$f":"J1463","v":0}]
[null,"OBRA:"," PAVIMENTAÇÃO ASFÁLTICA EM CBUQ - VIAS DIVERSAS - BAIRROS: N. SRA. DO ROSÁRIO, CÍCERO PASSOS E COMUNIDADE PERNAMBUCO - PIRAPORA-MG"]
[null,"Custo Unitário de Referência",null,null,"Minas Gerais"]
[{"$nulls":4}," Outubro/2024 ",null,null,"Produção da equipe ",1,{"$f":"VLOOKUP(A1415,ORÇAMENTO!$A$10:$L$42,7,1)","v":"M2"}]
[null,5213405,"PINTURA DE FAIXA DE PEDESTRE OU ZEBRADA TINTA RETRORREFLETIVA A BASE DE RESINA ACRÍLICA COM MICROESFERAS DE VIDRO, APLICAÇÃO MANUAL",{"$nulls":5},"Valores em reais (R$)"]
[null,"A - EQUIPAMENTOS",null,"Quantidade","Utilização",null,"Custo Horário",null,null,"Custo"]
[{"$nulls":4},"Operativa","Improdutiva","Produtivo","Improdutivo",null,"Horário Total"]
[null,"-",0,null,null,null,0,0,null,{"$f":"D1422*(E1422*G1422+F1422*H1422)","v":0}]
[null,"-",0,null,null,null,0,0,null,{"$f":"D1423*(E1423*G1423+F1423*H1423)","v":0}]
[{"$nulls":7},"Custo horário total de equipamentos",null,{"$f":"SUM(J1422:J1423)","v":0}]
[null,"B - MÃO DE OBRA",null,"Quantidade","Unidade",null,"Custo Horário","Custo Horário Total"]
[null,"-",0,null,0,null,0,null,null,{"$f":"D1426*G1426","v":0}]
[null,"-",0,null,0,null,0,null,null,{"$f":"D1427*G1427","v":0}]
[null,null,null,"Custo horário total de mão de obra",{"$nulls":5},{"$f":"SUM(J1426:J1427)","v":0}]
[null,null,null,"Custo horário total de execução",{"$nulls":5},{"$f":"J1424+J1428","v":0}]
[null,null,null,"Custo unitário de execução",{"$nulls":5},{"$f":"J1429/I1418","v":0}]
[{"$nulls":7},"Custo do FIC",null,0]
[{"$nulls":7},"Custo do FIT",null,0]
[null,"C - MATERIAL",null,"Quantidade","Unidade",null,"Preço Unitário","Custo Unitário"]
[null,"-",0,null,0,null,0,null,null,{"$f":"D1434*G1434","v":0}]
[null,"-",0,null,0,null,0,null,null,{"$f":"D1435*G1435","v":0}]
[null,"-",0,null,0,null,0,null,null,0]
[null,"-",0,null,0,null,0,null,null,0]
[null,"-",0,null,0,null,0,null,null,0]
[null,null,null,"Custo unitário total de material",{"$nulls":5},{"$f":"SUM(J1434:J1438)","v":0}]
[null,"D - ATIVIDADES AUXILIARES",null,"Quantidade","Unidade",null,"Custo Unitário","Custo Unitário"]
[null,"-",0,null,0,null,0,null,null,{"$f":"D1441*G1441","v":0}]
[null,"-",0,null,0,null,0,null,null,{"$f":"D1442*G1442","v":0}]
[null,"-",0,null,0,null,0,null,null,{"$f":"D1443*G1443","v":0}]
[null,null,null,"Custo total de atividades auxiliares",{"$nulls":5},{"$f":"SUM(J1441:J1443)","v":0}]
[{"$nulls":7},"Subtotal",null,{"$f":"J1430+J1439+J1444+J1431+J1432","v":0}]
[null,"E - TEMPO FIXO",null,"Código","Quantidade","Unidade",null,"Custo Unitário","Custo Unitário"]
[null,"-",0,"-",null,"t",null,0,null,{"$f":"ROUNDDOWN(E1447*H1447,4)","v":0}]
[null,"-",0,"-",null,"t",null,0,null,{"$f":"ROUNDDOWN(E1448*H1448,4)","v":0}]
[null,"-",0,"-",null,"t",null,0,null,0]
[null,"-",0,"-",null,"t",null,0,null,0]
[null,"-",0,"-",null,"t",null,0,null,0]
[null,"-",0,"-",null,"t",null,0,null,0]
[null,null,null,"Custo unitário total de tempo fixo",{"$nulls":5},{"$f":"SUM(J1447:J1452)","v":0}]
[null,"F - MOMENTO DE TRANSPORTE",null,"Quantidade","Unidade","DMT",null,null,null,"Custo Unitário"]
[{"$nulls":5},"LN","RP","P"]
[null,"-",0,null,"tkm"]
[null,"-",0,null,"tkm"]
[null,"-",0,null,"tkm"]
[null,"-",0,null,"tkm"]
[null,"-",0,null,"tkm"]
[null,"-",0,null,"tkm"]
[null,null,null,"Custo unitário total de transporte"]
[{"$nulls":5},"Custo unitário direto total",null,null,null,{"$f":"J1445+J1453","v":0}]
[null,"Obs."]
[]
[{"$f":"A1415+1","v":63},"1ª/GRD",{"$nulls":8},{"$f":"J1514","v":0}]
[null,"OBRA:"," PAVIMENTAÇÃO ASFÁLTICA EM CBUQ - VIAS DIVERSAS - BAIRROS: N. SRA. DO ROSÁRIO, CÍCERO PASSOS E COMUNIDADE PERNAMBUCO - PIRAPORA-MG"]
[null,"Custo Unitário de Referência",null,null,"Minas Gerais"]
[{"$nulls":4}," Outubro/2024 ",null,null,"Produção da equipe ",1,{"$f":"VLOOKUP(A1466,ORÇAMENTO!$A$10:$L$42,7,1)","v":"M2"}]
[null,5213405,"PINTURA DE FAIXA DE PEDESTRE OU ZEBRADA TINTA RETRORREFLETIVA A BASE DE RESINA ACRÍLICA COM MICROESFERAS DE VIDRO, APLICAÇÃO MANUAL",{"$nulls":5},"Valores em reais (R$)"]
[null,"A - EQUIPAMENTOS",null,"Quantidade","Utilização",null,"Custo Horário",null,null,"Custo"]
[{"$nulls":4},"Operativa","Improdutiva","Produtivo","Improdutivo",null,"Horário Total"]
[null,"-",0,null,null,null,0,0,null,{"$f":"D1473*(E1473*G1473+F1473*H1473)","v":0}]
[null,"-",0,null,null,null,0,0,null,{"$f":"D1474*(E1474*G1474+F1474*H1474)","v":0}]
[{"$nulls":7},"Custo horário total de equipamentos",null,{"$f":"SUM(J1473:J1474)","v":0}]
[null,"B - MÃO DE OBRA",null,"Quantidade","Unidade",null,"Custo Horário","Custo Horário Total"]
[null,"-",0,null,0,null,0,null,null,{"$f":"D1477*G1477","v":0}]
[null,"-",0,null,0,null,0,null,null,{"$f":"D1478*G1478","v":0}]
[null,null,null,"Custo horário total de mão de obra",{"$nulls":5},{"$f":"SUM(J1477:J1478)","v":0}]
[null,null,null,"Custo horário total de execução",{"$nulls":5},{"$f":"J1475+J1479","v":0}]
[null,null,null,"Custo unitário de execução",{"$nulls":5},{"$f":"J1480/I1469","v":0}]
[{"$nulls":7},"Custo do FIC",null,0]
[{"$nulls":7},"Custo do FIT",null,0]
[null,"C - MATERIAL",null,"Quantidade","Unidade",null,"Preço Unitário","Custo Unitário"]
[null,"-",0,null,0,null,0,null,null,{"$f":"D1485*G1485","v":0}]
[null,"-",0,null,0,null,0,null,null,{"$f":"D1486*G1486","v":0}]
[null,"-",0,null,0,null,0,null,null,0]
[null,"-",0,null,0,null,0,null,null,0]
[null,"-",0,null,0,null,0,null,null,0]
[null,null,null,"Custo unitário total de material",{"$nulls":5},{"$f":"SUM(J1485:J1489)","v":0}]
[null,"D - ATIVIDADES AUXILIARES",null,"Quantidade","Unidade",null,"Custo Unitário","Custo Unitário"]
[null,"-",0,null,0,null,0,null,null,{"$f":"D1492*G1492","v":0}]
[null,"-",0,null,0,null,0,null,null,{"$f":"D1493*G1493","v":0}]
[null,"-",0,null,0,null,0,null,null,{"$f":"D1494*G1494","v":0}]
[null,null,null,"Custo total de atividades auxiliares",{"$nulls":5},{"$f":"SUM(J1492:J1494)","v":0}]
[{"$nulls":7},"Subtotal",null,{"$f":"J1481+J1490+J1495+J1482+J1483","v":0}]
[null,"E - TEMPO FIXO",null,"Código","Quantidade","Unidade",null,"Custo Unitário","Custo Unitário"]
[null,"-",0,"-",null,"t",null,0,null,{"$f":"ROUNDDOWN(E1498*H1498,4)","v":0}]
[null,"-",0,"-",null,"t",null,0,null,{"$f":"ROUNDDOWN(E1499*H1499,4)","v":0}]
[null,"-",0,"-",null,"t",null,0,null,0]
[null,"-",0,"-",null,"t",null,0,null,0]
[null,"-",0,"-",null,"t",null,0,null,0]
[null,"-",0,"-",null,"t",null,0,null,0]
[null,null,null,"Custo unitário total de tempo fixo",{"$nulls":5},{"$f":"SUM(J1498:J1503)","v":0}]
[null,"F - MOMENTO DE TRANSPORTE",null,"Quantidade","Unidade","DMT",null,null,null,"Custo Unitário"]
[{"$nulls":5},"LN","RP","P"]
[null,"-",0,null,"tkm"]
[null,"-",0,null,"tkm"]
[null,"-",0,null,"tkm"]
[null,"-",0,null,"tkm"]
[null,"-",0,null,"tkm"]
[null,"-",0,null,"tkm"]
[null,null,null,"Custo unitário total de transporte"]
[{"$nulls":5},"Custo unitário direto total",null,null,null,{"$f":"J1496+J1504","v":0}]
[null,"Obs."]
[]
[{"$f":"A1466+1","v":64},"1ª/GRD",{"$nulls":8},{"$f":"J1565","v":0}]
[null,"OBRA:"," PAVIMENTAÇÃO ASFÁLTICA EM CBUQ - VIAS DIVERSAS - BAIRROS: N. SRA. DO ROSÁRIO, CÍCERO PASSOS E COMUNIDADE PERNAMBUCO - PIRAPORA-MG"]
[null,"Custo Unitário de Referência",null,null,"Minas Gerais"]
[{"$nulls":4}," Outubro/2024 ",null,null,"Produção da equipe ",1,{"$f":"VLOOKUP(A1517,ORÇAMENTO!$A$10:$L$42,7,1)","v":"M2"}]
[null,5213405,"PINTURA DE FAIXA DE PEDESTRE OU ZEBRADA TINTA RETRORREFLETIVA A BASE DE RESINA ACRÍLICA COM MICROESFERAS DE VIDRO, APLICAÇÃO MANUAL",{"$nulls":5},"Valores em reais (R$)"]
[null,"A - EQUIPAMENTOS",null,"Quantidade","Utilização",null,"Custo Horário",null,null,"Custo"]
[{"$nulls":4},"Operativa","Improdutiva","Produtivo","Improdutivo",null,"Horário Total"]
[null,"-",0,null,null,null,0,0,null,{"$f":"D1524*(E1524*G1524+F1524*H1524)","v":0}]
[null,"-",0,null,null,null,0,0,null,{"$f":"D1525*(E1525*G1525+F1525*H1525)","v":0}]
[{"$nulls":7},"Custo horário total de equipamentos",null,{"$f":"SUM(J1524:J1525)","v":0}]
[null,"B - MÃO DE OBRA",null,"Quantidade","Unidade",null,"Custo Horário","Custo Horário Total"]
[null,"-",0,null,0,null,0,null,null,{"$f":"D1528*G1528","v":0}]
[null,"-",0,null,0,null,0,null,null,{"$f":"D1529*G1529","v":0}]
[null,null,null,"Custo horário total de mão de obra",{"$nulls":5},{"$f":"SUM(J1528:J1529)","v":0}]
[null,null,null,"Custo horário total de execução",{"$nulls":5},{"$f":"J1526+J1530","v":0}]
[null,null,null,"Custo unitário de execução",{"$nulls":5},{"$f":"J1531/I1520","v":0}]
[{"$nulls":7},"Custo do FIC",null,0]
[{"$nulls":7},"Custo do FIT",null,0]
[null,"C - MATERIAL",null,"Quantidade","Unidade",null,"Preço Unitário","Custo Unitário"]
[null,"-",0,null,0,null,0,null,null,{"$f":"D1536*G1536","v":0}]
[null,"-",0,null,0,null,0,null,null,{"$f":"D1537*G1537","v":0}]
[null,"-",0,null,0,null,0,null,null,0]
[null,"-",0,null,0,null,0,null,null,0]
[null,"-",0,null,0,null,0,null,null,0]
[null,null,null,"Custo unitário total de material",{"$nulls":5},{"$f":"SUM(J1536:J1540)","v":0}]
[null,"D - ATIVIDADES AUXILIARES",null,"Quantidade","Unidade",null,"Custo Unitário","Custo Unitário"]
[null,"-",0,null,0,null,0,null,null,{"$f":"D1543*G1543","v":0}]
[null,"-",0,null,0,null,0,null,null,{"$f":"D1544*G1544","v":0}]
[null,"-",0,null,0,null,0,null,null,{"$f":"D1545*G1545","v":0}]
[null,null,null,"Custo total de atividades auxiliares",{"$nulls":5},{"$f":"SUM(J1543:J1545)","v":0}]
[{"$nulls":7},"Subtotal",null,{"$f":"J1532+J1541+J1546+J1533+J1534","v":0}]
[null,"E - TEMPO FIXO",null,"Código","Quantidade","Unidade",null,"Custo Unitário","Custo Unitário"]
[null,"-",0,"-",null,"t",null,0,null,{"$f":"ROUNDDOWN(E1549*H1549,4)","v":0}]
[null,"-",0,"-",null,"t",null,0,null,{"$f":"ROUNDDOWN(E1550*H1550,4)","v":0}]
[null,"-",0,"-",null,"t",null,0,null,0]
[null,"-",0,"-",null,"t",null,0,null,0]
[null,"-",0,"-",null,"t",null,0,null,0]
[null,"-",0,"-",null,"t",null,0,null,0]
[null,null,null,"Custo unitário total de tempo fixo",{"$nulls":5},{"$f":"SUM(J1549:J1554)","v":0}]
[null,"F - MOMENTO DE TRANSPORTE",null,"Quantidade","Unidade","DMT",null,null,null,"Custo Unitário"]
[{"$nulls":5},"LN","RP","P"]
[null,"-",0,null,"tkm"]
[null,"-",0,null,"tkm"]
[null,"-",0,null,"tkm"]
[null,"-",0,null,"tkm"]
[null,"-",0,null,"tkm"]
[null,"-",0,null,"tkm"]
[null,null,null,"Custo unitário total de transporte"]
[{"$nulls":5},"Custo unitário direto total",null,null,null,{"$f":"J1547+J1555","v":0}]
[null,"Obs."]
[]
[{"$f":"A1517+1","v":65},"1ª/GRD",{"$nulls":8},{"$f":"J1616","v":0}]
[null,"OBRA:"," PAVIMENTAÇÃO ASFÁLTICA EM CBUQ - VIAS DIVERSAS - BAIRROS: N. SRA. DO ROSÁRIO, CÍCERO PASSOS E COMUNIDADE PERNAMBUCO - PIRAPORA-MG"]
[null,"Custo Unitário de Referência",null,null,"Minas Gerais"]
[{"$nulls":4}," Outubro/2024 ",null,null,"Produção da equipe ",1,{"$f":"VLOOKUP(A1568,ORÇAMENTO!$A$10:$L$42,7,1)","v":"M2"}]
[null,5213405,"PINTURA DE FAIXA DE PEDESTRE OU ZEBRADA TINTA RETRORREFLETIVA A BASE DE RESINA ACRÍLICA COM MICROESFERAS DE VIDRO, APLICAÇÃO MANUAL",{"$nulls":5},"Valores em reais (R$)"]
[null,"A - EQUIPAMENTOS",null,"Quantidade","Utilização",null,"Custo Horário",null,null,"Custo"]
[{"$nulls":4},"Operativa","Improdutiva","Produtivo","Improdutivo",null,"Horário Total"]
[null,"-",0,null,null,null,0,0,null,{"$f":"D1575*(E1575*G1575+F1575*H1575)","v":0}]
[null,"-",0,null,null,null,0,0,null,{"$f":"D1576*(E1576*G1576+F1576*H1576)","v":0}]
[{"$nulls":7},"Custo horário total de equipamentos",null,{"$f":"SUM(J1575:J1576)","v":0}]
[null,"B - MÃO DE OBRA",null,"Quantidade","Unidade",null,"Custo Horário","Custo Horário Total"]
[null,"-",0,null,0,null,0,null,null,{"$f":"D1579*G1579","v":0}]
[null,"-",0,null,0,null,0,null,null,{"$f":"D1580*G1580","v":0}]
[null,null,null,"Custo horário total de mão de obra",{"$nulls":5},{"$f":"SUM(J1579:J1580)","v":0}]
[null,null,null,"Custo horário total de execução",{"$nulls":5},{"$f":"J1577+J1581","v":0}]
[null,null,null,"Custo unitário de execução",{"$nulls":5},{"$f":"J1582/I1571","v":0}]
[{"$nulls":7},"Custo do FIC",null,0]
[{"$nulls":7},"Custo do FIT",null,0]
[null,"C - MATERIAL",null,"Quantidade","Unidade",null,"Preço Unitário","Custo Unitário"]
[null,"-",0,null,0,null,0,null,null,{"$f":"D1587*G1587","v":0}]
[null,"-",0,null,0,null,0,null,null,{"$f":"D1588*G1588","v":0}]
[null,"-",0,null,0,null,0,null,null,0]
[null,"-",0,null,0,null,0,null,null,0]
[null,"-",0,null,0,null,0,null,null,0]
[null,null,null,"Custo unitário total de material",{"$nulls":5},{"$f":"SUM(J1587:J1591)","v":0}]
[null,"D - ATIVIDADES AUXILIARES",null,"Quantidade","Unidade",null,"Custo Unitário","Custo Unitário"]
[null,"-",0,null,0,null,0,null,null,{"$f":"D1594*G1594","v":0}]
[null,"-",0,null,0,null,0,null,null,{"$f":"D1595*G1595","v":0}]
[null,"-",0,null,0,null,0,null,null,{"$f":"D1596*G1596","v":0}]
[null,null,null,"Custo total de atividades auxiliares",{"$nulls":5},{"$f":"SUM(J1594:J1596)","v":0}]
[{"$nulls":7},"Subtotal",null,{"$f":"J1583+J1592+J1597+J1584+J1585","v":0}]
[null,"E - TEMPO FIXO",null,"Código","Quantidade","Unidade",null,"Custo Unitário","Custo Unitário"]
[null,"-",0,"-",null,"t",null,0,null,{"$f":"ROUNDDOWN(E1600*H1600,4)","v":0}]
[null,"-",0,"-",null,"t",null,0,null,{"$f":"ROUNDDOWN(E1601*H1601,4)","v":0}]
[null,"-",0,"-",null,"t",null,0,null,0]
[null,"-",0,"-",null,"t",null,0,null,0]
[null,"-",0,"-",null,"t",null,0,null,0]
[null,"-",0,"-",null,"t",null,0,null,0]
[null,null,null,"Custo unitário total de tempo fixo",{"$nulls":5},{"$f":"SUM(J1600:J1605)","v":0}]
[null,"F - MOMENTO DE TRANSPORTE",null,"Quantidade","Unidade","DMT",null,null,null,"Custo Unitário"]
[{"$nulls":5},"LN","RP","P"]
[null,"-",0,null,"tkm"]
[null,"-",0,null,"tkm"]
[null,"-",0,null,"tkm"]
[null,"-",0,null,"tkm"]
[null,"-",0,null,"tkm"]
[null,"-",0,null,"tkm"]
[null,null,null,"Custo unitário total de transporte"]
[{"$nulls":5},"Custo unitário direto total",null,null,null,{"$f":"J1598+J1606","v":0}]
[null,"Obs."]
[]
[{"$f":"A1568+1","v":66},"1ª/GRD",{"$nulls":8},{"$f":"J1667","v":0}]
[null,"OBRA:"," PAVIMENTAÇÃO ASFÁLTICA EM CBUQ - VIAS DIVERSAS - BAIRROS: N. SRA. DO ROSÁRIO, CÍCERO PASSOS E COMUNIDADE PERNAMBUCO - PIRAPORA-MG"]
[null,"Custo Unitário de Referência",null,null,"Minas Gerais"]
[{"$nulls":4}," Outubro/2024 ",null,null,"Produção da equipe ",1,{"$f":"VLOOKUP(A1619,ORÇAMENTO!$A$10:$L$42,7,1)","v":"M2"}]
[null,5213405,"PINTURA DE FAIXA DE PEDESTRE OU ZEBRADA TINTA RETRORREFLETIVA A BASE DE RESINA ACRÍLICA COM MICROESFERAS DE VIDRO, APLICAÇÃO MANUAL",{"$nulls":5},"Valores em reais (R$)"]
[null,"A - EQUIPAMENTOS",null,"Quantidade","Utilização",null,"Custo Horário",null,null,"Custo"]
[{"$nulls":4},"Operativa","Improdutiva","Produtivo","Improdutivo",null,"Horário Total"]
[null,"-",0,null,null,null,0,0,null,{"$f":"D1626*(E1626*G1626+F1626*H1626)","v":0}]
[null,"-",0,null,null,null,0,0,null,{"$f":"D1627*(E1627*G1627+F1627*H1627)","v":0}]
[{"$nulls":7},"Custo horário total de equipamentos",null,{"$f":"SUM(J1626:J1627)","v":0}]
[null,"B - MÃO DE OBRA",null,"Quantidade","Unidade",null,"Custo Horário","Custo Horário Total"]
[null,"-",0,null,0,null,0,null,null,{"$f":"D1630*G1630","v":0}]
[null,"-",0,null,0,null,0,null,null,{"$f":"D1631*G1631","v":0}]
[null,null,null,"Custo horário total de mão de obra",{"$nulls":5},{"$f":"SUM(J1630:J1631)","v":0}]
[null,null,null,"Custo horário total de execução",{"$nulls":5},{"$f":"J1628+J1632","v":0}]
[null,null,null,"Custo unitário de execução",{"$nulls":5},{"$f":"J1633/I1622","v":0}]
[{"$nulls":7},"Custo do FIC",null,0]
[{"$nulls":7},"Custo do FIT",null,0]
[null,"C - MATERIAL",null,"Quantidade","Unidade",null,"Preço Unitário","Custo Unitário"]
[null,"-",0,null,0,null,0,null,null,{"$f":"D1638*G1638","v":0}]
[null,"-",0,null,0,null,0,null,null,{"$f":"D1639*G1639","v":0}]
[null,"-",0,null,0,null,0,null,null,0]
[null,"-",0,null,0,null,0,null,null,0]
[null,"-",0,null,0,null,0,null,null,0]
[null,null,null,"Custo unitário total de material",{"$nulls":5},{"$f":"SUM(J1638:J1642)","v":0}]
[null,"D - ATIVIDADES AUXILIARES",null,"Quantidade","Unidade",null,"Custo Unitário","Custo Unitário"]
[null,"-",0,null,0,null,0,null,null,{"$f":"D1645*G1645","v":0}]
[null,"-",0,null,0,null,0,null,null,{"$f":"D1646*G1646","v":0}]
[null,"-",0,null,0,null,0,null,null,{"$f":"D1647*G1647","v":0}]
[null,null,null,"Custo total de atividades auxiliares",{"$nulls":5},{"$f":"SUM(J1645:J1647)","v":0}]
[{"$nulls":7},"Subtotal",null,{"$f":"J1634+J1643+J1648+J1635+J1636","v":0}]
[null,"E - TEMPO FIXO",null,"Código","Quantidade","Unidade",null,"Custo Unitário","Custo Unitário"]
[null,"-",0,"-",null,"t",null,0,null,{"$f":"ROUNDDOWN(E1651*H1651,4)","v":0}]
[null,"-",0,"-",null,"t",null,0,null,{"$f":"ROUNDDOWN(E1652*H1652,4)","v":0}]
[null,"-",0,"-",null,"t",null,0,null,0]
[null,"-",0,"-",null,"t",null,0,null,0]
[null,"-",0,"-",null,"t",null,0,null,0]
[null,"-",0,"-",null,"t",null,0,null,0]
[null,null,null,"Custo unitário total de tempo fixo",{"$nulls":5},{"$f":"SUM(J1651:J1656)","v":0}]
[null,"F - MOMENTO DE TRANSPORTE",null,"Quantidade","Unidade","DMT",null,null,null,"Custo Unitário"]
[{"$nulls":5},"LN","RP","P"]
[null,"-",0,null,"tkm"]
[null,"-",0,null,"tkm"]
[null,"-",0,null,"tkm"]
[null,"-",0,null,"tkm"]
[null,"-",0,null,"tkm"]
[null,"-",0,null,"tkm"]
[null,null,null,"Custo unitário total de transporte"]
[{"$nulls":5},"Custo unitário direto total",null,null,null,{"$f":"J1649+J1657","v":0}]
[null,"Obs."]
[]
[{"$f":"A1619+1","v":67},"1ª/GRD",{"$nulls":8},{"$f":"J1718","v":0}]
[null,"OBRA:"," PAVIMENTAÇÃO ASFÁLTICA EM CBUQ - VIAS DIVERSAS - BAIRROS: N. SRA. DO ROSÁRIO, CÍCERO PASSOS E COMUNIDADE PERNAMBUCO - PIRAPORA-MG"]
[null,"Custo Unitário de Referência",null,null,"Minas Gerais"]
[{"$nulls":4}," Outubro/2024 ",null,null,"Produção da equipe ",1,{"$f":"VLOOKUP(A1670,ORÇAMENTO!$A$10:$L$42,7,1)","v":"M2"}]
[null,5213405,"PINTURA DE FAIXA DE PEDESTRE OU ZEBRADA TINTA RETRORREFLETIVA A BASE DE RESINA ACRÍLICA COM MICROESFERAS DE VIDRO, APLICAÇÃO MANUAL",{"$nulls":5},"Valores em reais (R$)"]
[null,"A - EQUIPAMENTOS",null,"Quantidade","Utilização",null,"Custo Horário",null,null,"Custo"]
[{"$nulls":4},"Operativa","Improdutiva","Produtivo","Improdutivo",null,"Horário Total"]
[null,"-",0,null,null,null,0,0,null,{"$f":"D1677*(E1677*G1677+F1677*H1677)","v":0}]
[null,"-",0,null,null,null,0,0,null,{"$f":"D1678*(E1678*G1678+F1678*H1678)","v":0}]
[{"$nulls":7},"Custo horário total de equipamentos",null,{"$f":"SUM(J1677:J1678)","v":0}]
[null,"B - MÃO DE OBRA",null,"Quantidade","Unidade",null,"Custo Horário","Custo Horário Total"]
[null,"-",0,null,0,null,0,null,null,{"$f":"D1681*G1681","v":0}]
[null,"-",0,null,0,null,0,null,null,{"$f":"D1682*G1682","v":0}]
[null,null,null,"Custo horário total de mão de obra",{"$nulls":5},{"$f":"SUM(J1681:J1682)","v":0}]
[null,null,null,"Custo horário total de execução",{"$nulls":5},{"$f":"J1679+J1683","v":0}]
[null,null,null,"Custo unitário de execução",{"$nulls":5},{"$f":"J1684/I1673","v":0}]
[{"$nulls":7},"Custo do FIC",null,0]
[{"$nulls":7},"Custo do FIT",null,0]
[null,"C - MATERIAL",null,"Quantidade","Unidade",null,"Preço Unitário","Custo Unitário"]
[null,"-",0,null,0,null,0,null,null,{"$f":"D1689*G1689","v":0}]
[null,"-",0,null,0,null,0,null,null,{"$f":"D1690*G1690","v":0}]
[null,"-",0,null,0,null,0,null,null,0]
[null,"-",0,null,0,null,0,null,null,0]
[null,"-",0,null,0,null,0,null,null,0]
[null,null,null,"Custo unitário total de material",{"$nulls":5},{"$f":"SUM(J1689:J1693)","v":0}]
[null,"D - ATIVIDADES AUXILIARES",null,"Quantidade","Unidade",null,"Custo Unitário","Custo Unitário"]
[null,"-",0,null,0,null,0,null,null,{"$f":"D1696*G1696","v":0}]
[null,"-",0,null,0,null,0,null,null,{"$f":"D1697*G1697","v":0}]
[null,"-",0,null,0,null,0,null,null,{"$f":"D1698*G1698","v":0}]
[null,null,null,"Custo total de atividades auxiliares",{"$nulls":5},{"$f":"SUM(J1696:J1698)","v":0}]
[{"$nulls":7},"Subtotal",null,{"$f":"J1685+J1694+J1699+J1686+J1687","v":0}]
[null,"E - TEMPO FIXO",null,"Código","Quantidade","Unidade",null,"Custo Unitário","Custo Unitário"]
[null,"-",0,"-",null,"t",null,0,null,{"$f":"ROUNDDOWN(E1702*H1702,4)","v":0}]
[null,"-",0,"-",null,"t",null,0,null,{"$f":"ROUNDDOWN(E1703*H1703,4)","v":0}]
[null,"-",0,"-",null,"t",null,0,null,0]
[null,"-",0,"-",null,"t",null,0,null,0]
[null,"-",0,"-",null,"t",null,0,null,0]
[null,"-",0,"-",null,"t",null,0,null,0]
[null,null,null,"Custo unitário total de tempo fixo",{"$nulls":5},{"$f":"SUM(J1702:J1707)","v":0}]
[null,"F - MOMENTO DE TRANSPORTE",null,"Quantidade","Unidade","DMT",null,null,null,"Custo Unitário"]
[{"$nulls":5},"LN","RP","P"]
[null,"-",0,null,"tkm"]
[null,"-",0,null,"tkm"]
[null,"-",0,null,"tkm"]
[null,"-",0,null,"tkm"]
[null,"-",0,null,"tkm"]
[null,"-",0,null,"tkm"]
[null,null,null,"Custo unitário total de transporte"]
[{"$nulls":5},"Custo unitário direto total",null,null,null,{"$f":"J1700+J1708","v":0}]
[null,"Obs."]

{"sheet":"CPU-FORNEC","index":2,"n_rows":92,"n_cols":14,"rows_kept":92,"cut":false,"hidden":false,"merged":[[81,1,81,7],[82,0,91,0],[82,1,82,3],[82,4,82,7],[83,2,83,5],[84,2,84,3],[85,1,85,7],[88,1,88,3],[88,5,88,6],[89,1,89,6],[90,1,90,6],[91,1,91,6],[60,0,69,0],[60,1,60,3],[60,4,60,7],[61,2,61,5],[62,2,62,3],[63,1,63,7],[66,1,66,3],[66,5,66,6],[67,1,67,6],[68,1,68,6],[69,1,69,6],[38,0,47,0],[38,1,38,3],[38,4,38,7],[39,2,39,5],[40,2,40,3],[41,1,41,7],[44,1,44,3],[44,5,44,6],[45,1,45,6],[46,1,46,6],[47,1,47,6],[22,5,22,6],[23,1,23,6],[24,1,24,6],[25,1,25,6],[5,1,5,7],[9,1,9,7],[13,1,13,7],[17,1,17,7],[0,10,0,11],[1,2,1,5],[1,10,1,11],[2,2,2,3],[3,1,3,7],[27,4,27,7],[28,2,28,5],[27,0,36,0],[29,2,29,3],[30,1,30,7],[33,1,33,3],[33,5,33,6],[34,1,34,6],[35,1,35,6],[36,1,36,6],[0,0,26,0],[0,1,0,3],[0,4,0,7],[22,1,22,3],[49,0,58,0],[49,1,49,3],[49,4,49,7],[50,2,50,5],[51,2,51,3],[52,1,52,7],[55,1,55,3],[55,5,55,6],[56,1,56,6],[57,1,57,6],[58,1,58,6],[27,1,27,3],[71,0,80,0],[71,1,71,3],[71,4,71,7],[72,2,72,5],[73,2,73,3],[74,1,74,7],[77,1,77,3],[77,5,77,6],[78,1,78,6],[79,1,79,6],[80,1,80,6]]}
[1,"CODEVASF",null,null," COMPOSIÇÃO DE PREÇO UNITÁRIO",null,null,null,{"$f":"H24","v":0},{"$f":"H26","v":0},"BDI CALCULADO:",null,{"$f":"ORÇAMENTO!L6","v":15}]
[null,"OBRA:  ",{"$f":"ORÇAMENTO!C5","v":" PAVIMENTAÇÃO ASFÁLTICA EM CBUQ - VIAS DIVERSAS - BAIRROS: N. SRA. DO ROSÁRIO, CÍCERO PASSOS E COMUNIDADE PERNAMBUCO - PIRAPORA-MG"},null,null,null,"DATA: ",{"$f":"ORÇAMENTO!C6","v":" JANEIRO / 2025"},null,null,"BDI DIFERENCIADO:",null,{"$f":"'BDI FORN'!D31/100","v":0.15}]
[null,"SERVIÇO:  ",{"$f":"VLOOKUP(A1,ORÇAMENTO!A11:L30,3)","v":"CPU.1"},null,"Referência:",{"$f":"VLOOKUP(A1,ORÇAMENTO!$A$11:$L$30,4)","v":"CODEVASF"},"UNIDADE: ",{"$f":"VLOOKUP(A1,ORÇAMENTO!A11:L30,5)","v":"MOBILIZAÇÃO E DESMOBILIZAÇÃO"}]
[]
[null,"TIPO ITEM","CODIGO ITEM","DESCRIÇÃO ITEM","UNIDADE ITEM","COEFICIENTE","PRECO UNITARIO","CUSTO TOTAL",null,"distancia =",90,"B.DESPACHO"]
[null,"EQUIPAMENTOS",{"$nulls":7},"Pá carregadeira ",null,null,10.1," ton"]
[null,null,"E9001",{"$f":"VLOOKUP(C7,#REF!,1,2)","v":{"$error":"#REF!"}},{"$f":"VLOOKUP(C7,#REF!,1,3)","v":{"$error":"#REF!"}},null,{"$f":"VLOOKUP(C7,#REF!,1,3)","v":{"$error":"#REF!"}}]
[]
[]
[null,"MÃO DE OBRA"]
[]
[]
[]
[null,"MATERIAIS"]
[]
[]
[{"$nulls":7},{"$f":"ROUNDDOWN(F17*G17,2)","v":0},null,"Motoniveladora ",null,null,12.47," ton"]
[null,"ATIVIDADES AUXILIARES",{"$nulls":7},"Trator de pneus",null,null,2.8," ton"]
[{"$nulls":7},{"$f":"ROUNDDOWN(F19*G19,2)","v":0}]
[{"$nulls":7},0]
[{"$nulls":7},0]
[{"$nulls":7},{"$f":"ROUNDDOWN(F22*G22,2)","v":0},null,"Rolo Compactador ",null,null,15.33," ton"]
[null,"PRODUÇÃO DA EQUIPE",null,null,1,"CUSTO ",null,{"$f":"SUM(H6:H22)","v":0},null,"Grade de disco",null,null,1," ton"]
[null,"TOTAL",{"$nulls":5},{"$f":"H23/E23","v":0},"OK","RETROESCAVADEIRA",null,null,6.67," ton"]
[null,"BDI                %",{"$nulls":5},{"$f":"1+$M$1","v":16}]
[null,"TOTAL DO SERVIÇO - R$",{"$nulls":5},{"$f":"ROUND(H24*H25,2)","v":0}]
[]
["F1","CODEVASF",null,null," COMPOSIÇÃO DE PREÇO UNITÁRIO",null,null,null,{"$f":"H35","v":3275.67},{"$f":"H37","v":3767.02}]
[null,"OBRA:  ",{"$f":"$C$2","v":" PAVIMENTAÇÃO ASFÁLTICA EM CBUQ - VIAS DIVERSAS - BAIRROS: N. SRA. DO ROSÁRIO, CÍCERO PASSOS E COMUNIDADE PERNAMBUCO - PIRAPORA-MG"},null,null,null,"DATA: ",{"$f":"$H$2","v":" JANEIRO / 2025"}]
[null,"SERVIÇO:  ",{"$f":"VLOOKUP(A28,ORÇAMENTO!$A$11:$L$49,5)","v":"AQUISIÇÃO DE EMULSÃO ASFÁLTICA PARA IMPRIMAÇÃO (EAI) - EXCLUSIVE TRANSPORTE"},null,"Referência:",{"$f":"VLOOKUP(A28,ORÇAMENTO!$A$11:$L$49,4)","v":"ANP"},"UNIDADE: ",{"$f":"VLOOKUP(A28,ORÇAMENTO!$A$11:$L$49,7)","v":"T"}]
[]
[null,"TIPO ITEM","CODIGO ITEM","DESCRIÇÃO ITEM","UNIDADE ITEM","COEFICIENTE","PRECO UNITARIO","CUSTO TOTAL"]
[null,"INSUMO","ANP","EMULSÃO ASFÁLTICA PARA SERVIÇO DE IMPRIMAÇÃO (MEMÓRIA EM ANEXO)","T",1,{"$f":"MAT.ASF!V21","v":3275.6718076204952},{"$f":"ROUNDDOWN(F33*G33,2)","v":3275.67}]
[null,"PRODUÇÃO DA EQUIPE",null,null,1,"CUSTO ",null,{"$f":"SUM(H33:H33)","v":3275.67}]
[null,"TOTAL",{"$nulls":5},{"$f":"H34/E34","v":3275.67}]
[null,"BDI                %",{"$nulls":5},{"$f":"1+$M$2","v":1.1499999999999999}]
[null,"TOTAL DO SERVIÇO - R$",{"$nulls":5},{"$f":"ROUND(H35*H36,2)","v":3767.02},"OK"]
[]
["F2","CODEVASF",null,null," COMPOSIÇÃO DE PREÇO UNITÁRIO",null,null,null,{"$f":"H46","v":323.18},{"$f":"H48","v":371.66}]
[null,"OBRA:  ",{"$f":"$C$2","v":" PAVIMENTAÇÃO ASFÁLTICA EM CBUQ - VIAS DIVERSAS - BAIRROS: N. SRA. DO ROSÁRIO, CÍCERO PASSOS E COMUNIDADE PERNAMBUCO - PIRAPORA-MG"},null,null,null,"DATA: ",{"$f":"$H$2","v":" JANEIRO / 2025"}]
[null,"SERVIÇO:  ",{"$f":"VLOOKUP(A39,ORÇAMENTO!$A$11:$L$49,5)","v":"TRANSPORTE DE EMULSÃO ASFÁLTICA PARA IMPRIMAÇÃO (EAI)"},null,"Referência:",{"$f":"VLOOKUP(A39,ORÇAMENTO!$A$11:$L$49,4)","v":"CODEVASF"},"UNIDADE: ",{"$f":"VLOOKUP(A39,ORÇAMENTO!$A$11:$L$49,7)","v":"T"}]
[]
[null,"TIPO ITEM","CODIGO ITEM","DESCRIÇÃO ITEM","UNIDADE ITEM","COEFICIENTE","PRECO UNITARIO","CUSTO TOTAL"]
[null,"INSUMO"," - ","TRANSPORTE DE EMULSÃO ASFÁLTICA PARA IMPRIMAÇÃO (EAI), INCLUINDO CUSTO TOTAL DO TRANSPORTE (COMBUSTÍVEL, PEDÁGIOS, ETC.) E ICMS - MEMÓRIA ANEXA","T",1,{"$f":"MAT.ASF!U21","v":323.18499999999995},{"$f":"ROUNDDOWN(F44*G44,2)","v":323.18}]
[null,"PRODUÇÃO DA EQUIPE",null,null,1,"CUSTO ",null,{"$f":"SUM(H44:H44)","v":323.18}]
[null,"TOTAL",{"$nulls":5},{"$f":"H45/E45","v":323.18}]
[null,"BDI                %",{"$nulls":5},{"$f":"1+$M$2","v":1.1499999999999999}]
[null,"TOTAL DO SERVIÇO - R$",{"$nulls":5},{"$f":"ROUND(H46*H47,2)","v":371.66},"OK"]
[]
["F3","CODEVASF",null,null," COMPOSIÇÃO DE PREÇO UNITÁRIO",null,null,null,{"$f":"H57","v":3478},{"$f":"H59","v":3999.7}]
[null,"OBRA:  ",{"$f":"$C$2","v":" PAVIMENTAÇÃO ASFÁLTICA EM CBUQ - VIAS DIVERSAS - BAIRROS: N. SRA. DO ROSÁRIO, CÍCERO PASSOS E COMUNIDADE PERNAMBUCO - PIRAPORA-MG"},null,null,null,"DATA: ",{"$f":"$H$2","v":" JANEIRO / 2025"}]
[null,"SERVIÇO:  ",{"$f":"VLOOKUP(A50,ORÇAMENTO!$A$11:$L$49,5)","v":"AQUISIÇÃO DE EMULSAO ASFALTICA CATIONICA RR-1C - EXCLUSIVE TRANSPORTE"},null,"Referência:",{"$f":"VLOOKUP(A50,ORÇAMENTO!$A$11:$L$49,4)","v":"ANP"},"UNIDADE: ",{"$f":"VLOOKUP(A50,ORÇAMENTO!$A$11:$L$49,7)","v":"T"}]
[]
[null,"TIPO ITEM","CODIGO ITEM","DESCRIÇÃO ITEM","UNIDADE ITEM","COEFICIENTE","PRECO UNITARIO","CUSTO TOTAL"]
[null,"INSUMO","ANP","EMULSÃO ASFÁLTICA CATIÔNICA RR-1C(MEMÓRIA EM ANEXO)","T",1,{"$f":"MAT.ASF!V28","v":3478.0063919228432},{"$f":"ROUNDDOWN(F55*G55,2)","v":3478}]
[null,"PRODUÇÃO DA EQUIPE",null,null,1,"CUSTO ",null,{"$f":"SUM(H55:H55)","v":3478}]
[null,"TOTAL",{"$nulls":5},{"$f":"H56/E56","v":3478},"OK"]
[null,"BDI                %",{"$nulls":5},{"$f":"1+$M$2","v":1.1499999999999999}]
[null,"TOTAL DO SERVIÇO - R$",{"$nulls":5},{"$f":"ROUND(H57*H58,2)","v":3999.7}]
[]
["F4","CODEVASF",null,null," COMPOSIÇÃO DE PREÇO UNITÁRIO",null,null,null,{"$f":"H68","v":338.96},{"$f":"H70","v":389.8}]
[null,"OBRA:  ",{"$f":"$C$2","v":" PAVIMENTAÇÃO ASFÁLTICA EM CBUQ - VIAS DIVERSAS - BAIRROS: N. SRA. DO ROSÁRIO, CÍCERO PASSOS E COMUNIDADE PERNAMBUCO - PIRAPORA-MG"},null,null,null,"DATA: ",{"$f":"$H$2","v":" JANEIRO / 2025"}]
[null,"SERVIÇO:  ",{"$f":"VLOOKUP(A61,ORÇAMENTO!$A$11:$L$49,5)","v":"TRANSPORTE DE EMULSÃO ASFÁLTICA CATIONICA RR-1C"},null,"Referência:",{"$f":"VLOOKUP(A61,ORÇAMENTO!$A$11:$L$49,4)","v":"CODEVASF"},"UNIDADE: ",{"$f":"VLOOKUP(A61,ORÇAMENTO!$A$11:$L$49,7)","v":"T"}]
[]
[null,"TIPO ITEM","CODIGO ITEM","DESCRIÇÃO ITEM","UNIDADE ITEM","COEFICIENTE","PRECO UNITARIO","CUSTO TOTAL"]
[null,"INSUMO"," - ","TRANSPORTE DE EMULSÃO ASFÁLTICA CATIONICA TIPO RR-1C, INCLUINDO CUSTO TOTAL DO TRANSPORTE (COMBUSTÍVEL, PEDÁGIOS, ETC.) E ICMS - MEMÓRIA ANEXA","T",1,{"$f":"MAT.ASF!U28","v":338.96000000000004},{"$f":"ROUNDDOWN(F66*G66,2)","v":338.96}]
[null,"PRODUÇÃO DA EQUIPE",null,null,1,"CUSTO ",null,{"$f":"SUM(H66:H66)","v":338.96}]
[null,"TOTAL",{"$nulls":5},{"$f":"H67/E67","v":338.96},"OK"]
[null,"BDI                %",{"$nulls":5},{"$f":"1+$M$2","v":1.1499999999999999}]
[null,"TOTAL DO SERVIÇO - R$",{"$nulls":5},{"$f":"ROUND(H68*H69,2)","v":389.8}]
[]
["F5","CODEVASF",null,null," COMPOSIÇÃO DE PREÇO UNITÁRIO",null,null,null,{"$f":"H79","v":4719.13},{"$f":"H81","v":5427}]
[null,"OBRA:  ",{"$f":"$C$2","v":" PAVIMENTAÇÃO ASFÁLTICA EM CBUQ - VIAS DIVERSAS - BAIRROS: N. SRA. DO ROSÁRIO, CÍCERO PASSOS E COMUNIDADE PERNAMBUCO - PIRAPORA-MG"},null,null,null,"DATA: ",{"$f":"$H$2","v":" JANEIRO / 2025"}]
[null,"SERVIÇO:  ",{"$f":"VLOOKUP(A72,ORÇAMENTO!$A$11:$L$49,5)","v":"AQUISIÇÃO DE CONCRETO ASFÁLTICO DE PETRÓLEO - CAP 50/70 - EXCLUSIVE TRANSPORTE"},null,"Referência:",{"$f":"VLOOKUP(A72,ORÇAMENTO!$A$11:$L$49,4)","v":"ANP"},"UNIDADE: ",{"$f":"VLOOKUP(A72,ORÇAMENTO!$A$11:$L$49,7)","v":"T"}]
[]
[null,"TIPO ITEM","CODIGO ITEM","DESCRIÇÃO ITEM","UNIDADE ITEM","COEFICIENTE","PRECO UNITARIO","CUSTO TOTAL"]
[null,"INSUMO",1518,"CIMENTOS ASFÁLTICO DE PETRÓLEO TIPO CAP 50/70 (MEMÓRIA EM ANEXO)","T",1,{"$f":"MAT.ASF!V14","v":4719.1340094660791},{"$f":"ROUNDDOWN(F77*G77,2)","v":4719.13}]
[null,"PRODUÇÃO DA EQUIPE",null,null,1,"CUSTO ",null,{"$f":"SUM(H77:H77)","v":4719.13}]
[null,"TOTAL",{"$nulls":5},{"$f":"H78/E78","v":4719.13}]
[null,"BDI                %",{"$nulls":5},{"$f":"1+$M$2","v":1.1499999999999999}]
[null,"TOTAL DO SERVIÇO - R$",{"$nulls":5},{"$f":"ROUND(H79*H80,2)","v":5427}]
[]
["F6","CODEVASF",null,null," COMPOSIÇÃO DE PREÇO UNITÁRIO",null,null,null,{"$f":"H90","v":380.75},{"$f":"H92","v":437.86}]
[null,"OBRA:  ",{"$f":"$C$2","v":" PAVIMENTAÇÃO ASFÁLTICA EM CBUQ - VIAS DIVERSAS - BAIRROS: N. SRA. DO ROSÁRIO, CÍCERO PASSOS E COMUNIDADE PERNAMBUCO - PIRAPORA-MG"},null,null,null,"DATA: ",{"$f":"$H$2","v":" JANEIRO / 2025"}]
[null,"SERVIÇO:  ",{"$f":"VLOOKUP(A83,ORÇAMENTO!$A$11:$L$49,5)","v":"TRANSPORTE DE CONCRETO ASFÁLTICO DE PETRÓLEO - CAP 50/70"},null,"Referência:",{"$f":"VLOOKUP(A83,ORÇAMENTO!$A$11:$L$49,4)","v":"CODEVASF"},"UNIDADE: ",{"$f":"VLOOKUP(A83,ORÇAMENTO!$A$11:$L$49,7)","v":"T"}]
[]
[null,"TIPO ITEM","CODIGO ITEM","DESCRIÇÃO ITEM","UNIDADE ITEM","COEFICIENTE","PRECO UNITARIO","CUSTO TOTAL"]
[null,"INSUMO"," - ","TRANSPORTE DE CIMENTO ASFÁLTICO DE PETRÓLEO TIPO CAP 50-70, INCLUINDO CUSTO TOTAL DO TRANSPORTE (COMBUSTÍVEL, PEDÁGIOS, ETC.) E ICMS - MEMÓRIA ANEXA","T",1,{"$f":"MAT.ASF!U14","v":380.75181818181818},{"$f":"ROUNDDOWN(F88*G88,2)","v":380.75}]
[null,"PRODUÇÃO DA EQUIPE",null,null,1,"CUSTO ",null,{"$f":"SUM(H88:H88)","v":380.75}]
[null,"TOTAL",{"$nulls":5},{"$f":"H89/E89","v":380.75}]
[null,"BDI                %",{"$nulls":5},{"$f":"1+$M$2","v":1.1499999999999999}]
[null,"TOTAL DO SERVIÇO - R$",{"$nulls":5},{"$f":"ROUND(H90*H91,2)","v":437.86}]

{"sheet":"BDI SERV","index":3,"n_rows":60,"n_cols":5,"rows_kept":60,"cut":false,"hidden":false,"merged":[[28,7,28,15],[35,0,35,5],[36,0,36,5],[38,1,38,4],[39,2,39,3],[0,1,2,4],[25,1,25,3],[26,1,26,2],[26,3,26,4],[27,3,27,4]]}
[null,"DETALHAMENTO DO BDI - SERVIÇOS"]
[]
[]
[null,"Item","Descrição dos Serviços","% - PV","% - CD"]
[]
[null,1,"ADMINISTRAÇÃO CENTRAL"," ",{"$f":"SUM(E7:E9)","v":4.01}]
[null,"1.1","ESCRITÓRIO CENTRAL",null,4.01]
[null,"1.2","VIAGENS"]
[null,"1.3","OUTROS"]
[null," "," "," "," "]
[null,2,"IMPOSTOS E TAXAS",{"$f":"SUM(D12:D15)","v":6.15},{"$f":"SUM(E12:E15)","v":0}]
[null,"2.1","ISS - Proposta",{"$f":"D34*100","v":2.5}]
[null,"2.2","PIS",0.65]
[null,"2.3","Cofins",3]
[null,"2.4","Contribuição Previdenciaria (CPRB)"]
[]
[null,3,"TAXA DE RISCO",null,{"$f":"SUM(E18:E20)","v":0.96}]
[null,"3.1","SEGURO",null,0.2]
[null,"3.2","RISCO",null,0.56000000000000005]
[null,"3.3","GARANTIA",null,0.2]
[]
[null,4,"DESPESAS FINANCEIRAS",null,1.1100000000000001]
[]
[null,5,"LUCRO",null,7.3]
[]
[null,"BDI APRESENTADO:",null,null,{"$f":"IF($D$41=$C$43,$D$43,IF($D$41=$C$44,$D$44,IF($D$41=$C$44,$D$44,IF($D$41=$C$45,$D$45,0))))","v":21.35}]
[]
[null,null,"Legislação Municipal:","Lei Complementar nº 1.815/2005"]
[null,null,"Município:","Pirapora"]
[null,null,"Alíquota ISSQN:",0.05,"Município"]
[null,null,"Base de Cálculo:",0.5,"Art. 106 §2º"]
[null,null,"Valor Serviço:",2293172.0499999998]
[null,null,"Dedução - Material (estimado):",0,{"$f":"D33/D32","v":0}]
[null,null,"ISSQN BDI:",{"$f":"IF(D32=\"\",0,ROUND(IF(D31=D49,((1-(D33/D32))*D30),D30*D31),4))","v":2.5000000000000001E-2},"(*)"]
[]
["Acórdão nº 2.622/2013 - TCU Plenário"]
["BDI = ARRED((((((1+(AC+TR)/100)*(1+DF/100)*(1+L/100))/(1-IMP/100))-1)*100);2)"]
[]
[null,"(*) É obrigação da licitante a verificação da Legislação Tributária vigente no município, bem como o cálculo dos valores totais de serviços e materiais estimados, para apresentação de sua proposta."]
[]
[null,null,"Forma de Cálculo do BDI:","BDI - Acórdão nº 2.622/2013 - TCU"]
[]
[null,null,"BDI - Digitado",{"$f":"ROUND(E6+E11+E17+E22+E24,2)","v":13.38}]
[null,null,"BDI - Calculado",{"$f":"ROUND((((1+(E6/100+E22/100+E17/100))/(1-(D11/100+E24/100)))-1)*100,2)","v":22.56}]
[null,null,"BDI - Acórdão nº 2.622/2013 - TCU",{"$f":"ROUND((((((1+(E6+E17)/100)*(1+E22/100)*(1+E24/100))/(1-D11/100))-1)*100),2)","v":21.35}]
[]
[]
[]
[null,null,null,"Dedução - Material","Município"]
[null,null,null,0.1,"Simples Nacional"]
[null,null,null,0.2,"Municípios Indefinidos"]
[null,null,null,0.3]
[null,null,null,0.4]
[null,null,null,0.5]
[null,null,null,0.6]
[null,null,null,0.7]
[null,null,null,0.8]
[null,null,null,0.9]
[null,null,null,1]
[null,null,null,{"$f":"E31","v":"Art. 106 §2º"}]

{"sheet":"BDI FORN","index":4,"n_rows":37,"n_cols":5,"rows_kept":37,"cut":false,"hidden":false,"merged":[[31,1,31,2],[32,0,34,5],[36,0,36,5],[0,1,2,4],[3,1,4,1],[3,2,4,2],[28,0,28,5],[30,1,30,2]]}
[null,"DETALHAMENTO DO BDI - FORNECIMENTO \n(MATERIAL ASFÁLTICO)"]
[]
[]
[null,"Item","Descrição dos Serviços","%","%"]
[null,null,null,"PV","CD"]
[]
[null,1,"ADMINISTRAÇÃO CENTRAL"," ",3.45]
[null,"1.1","ESCRITÓRIO CENTRAL"," "," "]
[null,"1.2","VIAGENS"," "," "]
[null,"1.3","OUTROS"," "," "]
[null," "," "," "," "]
[null,2,"IMPOSTOS E TAXAS",{"$f":"SUM(D13:D16)","v":3.65},{"$f":"SUM(E13:E16)","v":4.5600000000000005}]
[null,"2.1","ISS (*)",null,{"$f":"ROUND(D13*1.2515,2)","v":0}]
[null,"2.2","PIS",0.65,{"$f":"ROUND(D14*1.2515,2)","v":0.81}]
[null,"2.3","Cofins",3,{"$f":"ROUND(D15*1.2515,2)","v":3.75}]
[null,"2.4","CONTRIBUIÇÃO PREVIDENCIÁRIA SOBRE A RENDA BRUTA",0,{"$f":"ROUND(D16*1.2515,2)","v":0}]
[]
[null,3,"TAXA DE RISCO"," ",{"$f":"SUM(E19:E22)","v":1.08}]
[null,"3.1","SEGURO",null,0.24]
[null,"3.2","RISCO",null,0.6]
[null,"3.3","GARANTIA",null,0.24]
[]
[null,4,"DESPESAS FINANCEIRAS"," ",0.85]
[]
[null,5,"LUCRO",null,5.1100000000000003]
[]
[null," ","BDI - CALCULADO"," ",{"$f":"ROUND((((1+(E7+E18)/100)*(1+E23/100)*(1+E25/100)/(1-D12/100)-1)*100),2)","v":15}]
[]
["BDI = ((1+((AC+S+R+G)/100))x(1+DF/100)x(1+L/100)/(1-I/100)-1)*100"]
[]
[null,"BDI (CALCULADO):",null,{"$f":"ROUND((((1+((E7+E18)/100))*(1+E23/100)*(1+E25/100))/(1-D12/100)-1)*100,2)","v":15},"%"]
[null," "]
[]
[]
[]
[]
["BDI EM CONFORMIDADE COM OS ACÓRDÃOS Nº 2369/2011 e ACÓRDÃO Nº 2.622/2013 - TCU - PLENÁRIO"]

{"sheet":"CRONOGRAMA","index":5,"n_rows":19,"n_cols":12,"rows_kept":19,"cut":false,"hidden":false,"merged":[[0,1,0,11],[1,1,2,1],[1,2,2,4],[1,6,1,11],[2,6,2,11],[9,0,10,0],[9,1,10,1],[9,2,10,2],[3,1,3,10],[5,0,6,0],[5,1,6,1],[5,2,6,2],[7,0,8,0],[7,1,8,1],[7,2,8,2],[15,1,16,2],[18,1,22,11],[11,0,12,0],[11,1,12,1],[11,2,12,2],[13,0,14,0],[13,1,14,1],[13,2,14,2]]}
[null,"CRONOGRAMA FÍSICO-FINANCEIRO"]
[null,"OBRA: ",{"$f":"ORÇAMENTO!C5","v":" PAVIMENTAÇÃO ASFÁLTICA EM CBUQ - VIAS DIVERSAS - BAIRROS: N. SRA. DO ROSÁRIO, CÍCERO PASSOS E COMUNIDADE PERNAMBUCO - PIRAPORA-MG"},null,null,"VALOR:",{"$f":"ORÇAMENTO!L42","v":3597621.8699999996}]
[{"$nulls":5},"PRAZO: ","180 DIAS "]
[]
[null,"ITEM","ETAPAS/DESCRIÇAO","FISICO/  FINANCEIRO","TOTAL    ETAPAS","MÊS 1","MÊS 2","MÊS 3","MÊS 4","MÊS 5","MÊS 6","TOTAL"]
["A",{"$f":"VLOOKUP(A6,ORÇAMENTO!$A$10:$L$42,2)","v":1},{"$f":"VLOOKUP(A6,ORÇAMENTO!$A$10:$L$42,5)","v":"SERVIÇOS PRELIMINARES "},"FISICO ",{"$f":"ROUND(E7/$G$2,4)","v":6.4000000000000001E-2},0.25,0.15,0.15,0.15,0.15,0.15,{"$f":"SUM(F6:K6)","v":1}]
[null,null,null,"FINANCEIRO",{"$f":"ORÇAMENTO!L10","v":230323.19000000003},{"$f":"ROUND($E$7*F6,2)","v":57580.800000000003},{"$f":"ROUND($E$7*G6,2)","v":34548.480000000003},{"$f":"ROUND($E$7*H6,2)","v":34548.480000000003},{"$f":"ROUND($E$7*I6,2)","v":34548.480000000003},34548.480000000003,34548.480000000003,{"$f":"SUM(F7:K7)","v":230323.20000000004}]
["B",{"$f":"VLOOKUP(A8,ORÇAMENTO!$A$10:$L$42,2)","v":2},{"$f":"VLOOKUP(A8,ORÇAMENTO!$A$10:$L$42,5)","v":"TERRAPLANAGEM E PAVIMENTAÇÃO"},"FISICO ",{"$f":"ROUND(E9/$G$2,4)","v":0.33539999999999998},0.1,0.2,0.2,0.2,0.2,0.1,{"$f":"SUM(F8:K8)","v":0.99999999999999989}]
[null,null,null,"FINANCEIRO",{"$f":"ORÇAMENTO!L16","v":1206500.3999999999},{"$f":"ROUND($E$9*F8,2)","v":120650.04},{"$f":"ROUND($E$9*G8,2)","v":241300.08},{"$f":"ROUND($E$9*H8,2)","v":241300.08},{"$f":"ROUND($E$9*I8,2)","v":241300.08},241300.08,120650.04,{"$f":"SUM(F9:K9)","v":1206500.3999999999}]
["C",{"$f":"VLOOKUP(A10,ORÇAMENTO!$A$10:$L$42,2)","v":3},{"$f":"VLOOKUP(A10,ORÇAMENTO!$A$10:$L$42,5)","v":"TRANSPORTE DE MATERIAIS"},"FISICO ",{"$f":"ROUND(E11/$G$2,4)","v":0.24349999999999999},0.25,0.5,0.25,null,null,null,{"$f":"SUM(F10:K10)","v":1}]
[null,null,null,"FINANCEIRO",{"$f":"ORÇAMENTO!L23","v":875905.48},{"$f":"ROUND($E$11*F10,2)","v":218976.37},{"$f":"ROUND($E$11*G10,2)","v":437952.74},{"$f":"ROUND($E$11*H10,2)","v":218976.37},{"$f":"ROUND($E$11*I10,2)","v":0},0,0,{"$f":"SUM(F11:K11)-0.04","v":875905.44}]
["E",{"$f":"VLOOKUP(A12,ORÇAMENTO!$A$10:$L$42,2)","v":4},{"$f":"VLOOKUP(A12,ORÇAMENTO!$A$10:$L$42,5)","v":"DRENAGEM E OBRAS COMPLEMENTARES"},"FISICO ",{"$f":"ROUND(E13/$G$2,4)","v":0.1288},0.1,0.2,0.2,0.2,0.2,0.1,{"$f":"SUM(F12:K12)","v":0.99999999999999989}]
[null,null,null,"FINANCEIRO",{"$f":"ORÇAMENTO!L29","v":463426.86},{"$f":"ROUND($E$13*F12,2)","v":46342.69},{"$f":"ROUND($E$13*G12,2)","v":92685.37},{"$f":"ROUND($E$13*H12,2)","v":92685.37},{"$f":"ROUND($E$13*I12,2)","v":92685.37},92685.37,46342.69,{"$f":"SUM(F13:K13)-0.02","v":463426.83999999997}]
["F",{"$f":"VLOOKUP(A14,ORÇAMENTO!$A$10:$L$42,2)","v":5},{"$f":"VLOOKUP(A14,ORÇAMENTO!$A$10:$L$42,5)","v":"FORNECIMENTOS - MATERIAL ASFÁLTICO (BDI DIFERENCIADO)"},"FISICO ",{"$f":"ROUND(E15/$G$2,4)","v":0.2283},null,0.2,0.2,0.2,0.2,0.2,{"$f":"SUM(F14:K14)","v":1}]
[null,null,null,"FINANCEIRO",{"$f":"ORÇAMENTO!L35","v":821465.94000000006},{"$f":"ROUND($E$15*F14,2)","v":0},164293.19,164293.19,164293.19,164293.19,164293.19,{"$f":"SUM(F15:K15)-0.02","v":821465.92999999993}]
[null,"TOTAL",null,"FISICO ",{"$f":"SUM(F16:K16)","v":1.000000005559228},{"$f":"F17/$E$17","v":0.12328974973681711},{"$f":"G17/$E$17","v":0.26983932583220593},{"$f":"H17/$E$17","v":0.20897234816954233},{"$f":"I17/$E$17","v":0.14810537050687878},0.14810537050687878,0.10168784080690503,{"$f":"SUM(F16:K16)","v":1.000000005559228}]
[null,null,null,"FINANCEIRO",{"$f":"E11+E9+E7+E15+E13","v":3597621.8699999996},{"$f":"F11+F9+F7+F15+F13","v":443549.89999999997},{"$f":"G11+G9+G7+G15+G13","v":970779.86},751803.48999999987,532827.12,532827.12,365834.39999999997,{"$f":"SUM(F17:K17)-0.02","v":3597621.87}]
[]
[null,"OBSERVAÇÕES:"]

{"sheet":"EAI","index":6,"n_rows":90,"n_cols":34,"rows_kept":90,"cut":false,"hidden":false,"merged":[[12,3,24,3],[1,2,3,26],[5,2,7,2],[5,12,7,12],[6,6,7,6],[6,19,6,20],[10,4,10,8],[10,9,10,10],[10,22,10,23],[5,6,5,7],[5,8,5,9],[6,21,6,24],[7,21,7,24]]}
[]
[null,null,"MEMÓRIA DE CÁLCULO"]
[]
[]
[]
[{"$nulls":6},"TIPOLOGIA DO MATERIAL",null,"Emulsão Asfáltica para Serviço de Imprimação",null,null,null,"IMPOSTOS","COFINS",6.4999999999999997E-3,6.4999999999999997E-3]
[{"$nulls":6},"ÍNDICE DE PAVIMENTAÇÃO DNIT","2014-07-01","ÍNDICE INICIAL",270.23700000000002,null,null,null,"PIS",0.03,0.03,null,null,null,"LEGENDA",{"$nulls":8},"As empresas tributadas pelo Lucro Presumido pagam 0,65% de PIS e 3% de COFINS"]
[{"$nulls":7},{"$f":"H9","v":"2024-12-01"},"ÍNDICE FINAL",583.33399999999995,null,null,null," ICMS",0.18,0.18,{"$f":"1-(O8/1)","v":0.82000000000000006},{"$f":"1-(P8/1)","v":0.82000000000000006},{"$f":"1-(Q8/1)","v":0.17999999999999994},"ENTRADA DE DADOS",null,"QUANT.ESTIMADA DE EMULSÃO ASFÁLTICA PARA IMPRIMAÇÃO (TON.):",null,null,null,{"$f":"ORÇAMENTO!H36","v":32.000000000000007},"TONELADAS",null,"As empresas tributadas pelo Lucro Real pagam 1,65% de PIS e 7,60% de COFINS"]
[{"$nulls":6},"Data ANP","2024-12-01"]
[]
[null,null,"DATA-BASE","PRODUTOS","LOCALIDADES",{"$nulls":4},"CUSTO ANP (R$/Kg)",null,"CUSTO ANP","IMPOSTOS DO PRODUTO","CUSTO DO PRODUTO COM IMPOSTOS","DMT's","DMT's FLUVIAL","CUSTO DO TRANSPORTE RODOVIA PAVIMENTADA","CUSTO DO TRANSPORTE FLUVIAL","CUSTO DO TRANSPORTE TOTAL","ICMS","ATUALIZAÇÃO DO CUSTO DE TRANSPORTE","CUSTO DO TRANSPORTE RODOVIA PAVIMENTADA COM IMPOSTOS E ATUALIZAÇÃO MONETÁRIA","PEDÁGIO ",null,"TOTAL TRANSPORTE","AQUISIÇÃO DO PRODUTO","TOTAL GERAL ( TRANSP + AQUISIÇÃO)",null,1,2,3]
[null,null,{"$f":"H8","v":"2024-12-01"},null,"REFINARIAS","ENDEREÇO","ESTADO","CIDADE","DESTINO","ESTADO","REGIÃO","R$/t","R$/t","R$/t","KM","KM","R$/t","R$/t","R$/t","R$/t","R$/t","R$/t","CUSTO ","R$/t","R$/t","R$/t","R$/t",null,"TOTAL GERAL ( TRANSP + AQUISIÇÃO)","TOTAL TRANSPORTE","AQUISIÇÃO DO PRODUTO"]
[null,{"$f":"AA13","v":4693.1601178237879},1,{"$f":"I6","v":"Emulsão Asfáltica para Serviço de Imprimação"},"Refinaria Abreu e Lima","Rodovia PE 60, Km 10 - Ipojuca - PE CEP:55590-000","Pernambuco","IPOJUCA - PE","Pirapora - MG","-",2.6664351178237875,{"$f":"IF(AND(J13=\"-\",K13=\"-\"),\"\",IF(AND(J13<>0,K13=\"-\"),J13*1000,IF(AND(J13=\"-\",K13<>0),K13*1000,IF(AND(J13<>0,K13<>0),J13*1000,\"\"))))","v":2666.4351178237876},{"$f":"ROUND(((L13/(1-$O$6-$O$7-$O$8))-L13),2)","v":736.8},{"$f":"L13+M13","v":3403.2351178237877},1796,null,{"$f":"ROUND((26.939+0.253*O13),2)","v":481.33},null,{"$f":"Q13+R13","v":481.33},{"$f":"TRUNC(S13*($O$8/(1-$O$8)),2)","v":105.65},{"$f":"TRUNC(IF($J$7=\"\",\"\",(($J$8-$J$7)/$J$7)*(S13+T13)),2)","v":680.07},{"$f":"S13+T13+U13","v":1267.0500000000002},183,{"$f":"EVEN($Z$8*2/28)*W13/$Z$8","v":22.874999999999996},{"$f":"IF(AND(S13=\"\",T13=\"\"),\"\",V13+X13)","v":1289.9250000000002},{"$f":"IF(OR(L13=\"\",M13=\"\"),\"\",L13+M13)","v":3403.2351178237877},{"$f":"IF(OR(Y13=\"\",Z13=\"\"),\"\",Y13+Z13)","v":4693.1601178237879},null,{"$f":"AA13","v":4693.1601178237879},{"$f":"Y13","v":1289.9250000000002},{"$f":"Z13","v":3403.2351178237877},null,null,{"$f":"IF(OR(G13=$D$50,G13=$D$51,G13=$D$53,G13=$D$59,G13=$D$43,G13=$D$39,G13=$D$35,G13=$D$48,G13=$D$38),\"NORDESTE\",IF(OR(G13=$D$34,G13=$D$36,G13=$D$37,G13=$D$47,G13=$D$55,G13=$D$56,G13=$D$60),\"NORTE\",IF(OR(G13=$D$40,G13=$D$42,G13=$D$44,G13=$D$45),\"CENTRO-OESTE\",IF(OR(G13=$D$58,G13=$D$52,G13=$D$46,G13=$D$41),\"SUDESTE\",IF(OR(G13=$D$57,G13=$D$49,G13=$D$54),\"SUL\",\"\")))))","v":"NORDESTE"}]
[null,{"$f":"AA14","v":4888.3201178237878},2,null,"Refinaria Potiguar Clara Camarão","Rodovia RN 221, KM 25 - Guamaré - RN CEP:59598-000","Rio Grande do Norte","GUAMARÉ - RN",{"$f":"I13","v":"Pirapora - MG"},"-",2.6664351178237875,{"$f":"IF(AND(J14=\"-\",K14=\"\"),\"\",IF(AND(J14<>0,K14=\"\"),J14*1000,IF(AND(J14=\"-\",K14<>0),K14*1000,IF(AND(J14<>0,K14<>0),J14*1000,\"\"))))","v":2666.4351178237876},{"$f":"ROUND(((L14/(1-$O$6-$O$7-$O$8))-L14),2)","v":736.8},{"$f":"L14+M14","v":3403.2351178237877},2089,null,{"$f":"ROUND((26.939+0.253*O14),2)","v":555.46},null,{"$f":"Q14+R14","v":555.46},{"$f":"TRUNC(S14*($O$8/(1-$O$8)),2)","v":121.93},{"$f":"TRUNC(IF($J$7=\"\",\"\",(($J$8-$J$7)/$J$7)*(S14+T14)),2)","v":784.82},{"$f":"S14+T14+U14","v":1462.21},183,{"$f":"EVEN($Z$8*2/28)*W14/$Z$8","v":22.874999999999996},{"$f":"IF(AND(S14=\"\",T14=\"\"),\"\",V14+X14)","v":1485.085},3403.2351178237877,{"$f":"IF(OR(Y14=\"\",Z14=\"\"),\"\",Y14+Z14)","v":4888.3201178237878},null,{"$f":"AA14","v":4888.3201178237878},{"$f":"Y14","v":1485.085},3403.2351178237877,null,null,"NORDESTE"]
[null,4242.915117823788,3,null,"Refinaria Landulpho Alves (RLAM)","Rodovia BA 523, KM 4 – Mataripe São Francisco do Conde - BA CEP:43900-000","Bahia","SÃO FRANCISCO DO CONDE - BA",{"$f":"I14","v":"Pirapora - MG"},"-",2.6664351178237875,2666.4351178237876,{"$f":"ROUND(((L15/(1-$O$6-$O$7-$O$8))-L15),2)","v":736.8},3403.2351178237877,1116,null,{"$f":"ROUND((26.939+0.253*O15),2)","v":309.29000000000002},null,309.29000000000002,67.89,437,814.18000000000006,204,25.499999999999993,839.68000000000006,3403.2351178237877,4242.915117823788,null,4242.915117823788,839.68000000000006,3403.2351178237877,null,null,"NORDESTE"]
[2403,4836.350359835109,4,null,"Refinaria Lubrificantes e Derivados do Nordeste (Lubnor)","Av. Leite Barbosa, s/nº - Mucuripe Fortaleza - Ceará CEP:60180-420","Ceará","FORTALEZA - CE","Pirapora - MG",2.6043453598351083,2.6664351178237875,{"$f":"IF(AND(J16=\"-\",K16=\"\"),\"\",IF(AND(J16<>0,K16=\"\"),J16*1000,IF(AND(J16=\"-\",K16<>0),K16*1000,IF(AND(J16<>0,K16<>0),J16*1000,\"\"))))","v":2604.3453598351084},{"$f":"ROUND(((L16/(1-$O$6-$O$7-$O$8))-L16),2)","v":719.64},3323.9853598351083,2130,null,565.83000000000004,null,565.83000000000004,124.2,799.46,1489.4900000000002,183,22.874999999999996,1512.3650000000002,3323.9853598351083,4836.350359835109,null,4836.350359835109,1512.3650000000002,3323.9853598351083,null,null,"NORDESTE"]
[null,4228.3121212823753,5,null,"Refinaria Capuava (Recap)","Av. Alberto Soares Sampaio, 2122-A Capuava – Mauá - SP","São Paulo","MAUÁ - SP","Pirapora - MG",2.7498271212823746,2.5664918076204954,2749.8271212823747,{"$f":"ROUND(((L17/(1-$O$6-$O$7-$O$8))-L17),2)","v":759.84},3509.6671212823749,920,null,259.7,null,259.7,57,366.92,683.62,280.2,35.024999999999991,718.64499999999998,3509.6671212823749,4228.3121212823753,null,4228.3121212823753,718.64499999999998,3509.6671212823749,null,null,"SUDESTE"]
[null,3907.8468076204954,6,null,"Refinaria Duque de Caxias (Reduc)","Rodovia Washington Luiz, km 113,7 Campos Elíseos – Duque de Caxias - RJ CEP:25213-005","Rio de Janeiro","DUQUE DE CAXIAS - RJ","Pirapora - MG","-",2.5664918076204954,2566.4918076204954,709.18,3275.6718076204952,746,null,215.68,null,215.68,47.34,304.73,567.75,515.4,64.424999999999983,632.17499999999995,3275.6718076204952,3907.8468076204954,null,3907.8468076204954,632.17499999999995,3275.6718076204952,null,null,"SUDESTE"]
[null,5248.7652237886323,7,null,"Refinaria Alberto Pasqualini (Refap)","Avenida Getúlio Vargas, 11001 - Bairro Brigadeira Canoas - RS - Brasil CEP:92420-221","Rio Grande do Sul","CANOAS - RS","Pirapora - MG",2.8817002237886329,2.9098050592270743,2881.7002237886327,796.28,3677.9802237886324,2056,null,547.11,null,547.11,120.09,773.01,1440.21,1044.5999999999999,130.57499999999996,1570.7850000000001,3677.9802237886324,5248.7652237886323,null,5248.7652237886323,1570.7850000000001,3677.9802237886324,null,null,"SUL"]
[null,4812.5362978287758,8,null,"Unidade de Industrialização do Xisto (SIX)","Rodovia do Xisto, BR 476, km 153 São Mateus do Sul – PR CEP 83900-000","Paraná","SÃO MATEUS DO SUL - PR","Pirapora - MG",2.9341262978287759,2.9098050592270743,2934.1262978287759,810.77,3744.8962978287759,1377,null,375.32,null,375.32,82.38,530.29,987.99,637.20000000000005,79.649999999999991,1067.6400000000001,3744.8962978287759,4812.5362978287758,null,4812.5362978287758,1067.6400000000001,3744.8962978287759,null,null,"SUL"]
[null,3598.8568076204951,9,null,"Refinaria Gabriel Passos (Regap)","Av. Refinaria Gabriel Passos, 690 Distrito Industrial Paulo Camilo Sul Betim - MG CEP:32669-205","Minas Gerais","BETIM - MG","Pirapora - MG","-",2.5664918076204954,2566.4918076204954,709.18,3275.6718076204952,351,null,115.74,null,115.74,25.4,163.52000000000001,304.65999999999997,148.19999999999999,18.524999999999995,323.18499999999995,3275.6718076204952,{"$f":"IF(OR(Y21=\"\",Z21=\"\"),\"\",Y21+Z21)","v":3598.8568076204951},null,3598.8568076204951,323.18499999999995,3275.6718076204952,null,null,"SUDESTE"]
[null,4793.9312978287762,10,null,"Refinaria Presidente Getúlio Vargas (Repar)","Rodovia do Xisto, BR 476, km 16 Araucária - PR CEP:83707-440","Paraná","ARAUCÁRIA - PR","Pirapora - MG",2.9341262978287759,2.9098050592270743,2934.1262978287759,810.77,3744.8962978287759,1362,null,371.53,null,371.53,81.55,524.92999999999995,978.01,568.20000000000005,71.024999999999991,1049.0350000000001,3744.8962978287759,4793.9312978287762,null,4793.9312978287762,1049.0350000000001,3744.8962978287759,null,null,"SUL"]
[null,4255.6221212823748,11,null,"Refinaria Presidente Bernardes (RPBC)","Av. 9 de abril, 777 - Jardim das Indústrias Cubatão - SP CEP:11505-000","São Paulo","CUBATÃO - SP","Pirapora - MG",2.7498271212823746,2.5664918076204954,2749.8271212823747,759.84,3509.6671212823749,961,null,270.07,null,270.07,59.28,381.58,710.93000000000006,280.2,35.024999999999991,745.95500000000004,3509.6671212823749,4255.6221212823748,null,4255.6221212823748,745.95500000000004,3509.6671212823749,null,null,"SUDESTE"]
[null,4246.6371212823751,12,null,"Refinaria de Paulínia (Replan)","Rodovia SP 332 - Km. 130 Bonfim - Paulínia – SP CEP:13140-000","São Paulo","PAULÍNIA - SP","Pirapora - MG",2.7498271212823746,2.5664918076204954,2749.8271212823747,759.84,3509.6671212823749,860,null,244.52,null,244.52,53.67,345.48,643.67000000000007,746.4,93.299999999999983,736.97,3509.6671212823749,4246.6371212823751,null,4246.6371212823751,736.97,3509.6671212823749,null,null,"SUDESTE"]
[null,4204.547121282375,13,null,"Refinaria Henrique Lage (Revap)","Rodovia Presidente Dutra, KM 143, S/N Bairro Jardim Diamante - São José dos Campos – SP CEP:12223-900","São Paulo","SÃO JOSÉ DOS CAMPOS - SP","Pirapora - MG",2.7498271212823746,2.5664918076204954,2749.8271212823747,759.84,3509.6671212823749,872,null,247.56,null,247.56,54.34,349.78,651.67999999999995,345.6,43.199999999999996,694.88,3509.6671212823749,4204.547121282375,null,4204.547121282375,694.88,3509.6671212823749,null,null,"SUDESTE"]
{"$rows_empty":8}
[null,null,null,"Acre"]
[null,null,null,"Alagoas"]
[null,null,null,"Amapá"]
[null,null,null,"Amazonas"]
[null,null,null,"Bahia"]
[null,null,null,"Ceará"]
[null,null,null,"Distrito Federal"]
[null,null,null,"Espírito Santo"]
[null,null,null,"Goiás"]
[null,null,null,"Maranhão"]
[null,null,null,"Mato Grosso"]
[null,null,null,"Mato Grosso do Sul"]
[null,null,null,"Minas Gerais"]
[null,null,null,"Pará"]
[null,null,null,"Paraíba"]
[null,null,null,"Paraná"]
[null,null,null,"Pernambuco"]
[null,null,null,"Piauí"]
[null,null,null,"Rio de Janeiro"]
[null,null,null,"Rio Grande do Norte"]
[null,null,null,"Rio Grande do Sul"]
[null,null,null,"Rondônia"]
[null,null,null,"Roraima"]
[null,null,null,"Santa Catarina"]
[null,null,null,"São Paulo"]
[null,null,null,"Sergipe"]
[null,null,null,"Tocantins"]
[]
[]
[]
[null,null,null,"ASFALTOS DILUÍDOS CM-30"]
[null,null,null,"ASFALTOS DILUÍDOS CM-70"]
[null,null,null,"ASFALTOS DILUÍDOS CR-250"]
[null,null,null,"ASFALTOS DILUÍDOS CR-70"]
[null,null,null,"CAP MODIFICADO POR BORRACHA DE PNEU AB22"]
[null,null,null,"CAP MODIFICADO POR BORRACHA DE PNEU AB8"]
[null,null,null,"CAP MODIFICADO POR POLÍMERO 55-75-E"]
[null,null,null,"CAP MODIFICADO POR POLÍMERO 60-85-E"]
[null,null,null,"CAP MODIFICADO POR POLÍMERO 65-90-E"]
[null,null,null,"CIMENTOS ASFÁLTICOS CAP-150-200"]
[null,null,null,"CIMENTOS ASFÁLTICOS CAP-30-45"]
[null,null,null,"CIMENTOS ASFÁLTICOS CAP-50-70"]
[null,null,null,"CIMENTOS ASFÁLTICOS CAP-85-100"]
[null,null,null,"EMULSÃO ASFÁLTICA CATIÔNICA DE RUPTURA CONTROLADA PARA SERVIÇO DE LAMA ASFÁLTICA"]
[null,null,null,"EMULSÃO ASFÁLTICA DE RUPTURA LENTA CATIÔNICA PARA SERVIÇO DE LAMA ASFÁLTICA"]
[null,null,null,"EMULSÃO ASFÁLTICA DE RUPTURA LENTA DE CARGA NEUTRA PARA SERVIÇO DE LAMA ASFÁLTICA"]
[null,null,null,"EMULSÃO ASFÁLTICA PARA SERVIÇO DE IMPRIMAÇÃO"]
[null,null,null,"EMULSÕES ASF. MOD. POR POLÍMEROS RC1C-E"]
[null,null,null,"EMULSÕES ASF. MOD. POR POLÍMEROS RL1C-E"]
[null,null,null,"EMULSÕES ASF. MOD. POR POLÍMEROS RM1C-E"]
[null,null,null,"EMULSÕES ASF. MOD. POR POLÍMEROS RR1C-E"]
[null,null,null,"EMULSÕES ASF. MOD. POR POLÍMEROS RR2C-E"]
[null,null,null,"EMULSÕES ASFÁLTICAS RL-1C"]
[null,null,null,"EMULSÕES ASFÁLTICAS RM-1C"]
[null,null,null,"EMULSÕES ASFÁLTICAS RM-2C"]
[null,null,null,"EMULSÕES ASFÁLTICAS RR-1C"]
[null,null,null,"EMULSÕES ASFÁLTICAS RR-2C"]

{"sheet":"RR-1C","index":7,"n_rows":92,"n_cols":34,"rows_kept":92,"cut":false,"hidden":false,"merged":[[12,3,26,3],[6,19,6,20],[6,6,7,6],[5,12,7,12],[5,6,5,7],[5,8,5,9],[1,2,3,26],[5,2,7,2],[10,4,10,8],[10,9,10,10],[10,22,10,23],[6,21,6,24],[7,21,7,24]]}
[]
[null,null,"MEMÓRIA DE CÁLCULO"]
[]
[]
[]
[{"$nulls":6},"TIPOLOGIA DO MATERIAL",null,"EMULSÕES ASFÁLTICAS RR-1C",null,null,null,"IMPOSTOS","COFINS",6.4999999999999997E-3,6.4999999999999997E-3]
[{"$nulls":6},"ÍNDICE DE PAVIMENTAÇÃO DNIT","2014-07-01","ÍNDICE INICIAL",270.23700000000002,null,null,null,"PIS",0.03,0.03,null,null,null,"LEGENDA",{"$nulls":8},"As empresas tributadas pelo Lucro Presumido pagam 0,65% de PIS e 3% de COFINS"]
[{"$nulls":7},"2023-10-01","ÍNDICE FINAL",{"$f":"EAI!J8","v":583.33399999999995},null,null,null," ICMS",0.18,0.18,{"$f":"1-(O8/1)","v":0.82000000000000006},{"$f":"1-(P8/1)","v":0.82000000000000006},{"$f":"1-(Q8/1)","v":0.17999999999999994},"ENTRADA DE DADOS",null,"QUANT.ESTIMADA DE RR-1C (TON.):",null,null,null,{"$f":"ORÇAMENTO!H38","v":10},"TONELADAS",null,"As empresas tributadas pelo Lucro Real pagam 1,65% de PIS e 7,60% de COFINS"]
[{"$nulls":6},"Data ANP",{"$f":"EAI!H9","v":"2024-12-01"}]
[]
[null,null,"DATA-BASE","PRODUTOS","LOCALIDADES",{"$nulls":4},"CUSTO ANP (R$/Kg)",null,"CUSTO ANP","IMPOSTOS DO PRODUTO","CUSTO DO PRODUTO COM IMPOSTOS","DMT's","DMT'S FLUVIAL","CUSTO DO TRANSPORTE RODOVIA PAVIMENTADA","CUSTO DO TRANSPORTE FLUVIAL","CUSTO DO TRANSPORTE TOTAL","ICMS","ATUALIZAÇÃO DO CUSTO DE TRANSPORTE","CUSTO DO TRANSPORTE RODOVIA PAVIMENTADA COM IMPOSTOS E ATUALIZAÇÃO MONETÁRIA","PEDÁGIO ",null,"TOTAL TRANSPORTE","AQUISIÇÃO DO PRODUTO","TOTAL GERAL ( TRANSP + AQUISIÇÃO)",null,1,2,3]
[null,null,{"$f":"H8","v":"2023-10-01"},null,"REFINARIAS","ENDEREÇO","ESTADO","CIDADE","DESTINO","ESTADO","REGIÃO","R$/t","R$/t","R$/t","KM","KM","R$/t","R$/t","R$/t","R$/t","R$/t","R$/t","CUSTO ","R$/t","R$/t","R$/t","R$/t",null,"TOTAL GERAL ( TRANSP + AQUISIÇÃO)","TOTAL TRANSPORTE","AQUISIÇÃO DO PRODUTO"]
[null,{"$f":"AA13","v":4615.8070861757451},1,{"$f":"I6","v":"EMULSÕES ASFÁLTICAS RR-1C"},"'CENTRO OESTE ASFALTOS LTDA.","SETOR DE INFLAMÁVEIS, S/N TRECHO 02 - LOTE 1.100 - GUARÁ - CEP:71225-000","Distrito Federal","BRASÍLIA - DF",{"$f":"EAI!I13","v":"Pirapora - MG"},"-",3.2575370861757449,{"$f":"IF(AND(J13=\"-\",K13=\"-\"),\"\",IF(AND(J13<>0,K13=\"-\"),J13*1000,IF(AND(J13=\"-\",K13<>0),K13*1000,IF(AND(J13<>0,K13<>0),J13*1000,\"\"))))","v":3257.5370861757447},{"$f":"ROUND(((L13/(1-$O$6-$O$7-$O$8))-L13),2)","v":900.14},{"$f":"L13+M13","v":4157.677086175745},536,null,{"$f":"ROUND((26.939+0.253*O13),2)","v":162.55000000000001},null,{"$f":"Q13+R13","v":162.55000000000001},{"$f":"TRUNC(S13*($O$8/(1-$O$8)),2)","v":35.68},{"$f":"TRUNC(IF($J$7=\"\",\"\",(($J$8-$J$7)/$J$7)*(S13+T13)),2)","v":229.66},{"$f":"S13+T13+U13","v":427.89},151.19999999999999,{"$f":"EVEN($Z$8*2/28)*W13/$Z$8","v":30.24},{"$f":"IF(AND(Q13=\"\",T13=\"\"),\"\",V13+X13)","v":458.13},{"$f":"IF(OR(L13=\"\",M13=\"\"),\"\",L13+M13)","v":4157.677086175745},{"$f":"IF(OR(Y13=\"\",Z13=\"\"),\"\",Y13+Z13)","v":4615.8070861757451},null,{"$f":"AA13","v":4615.8070861757451},{"$f":"Y13","v":458.13},{"$f":"Z13","v":4157.677086175745},null,null,{"$f":"IF(OR(G13=$D$52,G13=$D$53,G13=$D$55,G13=$D$61,G13=$D$45,G13=$D$41,G13=$D$37,G13=$D$50,G13=$D$40),\"NORDESTE\",IF(OR(G13=$D$36,G13=$D$38,G13=$D$39,G13=$D$49,G13=$D$57,G13=$D$58,G13=$D$62),\"NORTE\",IF(OR(G13=$D$42,G13=$D$44,G13=$D$46,G13=$D$47),\"CENTRO-OESTE\",IF(OR(G13=$D$60,G13=$D$54,G13=$D$48,G13=$D$43),\"SUDESTE\",IF(OR(G13=$D$59,G13=$D$51,G13=$D$56),\"SUL\",\"\")))))","v":"CENTRO-OESTE"}]
[null,{"$f":"AA14","v":4588.3811889224889},2,null,"STRATURA ASFALTOS S/A","AVENIDA PRESIDENTE WILSON, 08  - JUNDIAÍ - CEP:75115-100","Goiás","ANÁPOLIS - GO",{"$f":"I13","v":"Pirapora - MG"},3.178431188922489,3.2575370861757449,{"$f":"IF(AND(J14=\"-\",K14=\"-\"),\"\",IF(AND(J14<>0,K14=\"-\"),J14*1000,IF(AND(J14=\"-\",K14<>0),K14*1000,IF(AND(J14<>0,K14<>0),J14*1000,\"\"))))","v":3178.4311889224891},{"$f":"ROUND(((L14/(1-$O$6-$O$7-$O$8))-L14),2)","v":878.28},{"$f":"L14+M14","v":4056.7111889224889},634,null,{"$f":"ROUND((26.939+0.253*O14),2)","v":187.34},null,{"$f":"Q14+R14","v":187.34},{"$f":"TRUNC(S14*($O$8/(1-$O$8)),2)","v":41.12},{"$f":"TRUNC(IF($J$7=\"\",\"\",(($J$8-$J$7)/$J$7)*(S14+T14)),2)","v":264.69},{"$f":"S14+T14+U14","v":493.15},192.6,{"$f":"EVEN($Z$8*2/28)*W14/$Z$8","v":38.519999999999996},531.66999999999996,4056.7111889224889,{"$f":"IF(OR(Y14=\"\",Z14=\"\"),\"\",Y14+Z14)","v":4588.3811889224889},null,{"$f":"AA14","v":4588.3811889224889},{"$f":"Y14","v":531.66999999999996},4056.7111889224889,null,null,"CENTRO-OESTE"]
[null,4611.4011889224894,3,null,"DISTRIBUIDORA BRASILEIRA DE ASFALTO SA - DISBRAL","VIA PRIMARIA 8, S/N QD-18, MODS. 24/47 - DAIAG - CEP:74980-970","Goiás","APARECIDA DE GOIANIA - GO",{"$f":"I14","v":"Pirapora - MG"},3.178431188922489,3.2575370861757449,3178.4311889224891,878.28,4056.7111889224889,681,null,199.23,null,199.23,43.73,281.49,524.45000000000005,151.19999999999999,30.24,554.69000000000005,4056.7111889224889,4611.4011889224894,null,4611.4011889224894,554.69000000000005,4056.7111889224889,null,null,"CENTRO-OESTE"]
[2403,4641.3811889224889,4,null,"INDÚSTRIA NACIONAL DE ASFALTOS LTDA.","VIA PRIMEIRA E SEGUNDA 3, S/N.º LOTES 01 A 10 - DISTRITO AGROINDUSTRIAL - CEP:75370-000","Goiás","GOIANIRA - GO","Pirapora - MG",3.178431188922489,3.2575370861757449,3178.4311889224891,878.28,4056.7111889224889,726,null,210.62,null,210.62,46.23,297.58,554.43000000000006,151.19999999999999,30.24,584.67000000000007,4056.7111889224889,4641.3811889224889,null,4641.3811889224889,584.67000000000007,4056.7111889224889,null,null,"CENTRO-OESTE"]
[null,3893.746391922843,5,null,"STRATURA ASFALTOS S/A","RUA VICTOR RODRIGUES RESENDE, 333  - DISTRITO IND. DE UBERLÂNDIA - CEP:38405-440","Minas Gerais","UBERLANDIA - MG","Pirapora - MG",2.7250163919228432,2.7734975034562561,2725.016391922843,752.99,3478.0063919228432,472,null,146.36000000000001,null,146.36000000000001,32.119999999999997,206.78,385.26,152.4,30.48,415.74,3478.0063919228432,3893.746391922843,null,3893.746391922843,415.74,3478.0063919228432,null,null,"SUDESTE"]
[null,5603.0218623142919,6,null,"ARAPETRO DISTRIBUIDORA DE PETRÓLEO LTDA.","RUA 04, S/N° LOTES 17 A 20. - DISTRITO INDUSTRIAL 1/8 - CEP:78600-000","Mato Grosso","BARRA DO GARCAS - MT",{"$f":"I17","v":"Pirapora - MG"},3.7550018623142916,3.2575370861757449,{"$f":"IF(AND(J18=\"-\",K18=\"-\"),\"\",IF(AND(J18<>0,K18=\"-\"),J18*1000,IF(AND(J18=\"-\",K18<>0),K18*1000,IF(AND(J18<>0,K18<>0),J18*1000,\"\"))))","v":3755.0018623142914},{"$f":"ROUND(((L18/(1-$O$6-$O$7-$O$8))-L18),2)","v":1037.5999999999999},4792.6018623142918,1065,null,296.38,null,296.38,65.05,418.75,780.18000000000006,151.19999999999999,30.24,810.42000000000007,4792.6018623142918,5603.0218623142919,{"$nulls":6},"CENTRO-OESTE"]
[null,3816.9663919228433,7,null,"DISTRIBUIDORA BRASILEIRA DE ASFALTO SA - DISBRAL","SÃO JUDAS TADEU, 288  - DISTRITO INDUSTRIAL - CEP:32450-000","Minas Gerais","SARZEDO - MG","Pirapora - MG",2.7250163919228432,2.7734975034562561,2725.016391922843,752.99,3478.0063919228432,358,null,117.51,null,117.51,25.79,166.02,309.32000000000005,148.19999999999999,29.639999999999997,338.96000000000004,3478.0063919228432,3816.9663919228433,{"$nulls":6},"SUDESTE"]
[null,5689.1565125370162,8,null,"'INDÚSTRIA NACIONAL DE ASFALTOS LTDA.","INDÚSTRIA NACIONAL DE ASFALTOS LTDA - CEP:77053-080","Tocantins"," PALMAS - TO","Pirapora - MG","-",3.6084565125370163,3608.4565125370164,997.1,4605.5565125370167,1349,null,368.24,null,368.24,80.83,520.29,969.3599999999999,571.20000000000005,114.24000000000001,1083.5999999999999,4605.5565125370167,5689.1565125370162,{"$nulls":6},"NORTE"]
[null,4539.0720737986512,9,null,"'NTA - NOVAS TÉCNICAS DE ASFALTOS S/A","RUA SOFIA ATAURI FADIN, 150 SALA A - B. SANTA TEREZINHA - CEP:13140-000","São Paulo","PAULINIA - SP","Pirapora - MG",2.9298620737986507,2.7734975034562561,2929.8620737986507,{"$f":"ROUND(((L21/(1-$O$6-$O$7-$O$8))-L21),2)","v":809.59},3739.4520737986509,870,null,247.05,null,247.05,54.23,349.06,650.34,746.4,149.28,799.62,3739.4520737986509,4539.0720737986512,null,4539.0720737986512,799.62,3739.4520737986509,null,null,"SUDESTE"]
[null,4462.4220737986507,10,null,"COMPANHIA BRASILEIRA DE ASFALTOS DA AMAZÔNIA - IMPORTAÇÃO E EXPORTAÇÃO","Avenida Doutor Olindo Dártora 2451, Galpão 02, Morro Grande - CEP:07726-555","São Paulo","CAIEIRAS - SP","Pirapora - MG",2.9298620737986507,2.7734975034562561,2929.8620737986507,{"$f":"ROUND(((L22/(1-$O$6-$O$7-$O$8))-L22),2)","v":809.59},3739.4520737986509,898,null,254.13,null,254.13,55.78,359.06,668.97,270,54,722.97,3739.4520737986509,4462.4220737986507,{"$nulls":6},"SUDESTE"]
[null,5080.2570861757449,11,null,"BETUNEL INDÚSTRIA E COMÉRCIO LTDA.","R 16 , 82, Vila Nova Campo Grande - CEP:79.103-834","Mato Grosso do Sul","CAMPO GRANDE - MS","Pirapora - MG","-",3.2575370861757449,3257.5370861757447,{"$f":"ROUND(((L23/(1-$O$6-$O$7-$O$8))-L23),2)","v":900.14},4157.677086175745,1233,null,338.89,null,338.89,74.39,478.82,892.09999999999991,152.4,30.48,922.57999999999993,4157.677086175745,5080.2570861757449,{"$nulls":6},"CENTRO-OESTE"]
[null,5974.5218623142919,12,null,"BETUNEL INDÚSTRIA E COMÉRCIO LTDA.","RUA N ESQUINA COM RUA X, S/N QD. IND. 7 L 01/08 - DIST. IND. - CEP:78015-285","Mato Grosso","CUIABA - MT",{"$f":"I23","v":"Pirapora - MG"},3.7550018623142916,3.2575370861757449,3755.0018623142914,1037.5999999999999,4792.6018623142918,1517,null,410.74,null,410.74,90.16,580.34,1081.24,503.4,100.67999999999999,1181.92,4792.6018623142918,5974.5218623142919,{"$nulls":6},"CENTRO-OESTE"]
[null,4448.2420737986513,13,null,"VIAPOL LTDA.","VITO ARDITO, 6401 KM 118,5 - JARDIM CAMPO GRANDE - CEP:12282-535","São Paulo","CACAPAVA - SP",{"$f":"I24","v":"Pirapora - MG"},2.9298620737986507,2.7734975034562561,2929.8620737986507,809.59,3739.4520737986509,854,null,243,null,243,53.34,343.33,639.67000000000007,345.6,69.12,708.79000000000008,3739.4520737986509,4448.2420737986513,null,4448.2420737986513,708.79000000000008,3739.4520737986509,null,null,"SUDESTE"]
[null,4212.7175034562561,14,null,"STRATURA ASFALTOS S/A","RUA LUIS DE CAMÕES, 26  - CAMPOS ELÍSEOS - CEP:25225-030","Rio de Janeiro","DUQUE DE CAXIAS - RJ","Pirapora - MG","-",2.7734975034562561,2773.4975034562563,766.38,3539.8775034562564,749,null,216.44,null,216.44,47.51,305.81,569.76,515.4,103.08,672.84,3539.8775034562564,4212.7175034562561,null,4212.7175034562561,672.84,3539.8775034562564,null,null,"SUDESTE"]
[null,4470.0977614442709,15,null,"CASA DO ASFALTO DISTRIBUIDORA, INDÚSTRIA E COMÉRCIO DE ASFALTO LTDA.","BR 376, PARQUE INDUSTRIAL, S/N LOTE 6/7/7-A-3-1 - GL.PATR.MARIALVA - CEP:86990-000","Paraná","MARIALVA - PR",{"$f":"I26","v":"Pirapora - MG"},2.6974877614442714,2.7074316133253515,2697.4877614442712,745.38,3442.8677614442713,1196,null,329.53,null,329.53,72.33,465.59,867.44999999999993,798.9,159.78,1027.23,3442.8677614442713,4470.0977614442709,null,4470.0977614442709,1027.23,3442.8677614442713,null,null,"SUL"]
{"$rows_empty":8}
[null,null,null,"Acre"]
[null,null,null,"Alagoas"]
[null,null,null,"Amapá"]
[null,null,null,"Amazonas"]
[null,null,null,"Bahia"]
[null,null,null,"Ceará"]
[null,null,null,"Distrito Federal"]
[null,null,null,"Espírito Santo"]
[null,null,null,"Goiás"]
[null,null,null,"Maranhão"]
[null,null,null,"Mato Grosso"]
[null,null,null,"Mato Grosso do Sul"]
[null,null,null,"Minas Gerais"]
[null,null,null,"Pará"]
[null,null,null,"Paraíba"]
[null,null,null,"Paraná"]
[null,null,null,"Pernambuco"]
[null,null,null,"Piauí"]
[null,null,null,"Rio de Janeiro"]
[null,null,null,"Rio Grande do Norte"]
[null,null,null,"Rio Grande do Sul"]
[null,null,null,"Rondônia"]
[null,null,null,"Roraima"]
[null,null,null,"Santa Catarina"]
[null,null,null,"São Paulo"]
[null,null,null,"Sergipe"]
[null,null,null,"Tocantins"]
[]
[]
[]
[null,null,null,"ASFALTOS DILUÍDOS CM-30"]
[null,null,null,"ASFALTOS DILUÍDOS CM-70"]
[null,null,null,"ASFALTOS DILUÍDOS CR-250"]
[null,null,null,"ASFALTOS DILUÍDOS CR-70"]
[null,null,null,"CAP MODIFICADO POR BORRACHA DE PNEU AB22"]
[null,null,null,"CAP MODIFICADO POR BORRACHA DE PNEU AB8"]
[null,null,null,"CAP MODIFICADO POR POLÍMERO 55-75-E"]
[null,null,null,"CAP MODIFICADO POR POLÍMERO 60-85-E"]
[null,null,null,"CAP MODIFICADO POR POLÍMERO 65-90-E"]
[null,null,null,"CIMENTOS ASFÁLTICOS CAP-150-200"]
[null,null,null,"CIMENTOS ASFÁLTICOS CAP-30-45"]
[null,null,null,"CIMENTOS ASFÁLTICOS CAP-50-70"]
[null,null,null,"CIMENTOS ASFÁLTICOS CAP-85-100"]
[null,null,null,"EMULSÃO ASFÁLTICA CATIÔNICA DE RUPTURA CONTROLADA PARA SERVIÇO DE LAMA ASFÁLTICA"]
[null,null,null,"EMULSÃO ASFÁLTICA DE RUPTURA LENTA CATIÔNICA PARA SERVIÇO DE LAMA ASFÁLTICA"]
[null,null,null,"EMULSÃO ASFÁLTICA DE RUPTURA LENTA DE CARGA NEUTRA PARA SERVIÇO DE LAMA ASFÁLTICA"]
[null,null,null,"EMULSÃO ASFÁLTICA PARA SERVIÇO DE IMPRIMAÇÃO"]
[null,null,null,"EMULSÕES ASF. MOD. POR POLÍMEROS RC1C-E"]
[null,null,null,"EMULSÕES ASF. MOD. POR POLÍMEROS RL1C-E"]
[null,null,null,"EMULSÕES ASF. MOD. POR POLÍMEROS RM1C-E"]
[null,null,null,"EMULSÕES ASF. MOD. POR POLÍMEROS RR1C-E"]
[null,null,null,"EMULSÕES ASF. MOD. POR POLÍMEROS RR2C-E"]
[null,null,null,"EMULSÕES ASFÁLTICAS RL-1C"]
[null,null,null,"EMULSÕES ASFÁLTICAS RM-1C"]
[null,null,null,"EMULSÕES ASFÁLTICAS RM-2C"]
[null,null,null,"EMULSÕES ASFÁLTICAS RR-1C"]
[null,null,null,"EMULSÕES ASFÁLTICAS RR-2C"]

{"sheet":"CAP","index":8,"n_rows":91,"n_cols":34,"rows_kept":91,"cut":false,"hidden":false,"merged":[[10,4,10,8],[10,9,10,10],[10,22,10,23],[12,3,24,3],[1,2,3,26],[5,2,7,2],[5,12,7,12],[6,6,7,6],[6,19,6,20],[6,21,6,24],[7,21,7,24],[5,6,5,7],[5,8,5,9]]}
[]
[null,null,"MEMÓRIA DE CÁLCULO"]
[]
[]
[]
[{"$nulls":6},"TIPOLOGIA DO MATERIAL",null,"CIMENTOS ASFÁLTICOS CAP-50-70",null,null,null,"IMPOSTOS","COFINS",6.4999999999999997E-3,6.4999999999999997E-3]
[{"$nulls":6},"ÍNDICE DE PAVIMENTAÇÃO DNIT","2014-07-01","ÍNDICE INICIAL",270.23700000000002,null,null,null,"PIS",0.03,0.03,null,null,null,"LEGENDA",null,"QUANT.ESTIMADA DE MASSA ASFÁLTICA (TON.):",null,null,null,{"$f":"ORÇAMENTO!H22","v":1940},"TONELADAS",null,"As empresas tributadas pelo Lucro Presumido pagam 0,65% de PIS e 3% de COFINS"]
[{"$nulls":7},"2023-10-01","ÍNDICE FINAL",{"$f":"EAI!J8","v":583.33399999999995},null,null,null," ICMS",0.18,0.18,{"$f":"1-(O8/1)","v":0.82000000000000006},{"$f":"1-(P8/1)","v":0.82000000000000006},{"$f":"1-(Q8/1)","v":0.17999999999999994},"ENTRADA DE DADOS",null,"QUANT.ESTIMADA DE CAP 50/70 (TON.):",null,null,null,{"$f":"ORÇAMENTO!H40","v":110},"TONELADAS",null,"As empresas tributadas pelo Lucro Real pagam 1,65% de PIS e 7,60% de COFINS"]
[{"$nulls":6},"Data ANP",{"$f":"EAI!H9","v":"2024-12-01"}]
[]
[null,null,"DATA-BASE","PRODUTOS","LOCALIDADES",{"$nulls":4},"CUSTO ANP (R$/Kg)",null,"CUSTO ANP","IMPOSTOS DO PRODUTO","CUSTO DO PRODUTO COM IMPOSTOS","DMT's","DMT's FLUVIAL","CUSTO DO TRANSPORTE RODOVIA PAVIMENTADA","CUSTO DO TRANSPORTE FLUVIAL","CUSTO DO TRANSPORTE TOTAL","ICMS","ATUALIZAÇÃO DO CUSTO DE TRANSPORTE","CUSTO DO TRANSPORTE RODOVIA PAVIMENTADA COM IMPOSTOS E ATUALIZAÇÃO MONETÁRIA","PEDÁGIO ",null,"TOTAL TRANSPORTE","AQUISIÇÃO DO PRODUTO","TOTAL GERAL ( TRANSP + AQUISIÇÃO)",null,1,2,3]
[null,null,{"$f":"H8","v":"2023-10-01"},null,"REFINARIAS","ENDEREÇO","ESTADO","CIDADE","DESTINO","ESTADO","REGIÃO","R$/t","R$/t","R$/t","KM","KM","R$/t","R$/t","R$/t","R$/t","R$/t","R$/t","CUSTO ","R$/t","R$/t","R$/t","R$/t",null,"TOTAL GERAL ( TRANSP + AQUISIÇÃO)","TOTAL TRANSPORTE","AQUISIÇÃO DO PRODUTO"]
[null,{"$f":"AA13","v":6204.4961301168014},1,{"$f":"I6","v":"CIMENTOS ASFÁLTICOS CAP-50-70"},"Refinaria Abreu e Lima","Rodovia PE 60, Km 10 - Ipojuca - PE CEP:55590-000","Pernambuco","IPOJUCA - PE","Montes Claros - MG","-",3.9441570392077105,{"$f":"IF(AND(J13=\"-\",K13=\"-\"),\"\",IF(AND(J13<>0,K13=\"-\"),J13*1000,IF(AND(J13=\"-\",K13<>0),K13*1000,IF(AND(J13<>0,K13<>0),J13*1000,\"\"))))","v":3944.1570392077106},{"$f":"ROUND(((L13/(1-$O$6-$O$7-$O$8))-L13),2)","v":1089.8699999999999},{"$f":"L13+M13","v":5034.0270392077109},1631,null,{"$f":"ROUND((26.939+0.253*O13),2)","v":439.58},null,{"$f":"Q13+R13","v":439.58},{"$f":"TRUNC(S13*($O$8/(1-$O$8)),2)","v":96.49},{"$f":"TRUNC(IF($J$7=\"\",\"\",(($J$8-$J$7)/$J$7)*(S13+T13)),2)","v":621.09},{"$f":"S13+T13+U13","v":1157.1599999999999},183,{"$f":"EVEN($Z$8*2/28)*W13/$Z$8","v":13.309090909090909},{"$f":"IF(AND(Q13=\"\",T13=\"\"),\"\",V13+X13)","v":1170.4690909090907},{"$f":"IF(OR(L13=\"\",M13=\"\"),\"\",L13+M13)","v":5034.0270392077109},{"$f":"IF(OR(Y13=\"\",Z13=\"\"),\"\",Y13+Z13)","v":6204.4961301168014},null,{"$f":"AA13","v":6204.4961301168014},{"$f":"Y13","v":1170.4690909090907},{"$f":"Z13","v":5034.0270392077109},null,null,{"$f":"IF(OR(G13=$D$51,G13=$D$52,G13=$D$54,G13=$D$60,G13=$D$44,G13=$D$40,G13=$D$36,G13=$D$49,G13=$D$39),\"NORDESTE\",IF(OR(G13=$D$35,G13=$D$37,G13=$D$38,G13=$D$48,G13=$D$56,G13=$D$57,G13=$D$61),\"NORTE\",IF(OR(G13=$D$41,G13=$D$43,G13=$D$45,G13=$D$46),\"CENTRO-OESTE\",IF(OR(G13=$D$59,G13=$D$53,G13=$D$47,G13=$D$42),\"SUDESTE\",IF(OR(G13=$D$58,G13=$D$50,G13=$D$55),\"SUL\",\"\")))))","v":"NORDESTE"}]
[null,{"$f":"AA14","v":6398.9861301168021},3,null,"Refinaria Potiguar Clara Camarão","Rodovia RN 221, KM 25 - Guamaré - RN CEP:59598-000","Rio Grande do Norte","GUAMARÉ - RN",{"$f":"I13","v":"Montes Claros - MG"},"-",3.9441570392077105,3944.1570392077106,{"$f":"ROUND(((L14/(1-$O$6-$O$7-$O$8))-L14),2)","v":1089.8699999999999},{"$f":"L14+M14","v":5034.0270392077109},1923,null,{"$f":"ROUND((26.939+0.253*O14),2)","v":513.46},null,{"$f":"Q14+R14","v":513.46},{"$f":"TRUNC(S14*($O$8/(1-$O$8)),2)","v":112.71},{"$f":"TRUNC(IF($J$7=\"\",\"\",(($J$8-$J$7)/$J$7)*(S14+T14)),2)","v":725.48},{"$f":"S14+T14+U14","v":1351.65},183,{"$f":"EVEN($Z$8*2/28)*W14/$Z$8","v":13.309090909090909},1364.9590909090909,5034.0270392077109,{"$f":"IF(OR(Y14=\"\",Z14=\"\"),\"\",Y14+Z14)","v":6398.9861301168021},null,{"$f":"AA14","v":6398.9861301168021},{"$f":"Y14","v":1364.9590909090909},5034.0270392077109,null,null,"NORDESTE"]
[null,5857.7859541445423,4,null,"Refinaria Landulpho Alves (RLAM)","Rodovia BA 523, KM 4 – Mataripe São Francisco do Conde - BA CEP:43900-000","Bahia","SÃO FRANCISCO DO CONDE - BA",{"$f":"I14","v":"Montes Claros - MG"},4.0261595905081782,3.9441570392077105,4026.1595905081781,{"$f":"ROUND(((L15/(1-$O$6-$O$7-$O$8))-L15),2)","v":1112.53},5138.6895905081783,951,null,{"$f":"ROUND((26.939+0.253*O15),2)","v":267.54000000000002},null,267.54000000000002,58.72,378,704.26,204,14.836363636363636,719.09636363636366,5138.6895905081783,5857.7859541445423,null,5857.7859541445423,719.09636363636366,5138.6895905081783,null,null,"NORDESTE"]
[2403,6345.8367449581319,5,null,"Refinaria Lubrificantes e Derivados do Nordeste (Lubnor)","Av. Leite Barbosa, s/nº - Mucuripe Fortaleza - Ceará CEP:60180-420","Ceará","FORTALEZA - CE","Montes Claros - MG",3.8806176540490416,3.9441570392077105,3880.6176540490414,{"$f":"ROUND(((L16/(1-$O$6-$O$7-$O$8))-L16),2)","v":1072.31},4952.9276540490409,1965,null,524.08000000000004,null,524.08000000000004,115.04,740.48,1379.6,183,13.309090909090909,1392.9090909090908,4952.9276540490409,6345.8367449581319,null,6345.8367449581319,1392.9090909090908,4952.9276540490409,null,null,"NORDESTE"]
[null,5421.3809856275002,6,null,"Refinaria Capuava (Recap)","Av. Alberto Soares Sampaio, 2122-A Capuava – Mauá - SP","São Paulo","MAUÁ - SP","Montes Claros - MG",3.6434155310820451,3.64899976895637,3643.4155310820452,{"$f":"ROUND(((L17/(1-$O$6-$O$7-$O$8))-L17),2)","v":1006.76},4650.1755310820454,1002,null,280.45,null,280.45,61.56,396.25,738.26,453,32.945454545454545,771.20545454545459,4650.1755310820454,5421.3809856275002,null,5421.3809856275002,771.20545454545459,4650.1755310820454,null,null,"SUDESTE"]
[null,5149.2774717990214,7,null,"Refinaria Duque de Caxias (Reduc)","Rodovia Washington Luiz, km 113,7 Campos Elíseos – Duque de Caxias - RJ CEP:25213-005","Rio de Janeiro","DUQUE DE CAXIAS - RJ","Montes Claros - MG",3.5081465627081125,3.64899976895637,3508.1465627081125,969.39,4477.5365627081128,827,null,236.17,null,236.17,51.84,333.68,621.69000000000005,688.2,50.050909090909094,671.7409090909091,4477.5365627081128,5149.2774717990214,null,5149.2774717990214,671.7409090909091,4477.5365627081128,null,null,"SUDESTE"]
[null,6400.3534703384394,8,null,"Refinaria Alberto Pasqualini (Refap)","Avenida Getúlio Vargas, 11001 - Bairro Brigadeira Canoas - RS - Brasil CEP:92420-221","Rio Grande do Sul","CANOAS - RS","Montes Claros - MG",3.7766189248838939,3.7886056179558163,3776.6189248838941,1043.57,4820.1889248838943,2134,null,566.84,null,566.84,124.42,800.89,1492.15,1210.2,88.014545454545456,1580.1645454545455,4820.1889248838943,6400.3534703384394,null,6400.3534703384394,1580.1645454545455,4820.1889248838943,null,null,"SUL"]
[null,6003.793816962836,9,null,"Unidade de Industrialização do Xisto (SIX)","Rodovia do Xisto, BR 476, km 153 São Mateus do Sul – PR CEP 83900-000","Paraná","SÃO MATEUS DO SUL - PR","Montes Claros - MG",3.799588362417381,3.7886056179558163,3799.5883624173812,1049.92,4849.5083624173812,1539,null,416.31,null,416.31,91.38,588.21,1095.9000000000001,802.8,58.385454545454543,1154.2854545454547,4849.5083624173812,6003.793816962836,null,6003.793816962836,1154.2854545454547,4849.5083624173812,null,null,"SUL"]
[null,5099.8858276478968,10,null,"Refinaria Gabriel Passos (Regap)","Av. Refinaria Gabriel Passos, 690 Distrito Industrial Paulo Camilo Sul Betim - MG CEP:32669-205","Minas Gerais","BETIM - MG","Montes Claros - MG",3.697444009466079,3.64899976895637,3697.444009466079,1021.69,4719.1340094660791,431,null,135.97999999999999,null,135.97999999999999,29.84,192.11,357.93,313.8,22.821818181818184,380.75181818181818,4719.1340094660791,{"$f":"IF(OR(Y21=\"\",Z21=\"\"),\"\",Y21+Z21)","v":5099.8858276478968},null,5099.8858276478968,380.75181818181818,4719.1340094660791,null,null,"SUDESTE"]
[null,5932.8256351446535,11,null,"Refinaria Presidente Getúlio Vargas (Repar)","Rodovia do Xisto, BR 476, km 16 Araucária - PR CEP:83707-440","Paraná","ARAUCÁRIA - PR","Montes Claros - MG",3.799588362417381,3.7886056179558163,3799.5883624173812,1049.92,4849.5083624173812,1440,null,391.26,null,391.26,85.88,552.80999999999995,1029.9499999999998,733.8,53.367272727272727,1083.3172727272724,4849.5083624173812,5932.8256351446535,null,5932.8256351446535,1083.3172727272724,4849.5083624173812,null,null,"SUL"]
[null,5463.5100765365905,12,null,"Refinaria Presidente Bernardes (RPBC)","Av. 9 de abril, 777 - Jardim das Indústrias Cubatão - SP CEP:11505-000","São Paulo","CUBATÃO - SP","Montes Claros - MG",3.6434155310820451,3.64899976895637,3643.4155310820452,1006.76,4650.1755310820454,1041,null,290.31,null,290.31,63.72,410.17,764.2,675.6,49.134545454545453,813.33454545454549,4650.1755310820454,5463.5100765365905,null,5463.5100765365905,813.33454545454549,4650.1755310820454,null,null,"SUDESTE"]
[null,5435.8146219911359,13,null,"Refinaria de Paulínia (Replan)","Rodovia SP 332 - Km. 130 Bonfim - Paulínia – SP CEP:13140-000","São Paulo","PAULÍNIA - SP","Montes Claros - MG",3.6434155310820451,3.64899976895637,3643.4155310820452,1006.76,4650.1755310820454,1021,null,285.25,null,285.25,62.61,403.03,750.89,477.8,34.74909090909091,785.6390909090909,4650.1755310820454,5435.8146219911359,null,5435.8146219911359,785.6390909090909,4650.1755310820454,null,null,"SUDESTE"]
[null,5392.9737129002269,14,null,"Refinaria Henrique Lage (Revap)","Rodovia Presidente Dutra, KM 143, S/N Bairro Jardim Diamante - São José dos Campos – SP CEP:12223-900","São Paulo","SÃO JOSÉ DOS CAMPOS - SP","Montes Claros - MG",3.6434155310820451,3.64899976895637,3643.4155310820452,1006.76,4650.1755310820454,953,null,268.05,null,268.05,58.84,378.73,705.62,511.2,37.17818181818182,742.79818181818177,4650.1755310820454,5392.9737129002269,null,5392.9737129002269,742.79818181818177,4650.1755310820454,null,null,"SUDESTE"]
{"$rows_empty":9}
[null,null,null,"Acre"]
[null,null,null,"Alagoas"]
[null,null,null,"Amapá"]
[null,null,null,"Amazonas"]
[null,null,null,"Bahia"]
[null,null,null,"Ceará"]
[null,null,null,"Distrito Federal"]
[null,null,null,"Espírito Santo"]
[null,null,null,"Goiás"]
[null,null,null,"Maranhão"]
[null,null,null,"Mato Grosso"]
[null,null,null,"Mato Grosso do Sul"]
[null,null,null,"Minas Gerais"]
[null,null,null,"Pará"]
[null,null,null,"Paraíba"]
[null,null,null,"Paraná"]
[null,null,null,"Pernambuco"]
[null,null,null,"Piauí"]
[null,null,null,"Rio de Janeiro"]
[null,null,null,"Rio Grande do Norte"]
[null,null,null,"Rio Grande do Sul"]
[null,null,null,"Rondônia"]
[null,null,null,"Roraima"]
[null,null,null,"Santa Catarina"]
[null,null,null,"São Paulo"]
[null,null,null,"Sergipe"]
[null,null,null,"Tocantins"]
[]
[]
[]
[null,null,null,"ASFALTOS DILUÍDOS CM-30"]
[null,null,null,"ASFALTOS DILUÍDOS CM-70"]
[null,null,null,"ASFALTOS DILUÍDOS CR-250"]
[null,null,null,"ASFALTOS DILUÍDOS CR-70"]
[null,null,null,"CAP MODIFICADO POR BORRACHA DE PNEU AB22"]
[null,null,null,"CAP MODIFICADO POR BORRACHA DE PNEU AB8"]
[null,null,null,"CAP MODIFICADO POR POLÍMERO 55-75-E"]
[null,null,null,"CAP MODIFICADO POR POLÍMERO 60-85-E"]
[null,null,null,"CAP MODIFICADO POR POLÍMERO 65-90-E"]
[null,null,null,"CIMENTOS ASFÁLTICOS CAP-150-200"]
[null,null,null,"CIMENTOS ASFÁLTICOS CAP-30-45"]
[null,null,null,"CIMENTOS ASFÁLTICOS CAP-50-70"]
[null,null,null,"CIMENTOS ASFÁLTICOS CAP-85-100"]
[null,null,null,"EMULSÃO ASFÁLTICA CATIÔNICA DE RUPTURA CONTROLADA PARA SERVIÇO DE LAMA ASFÁLTICA"]
[null,null,null,"EMULSÃO ASFÁLTICA DE RUPTURA LENTA CATIÔNICA PARA SERVIÇO DE LAMA ASFÁLTICA"]
[null,null,null,"EMULSÃO ASFÁLTICA DE RUPTURA LENTA DE CARGA NEUTRA PARA SERVIÇO DE LAMA ASFÁLTICA"]
[null,null,null,"EMULSÃO ASFÁLTICA PARA SERVIÇO DE IMPRIMAÇÃO"]
[null,null,null,"EMULSÕES ASF. MOD. POR POLÍMEROS RC1C-E"]
[null,null,null,"EMULSÕES ASF. MOD. POR POLÍMEROS RL1C-E"]
[null,null,null,"EMULSÕES ASF. MOD. POR POLÍMEROS RM1C-E"]
[null,null,null,"EMULSÕES ASF. MOD. POR POLÍMEROS RR1C-E"]
[null,null,null,"EMULSÕES ASF. MOD. POR POLÍMEROS RR2C-E"]
[null,null,null,"EMULSÕES ASFÁLTICAS RL-1C"]
[null,null,null,"EMULSÕES ASFÁLTICAS RM-1C"]
[null,null,null,"EMULSÕES ASFÁLTICAS RM-2C"]
[null,null,null,"EMULSÕES ASFÁLTICAS RR-1C"]
[null,null,null,"EMULSÕES ASFÁLTICAS RR-2C"]

{"sheet":"MAT.ASF","index":9,"n_rows":33,"n_cols":23,"rows_kept":33,"cut":false,"hidden":false,"merged":[[20,2,25,2],[27,2,32,2],[19,1,19,22],[26,1,26,22],[11,2,12,2],[11,3,11,6],[11,7,11,8],[11,18,11,19],[13,2,18,2],[7,1,7,19],[8,1,10,22],[2,1,2,8],[3,1,3,8],[4,1,4,8],[5,1,5,8],[6,1,6,22]]}
{"$rows_empty":8}
[null,"PLANILHA RESUMO - MATERIAIS ASFÁLTICOS"]
[]
[]
[null,"DATA-BASE","PRODUTOS","LOCALIDADES",null,null,null,"CUSTO ANP (R$/Kg)",null,"CUSTO ANP","IMPOSTOS DO PRODUTO","CUSTO DO PRODUTO COM IMPOSTOS","DMT's","DMT's","CUSTO DO TRANSPORTE TOTAL","ICMS","ATUALIZAÇÃO DO CUSTO DE TRANSPORTE","CUSTO DO TRANSPORTE RODOVIA PAVIMENTADA COM IMPOSTOS E ATUALIZAÇÃO MONETÁRIA","PEDÁGIO ",null,"TOTAL TRANSPORTE","TOTAL PRODUTO","TOTAL GERAL"]
[null,{"$f":"CAP!H9","v":"2024-12-01"},null,"REFINARIAS","ENDEREÇO","ORIGEM - REFINARIAS / DISTRIBUIDORAS","DESTINO","ESTADO","REGIÃO","R$/t","R$/t","R$/t","KM","KM","R$/t","R$/t","R$/t","R$/t","CUSTO POR EIXO","R$/t","R$/t","R$/t","R$/t"]
[null,1,"CAP 50/70","Refinaria Abreu e Lima","Rodovia PE 60, Km 10 - Ipojuca - PE CEP:55590-000",{"$f":"VLOOKUP($W14,CAP!$B:$AA,7,FALSE)","v":"BETIM - MG"},{"$f":"VLOOKUP($W14,CAP!$B:$AA,8,FALSE)","v":"Montes Claros - MG"},{"$f":"VLOOKUP($W14,CAP!$B:$AA,9,FALSE)","v":3.697444009466079},{"$f":"VLOOKUP($W14,CAP!$B:$AA,10,FALSE)","v":3.64899976895637},{"$f":"VLOOKUP($W14,CAP!$B:$AA,11,FALSE)","v":3697.444009466079},{"$f":"VLOOKUP($W14,CAP!$B:$AA,12,FALSE)","v":1021.69},{"$f":"VLOOKUP($W14,CAP!$B:$AA,13,FALSE)","v":4719.1340094660791},{"$f":"VLOOKUP($W14,CAP!$B$13:$AA$25,14,FALSE)","v":431},{"$f":"VLOOKUP($W14,'[2]Transporte Cap 50-70'!$B:$AA,15,FALSE)","v":{"$error":"#N/A"}},{"$f":"VLOOKUP($W14,CAP!$B:$AA,18,FALSE)","v":135.97999999999999},{"$f":"VLOOKUP($W14,CAP!$B:$AA,19,FALSE)","v":29.84},{"$f":"VLOOKUP($W14,CAP!$B:$AA,20,FALSE)","v":192.11},{"$f":"VLOOKUP($W14,CAP!$B:$AA,21,FALSE)","v":357.93},{"$f":"VLOOKUP($W14,CAP!$B:$AA,22,FALSE)","v":313.8},{"$f":"VLOOKUP($W14,CAP!$B:$AA,23,FALSE)","v":22.821818181818184},{"$f":"VLOOKUP($W14,CAP!$B:$AA,24,FALSE)","v":380.75181818181818},{"$f":"VLOOKUP($W14,CAP!$B:$AA,25,FALSE)","v":4719.1340094660791},{"$f":"SMALL(CAP!$AA$13:$AA$25,1)","v":5099.8858276478968}]
[null,2,null,"Refinaria Potiguar Clara Camarão","Rodovia RN 221, KM 25 - Guamaré - RN CEP:59598-000",{"$f":"VLOOKUP($W15,CAP!$B:$AA,7,FALSE)","v":"DUQUE DE CAXIAS - RJ"},{"$f":"VLOOKUP($W15,CAP!$B:$AA,8,FALSE)","v":"Montes Claros - MG"},{"$f":"VLOOKUP($W15,CAP!$B:$AA,9,FALSE)","v":3.5081465627081125},{"$f":"VLOOKUP($W15,CAP!$B:$AA,10,FALSE)","v":3.64899976895637},{"$f":"VLOOKUP($W15,CAP!$B:$AA,11,FALSE)","v":3508.1465627081125},{"$f":"VLOOKUP($W15,CAP!$B:$AA,12,FALSE)","v":969.39},{"$f":"VLOOKUP($W15,CAP!$B:$AA,13,FALSE)","v":4477.5365627081128},{"$f":"VLOOKUP($W15,CAP!$B$13:$AA$25,14,FALSE)","v":827},{"$f":"VLOOKUP($W15,'[2]Transporte Cap 50-70'!$B:$AA,15,FALSE)","v":{"$error":"#N/A"}},{"$f":"VLOOKUP($W15,CAP!$B:$AA,18,FALSE)","v":236.17},{"$f":"VLOOKUP($W15,CAP!$B:$AA,19,FALSE)","v":51.84},{"$f":"VLOOKUP($W15,CAP!$B:$AA,20,FALSE)","v":333.68},{"$f":"VLOOKUP($W15,CAP!$B:$AA,21,FALSE)","v":621.69000000000005},{"$f":"VLOOKUP($W15,CAP!$B:$AA,22,FALSE)","v":688.2},{"$f":"VLOOKUP($W15,CAP!$B:$AA,23,FALSE)","v":50.050909090909094},{"$f":"VLOOKUP($W15,CAP!$B:$AA,24,FALSE)","v":671.7409090909091},{"$f":"VLOOKUP($W15,CAP!$B:$AA,25,FALSE)","v":4477.5365627081128},{"$f":"SMALL(CAP!$AA$13:$AA$25,2)","v":5149.2774717990214}]
[null,3,null,"Complexo Petroquímico do Rio de Janeiro (Comperj)","Rodovia Estadual RJ-116 - Km 5,2 - Acesso A-1, s/n, Complemento Sambaetiba - Zona Urbana do 4º Distrito de Itaboraí - RJ CEP:24841-203",{"$f":"VLOOKUP($W16,CAP!$B:$AA,7,FALSE)","v":"SÃO JOSÉ DOS CAMPOS - SP"},{"$f":"VLOOKUP($W16,CAP!$B:$AA,8,FALSE)","v":"Montes Claros - MG"},{"$f":"VLOOKUP($W16,CAP!$B:$AA,9,FALSE)","v":3.6434155310820451},{"$f":"VLOOKUP($W16,CAP!$B:$AA,10,FALSE)","v":3.64899976895637},{"$f":"VLOOKUP($W16,CAP!$B:$AA,11,FALSE)","v":3643.4155310820452},{"$f":"VLOOKUP($W16,CAP!$B:$AA,12,FALSE)","v":1006.76},{"$f":"VLOOKUP($W16,CAP!$B:$AA,13,FALSE)","v":4650.1755310820454},{"$f":"VLOOKUP($W16,CAP!$B$13:$AA$25,14,FALSE)","v":953},{"$f":"VLOOKUP($W16,'[2]Transporte Cap 50-70'!$B:$AA,15,FALSE)","v":{"$error":"#N/A"}},{"$f":"VLOOKUP($W16,CAP!$B:$AA,18,FALSE)","v":268.05},{"$f":"VLOOKUP($W16,CAP!$B:$AA,19,FALSE)","v":58.84},{"$f":"VLOOKUP($W16,CAP!$B:$AA,20,FALSE)","v":378.73},{"$f":"VLOOKUP($W16,CAP!$B:$AA,21,FALSE)","v":705.62},{"$f":"VLOOKUP($W16,CAP!$B:$AA,22,FALSE)","v":511.2},{"$f":"VLOOKUP($W16,CAP!$B:$AA,23,FALSE)","v":37.17818181818182},{"$f":"VLOOKUP($W16,CAP!$B:$AA,24,FALSE)","v":742.79818181818177},{"$f":"VLOOKUP($W16,CAP!$B:$AA,25,FALSE)","v":4650.1755310820454},{"$f":"SMALL(CAP!$AA$13:$AA$25,3)","v":5392.9737129002269}]
[null,4,null,null,null,{"$f":"VLOOKUP($W17,CAP!$B:$AA,7,FALSE)","v":"MAUÁ - SP"},{"$f":"VLOOKUP($W17,CAP!$B:$AA,8,FALSE)","v":"Montes Claros - MG"},{"$f":"VLOOKUP($W17,CAP!$B:$AA,9,FALSE)","v":3.6434155310820451},{"$f":"VLOOKUP($W17,CAP!$B:$AA,10,FALSE)","v":3.64899976895637},{"$f":"VLOOKUP($W17,CAP!$B:$AA,11,FALSE)","v":3643.4155310820452},{"$f":"VLOOKUP($W17,CAP!$B:$AA,12,FALSE)","v":1006.76},{"$f":"VLOOKUP($W17,CAP!$B:$AA,13,FALSE)","v":4650.1755310820454},{"$f":"VLOOKUP($W17,CAP!$B$13:$AA$25,14,FALSE)","v":1002},{"$f":"VLOOKUP($W17,'[2]Transporte Cap 50-70'!$B:$AA,15,FALSE)","v":{"$error":"#N/A"}},{"$f":"VLOOKUP($W17,CAP!$B:$AA,18,FALSE)","v":280.45},{"$f":"VLOOKUP($W17,CAP!$B:$AA,19,FALSE)","v":61.56},{"$f":"VLOOKUP($W17,CAP!$B:$AA,20,FALSE)","v":396.25},{"$f":"VLOOKUP($W17,CAP!$B:$AA,21,FALSE)","v":738.26},{"$f":"VLOOKUP($W17,CAP!$B:$AA,22,FALSE)","v":453},{"$f":"VLOOKUP($W17,CAP!$B:$AA,23,FALSE)","v":32.945454545454545},{"$f":"VLOOKUP($W17,CAP!$B:$AA,24,FALSE)","v":771.20545454545459},{"$f":"VLOOKUP($W17,CAP!$B:$AA,25,FALSE)","v":4650.1755310820454},{"$f":"SMALL(CAP!$AA$13:$AA$25,4)","v":5421.3809856275002}]
[null,5,null,null,null,{"$f":"VLOOKUP($W18,CAP!$B:$AA,7,FALSE)","v":"PAULÍNIA - SP"},{"$f":"VLOOKUP($W18,CAP!$B:$AA,8,FALSE)","v":"Montes Claros - MG"},{"$f":"VLOOKUP($W18,CAP!$B:$AA,9,FALSE)","v":3.6434155310820451},{"$f":"VLOOKUP($W18,CAP!$B:$AA,10,FALSE)","v":3.64899976895637},{"$f":"VLOOKUP($W18,CAP!$B:$AA,11,FALSE)","v":3643.4155310820452},{"$f":"VLOOKUP($W18,CAP!$B:$AA,12,FALSE)","v":1006.76},{"$f":"VLOOKUP($W18,CAP!$B:$AA,13,FALSE)","v":4650.1755310820454},{"$f":"VLOOKUP($W18,CAP!$B$13:$AA$25,14,FALSE)","v":1021},{"$f":"VLOOKUP($W18,'[2]Transporte Cap 50-70'!$B:$AA,15,FALSE)","v":{"$error":"#N/A"}},{"$f":"VLOOKUP($W18,CAP!$B:$AA,18,FALSE)","v":285.25},{"$f":"VLOOKUP($W18,CAP!$B:$AA,19,FALSE)","v":62.61},{"$f":"VLOOKUP($W18,CAP!$B:$AA,20,FALSE)","v":403.03},{"$f":"VLOOKUP($W18,CAP!$B:$AA,21,FALSE)","v":750.89},{"$f":"VLOOKUP($W18,CAP!$B:$AA,22,FALSE)","v":477.8},{"$f":"VLOOKUP($W18,CAP!$B:$AA,23,FALSE)","v":34.74909090909091},{"$f":"VLOOKUP($W18,CAP!$B:$AA,24,FALSE)","v":785.6390909090909},{"$f":"VLOOKUP($W18,CAP!$B:$AA,25,FALSE)","v":4650.1755310820454},{"$f":"SMALL(CAP!$AA$13:$AA$25,5)","v":5435.8146219911359}]
[null,6,null,null,null,{"$f":"VLOOKUP($W19,CAP!$B:$AA,7,FALSE)","v":"CUBATÃO - SP"},{"$f":"VLOOKUP($W19,CAP!$B:$AA,8,FALSE)","v":"Montes Claros - MG"},{"$f":"VLOOKUP($W19,CAP!$B:$AA,9,FALSE)","v":3.6434155310820451},{"$f":"VLOOKUP($W19,CAP!$B:$AA,10,FALSE)","v":3.64899976895637},{"$f":"VLOOKUP($W19,CAP!$B:$AA,11,FALSE)","v":3643.4155310820452},{"$f":"VLOOKUP($W19,CAP!$B:$AA,12,FALSE)","v":1006.76},{"$f":"VLOOKUP($W19,CAP!$B:$AA,13,FALSE)","v":4650.1755310820454},{"$f":"VLOOKUP($W19,CAP!$B$13:$AA$25,14,FALSE)","v":1041},{"$f":"VLOOKUP($W19,'[2]Transporte Cap 50-70'!$B:$AA,15,FALSE)","v":{"$error":"#N/A"}},{"$f":"VLOOKUP($W19,CAP!$B:$AA,18,FALSE)","v":290.31},{"$f":"VLOOKUP($W19,CAP!$B:$AA,19,FALSE)","v":63.72},{"$f":"VLOOKUP($W19,CAP!$B:$AA,20,FALSE)","v":410.17},{"$f":"VLOOKUP($W19,CAP!$B:$AA,21,FALSE)","v":764.2},{"$f":"VLOOKUP($W19,CAP!$B:$AA,22,FALSE)","v":675.6},{"$f":"VLOOKUP($W19,CAP!$B:$AA,23,FALSE)","v":49.134545454545453},{"$f":"VLOOKUP($W19,CAP!$B:$AA,24,FALSE)","v":813.33454545454549},{"$f":"VLOOKUP($W19,CAP!$B:$AA,25,FALSE)","v":4650.1755310820454},{"$f":"SMALL(CAP!$AA$13:$AA$25,6)","v":5463.5100765365905}]
[]
[null,1,"EMULSÃO ASFÁLTICA PARA IMPRIMAÇÃO (EAI)","Refinaria Abreu e Lima","Rodovia PE 60, Km 10 - Ipojuca - PE CEP:55590-000",{"$f":"VLOOKUP($W21,EAI!$B$13:$AA$24,7,FALSE)","v":"BETIM - MG"},{"$f":"VLOOKUP($W21,EAI!$B$13:$AA$24,8,FALSE)","v":"Pirapora - MG"},{"$f":"VLOOKUP($W21,EAI!$B$13:$AA$24,9,FALSE)","v":"-"},{"$f":"VLOOKUP($W21,EAI!$B$13:$AA$24,10,FALSE)","v":2.5664918076204954},{"$f":"VLOOKUP($W21,EAI!$B$13:$AA$24,11,FALSE)","v":2566.4918076204954},{"$f":"VLOOKUP($W21,EAI!$B$13:$AA$24,12,FALSE)","v":709.18},{"$f":"VLOOKUP($W21,EAI!$B$13:$AA$24,13,FALSE)","v":3275.6718076204952},{"$f":"VLOOKUP($W21,EAI!$B$13:$AA$24,14,FALSE)","v":351},{"$f":"VLOOKUP($W21,'[2]Transporte CM-30'!$B$13:$AA$25,15,FALSE)","v":{"$error":"#N/A"}},{"$f":"VLOOKUP($W21,EAI!$B$13:$AA$24,18,FALSE)","v":115.74},{"$f":"VLOOKUP($W21,EAI!$B$13:$AA$24,19,FALSE)","v":25.4},{"$f":"VLOOKUP($W21,EAI!$B$13:$AA$24,20,FALSE)","v":163.52000000000001},{"$f":"VLOOKUP($W21,EAI!$B$13:$AA$24,21,FALSE)","v":304.65999999999997},{"$f":"VLOOKUP($W21,EAI!$B$13:$AA$24,22,FALSE)","v":148.19999999999999},{"$f":"VLOOKUP($W21,EAI!$B$13:$AA$24,23,FALSE)","v":18.524999999999995},{"$f":"VLOOKUP($W21,EAI!$B$13:$AA$24,24,FALSE)","v":323.18499999999995},{"$f":"VLOOKUP($W21,EAI!$B:$AA,25,FALSE)","v":3275.6718076204952},{"$f":"SMALL(EAI!$AA$13:$AA$24,1)","v":3598.8568076204951}]
[null,2,null,"Refinaria Potiguar Clara Camarão","Rodovia RN 221, KM 25 - Guamaré - RN CEP:59598-000",{"$f":"VLOOKUP($W22,EAI!$B$13:$AA$24,7,FALSE)","v":"DUQUE DE CAXIAS - RJ"},{"$f":"VLOOKUP($W22,EAI!$B$13:$AA$24,8,FALSE)","v":"Pirapora - MG"},{"$f":"VLOOKUP($W22,EAI!$B$13:$AA$24,9,FALSE)","v":"-"},{"$f":"VLOOKUP($W22,EAI!$B$13:$AA$24,10,FALSE)","v":2.5664918076204954},{"$f":"VLOOKUP($W22,EAI!$B$13:$AA$24,11,FALSE)","v":2566.4918076204954},{"$f":"VLOOKUP($W22,EAI!$B$13:$AA$24,12,FALSE)","v":709.18},{"$f":"VLOOKUP($W22,EAI!$B$13:$AA$24,13,FALSE)","v":3275.6718076204952},{"$f":"VLOOKUP($W22,EAI!$B$13:$AA$24,14,FALSE)","v":746},{"$f":"VLOOKUP($W22,'[2]Transporte CM-30'!$B$13:$AA$25,15,FALSE)","v":{"$error":"#N/A"}},{"$f":"VLOOKUP($W22,EAI!$B$13:$AA$24,18,FALSE)","v":215.68},{"$f":"VLOOKUP($W22,EAI!$B$13:$AA$24,19,FALSE)","v":47.34},{"$f":"VLOOKUP($W22,EAI!$B$13:$AA$24,20,FALSE)","v":304.73},{"$f":"VLOOKUP($W22,EAI!$B$13:$AA$24,21,FALSE)","v":567.75},{"$f":"VLOOKUP($W22,EAI!$B$13:$AA$24,22,FALSE)","v":515.4},{"$f":"VLOOKUP($W22,EAI!$B$13:$AA$24,23,FALSE)","v":64.424999999999983},{"$f":"VLOOKUP($W22,EAI!$B$13:$AA$24,24,FALSE)","v":632.17499999999995},{"$f":"VLOOKUP($W22,EAI!$B:$AA,25,FALSE)","v":3275.6718076204952},{"$f":"SMALL(EAI!$AA$13:$AA$24,2)","v":3907.8468076204954}]
[null,3,null,"Complexo Petroquímico do Rio de Janeiro (Comperj)","Rodovia Estadual RJ-116 - Km 5,2 - Acesso A-1, s/n, Complemento Sambaetiba - Zona Urbana do 4º Distrito de Itaboraí - RJ CEP:24841-203",{"$f":"VLOOKUP($W23,EAI!$B$13:$AA$24,7,FALSE)","v":"MAUÁ - SP"},{"$f":"VLOOKUP($W23,EAI!$B$13:$AA$24,8,FALSE)","v":"Pirapora - MG"},{"$f":"VLOOKUP($W23,EAI!$B$13:$AA$24,9,FALSE)","v":2.7498271212823746},{"$f":"VLOOKUP($W23,EAI!$B$13:$AA$24,10,FALSE)","v":2.5664918076204954},{"$f":"VLOOKUP($W23,EAI!$B$13:$AA$24,11,FALSE)","v":2749.8271212823747},{"$f":"VLOOKUP($W23,EAI!$B$13:$AA$24,12,FALSE)","v":759.84},{"$f":"VLOOKUP($W23,EAI!$B$13:$AA$24,13,FALSE)","v":3509.6671212823749},{"$f":"VLOOKUP($W23,EAI!$B$13:$AA$24,14,FALSE)","v":920},{"$f":"VLOOKUP($W23,'[2]Transporte CM-30'!$B$13:$AA$25,15,FALSE)","v":{"$error":"#N/A"}},{"$f":"VLOOKUP($W23,EAI!$B$13:$AA$24,18,FALSE)","v":259.7},{"$f":"VLOOKUP($W23,EAI!$B$13:$AA$24,19,FALSE)","v":57},{"$f":"VLOOKUP($W23,EAI!$B$13:$AA$24,20,FALSE)","v":366.92},{"$f":"VLOOKUP($W23,EAI!$B$13:$AA$24,21,FALSE)","v":683.62},{"$f":"VLOOKUP($W23,EAI!$B$13:$AA$24,22,FALSE)","v":280.2},{"$f":"VLOOKUP($W23,EAI!$B$13:$AA$24,23,FALSE)","v":35.024999999999991},{"$f":"VLOOKUP($W23,EAI!$B$13:$AA$24,24,FALSE)","v":718.64499999999998},{"$f":"VLOOKUP($W23,EAI!$B:$AA,25,FALSE)","v":3509.6671212823749},{"$f":"SMALL(EAI!$AA$13:$AA$24,3)","v":4228.3121212823753}]
[null,4,null,null,null,{"$f":"VLOOKUP($W24,EAI!$B$13:$AA$24,7,FALSE)","v":"SÃO FRANCISCO DO CONDE - BA"},{"$f":"VLOOKUP($W24,EAI!$B$13:$AA$24,8,FALSE)","v":"Pirapora - MG"},{"$f":"VLOOKUP($W24,EAI!$B$13:$AA$24,9,FALSE)","v":"-"},{"$f":"VLOOKUP($W24,EAI!$B$13:$AA$24,10,FALSE)","v":2.6664351178237875},{"$f":"VLOOKUP($W24,EAI!$B$13:$AA$24,11,FALSE)","v":2666.4351178237876},{"$f":"VLOOKUP($W24,EAI!$B$13:$AA$24,12,FALSE)","v":736.8},{"$f":"VLOOKUP($W24,EAI!$B$13:$AA$24,13,FALSE)","v":3403.2351178237877},{"$f":"VLOOKUP($W24,EAI!$B$13:$AA$24,14,FALSE)","v":1116},{"$f":"VLOOKUP($W24,'[2]Transporte CM-30'!$B$13:$AA$25,15,FALSE)","v":{"$error":"#N/A"}},{"$f":"VLOOKUP($W24,EAI!$B$13:$AA$24,18,FALSE)","v":309.29000000000002},{"$f":"VLOOKUP($W24,EAI!$B$13:$AA$24,19,FALSE)","v":67.89},{"$f":"VLOOKUP($W24,EAI!$B$13:$AA$24,20,FALSE)","v":437},{"$f":"VLOOKUP($W24,EAI!$B$13:$AA$24,21,FALSE)","v":814.18000000000006},{"$f":"VLOOKUP($W24,EAI!$B$13:$AA$24,22,FALSE)","v":204},{"$f":"VLOOKUP($W24,EAI!$B$13:$AA$24,23,FALSE)","v":25.499999999999993},{"$f":"VLOOKUP($W24,EAI!$B$13:$AA$24,24,FALSE)","v":839.68000000000006},{"$f":"VLOOKUP($W24,EAI!$B:$AA,25,FALSE)","v":3403.2351178237877},{"$f":"SMALL(EAI!$AA$13:$AA$24,4)","v":4242.915117823788}]
[null,5,null,null,null,{"$f":"VLOOKUP($W25,EAI!$B$13:$AA$24,7,FALSE)","v":"PAULÍNIA - SP"},{"$f":"VLOOKUP($W25,EAI!$B$13:$AA$24,8,FALSE)","v":"Pirapora - MG"},{"$f":"VLOOKUP($W25,EAI!$B$13:$AA$24,9,FALSE)","v":2.7498271212823746},{"$f":"VLOOKUP($W25,EAI!$B$13:$AA$24,10,FALSE)","v":2.5664918076204954},{"$f":"VLOOKUP($W25,EAI!$B$13:$AA$24,11,FALSE)","v":2749.8271212823747},{"$f":"VLOOKUP($W25,EAI!$B$13:$AA$24,12,FALSE)","v":759.84},{"$f":"VLOOKUP($W25,EAI!$B$13:$AA$24,13,FALSE)","v":3509.6671212823749},{"$f":"VLOOKUP($W25,EAI!$B$13:$AA$24,14,FALSE)","v":860},{"$f":"VLOOKUP($W25,'[2]Transporte CM-30'!$B$13:$AA$25,15,FALSE)","v":{"$error":"#N/A"}},{"$f":"VLOOKUP($W25,EAI!$B$13:$AA$24,18,FALSE)","v":244.52},{"$f":"VLOOKUP($W25,EAI!$B$13:$AA$24,19,FALSE)","v":53.67},{"$f":"VLOOKUP($W25,EAI!$B$13:$AA$24,20,FALSE)","v":345.48},{"$f":"VLOOKUP($W25,EAI!$B$13:$AA$24,21,FALSE)","v":643.67000000000007},{"$f":"VLOOKUP($W25,EAI!$B$13:$AA$24,22,FALSE)","v":746.4},{"$f":"VLOOKUP($W25,EAI!$B$13:$AA$24,23,FALSE)","v":93.299999999999983},{"$f":"VLOOKUP($W25,EAI!$B$13:$AA$24,24,FALSE)","v":736.97},{"$f":"VLOOKUP($W25,EAI!$B:$AA,25,FALSE)","v":3509.6671212823749},{"$f":"SMALL(EAI!$AA$13:$AA$24,5)","v":4246.6371212823751}]
[null,6,null,null,null,{"$f":"VLOOKUP($W26,EAI!$B$13:$AA$24,7,FALSE)","v":"CUBATÃO - SP"},{"$f":"VLOOKUP($W26,EAI!$B$13:$AA$24,8,FALSE)","v":"Pirapora - MG"},{"$f":"VLOOKUP($W26,EAI!$B$13:$AA$24,9,FALSE)","v":2.7498271212823746},{"$f":"VLOOKUP($W26,EAI!$B$13:$AA$24,10,FALSE)","v":2.5664918076204954},{"$f":"VLOOKUP($W26,EAI!$B$13:$AA$24,11,FALSE)","v":2749.8271212823747},{"$f":"VLOOKUP($W26,EAI!$B$13:$AA$24,12,FALSE)","v":759.84},{"$f":"VLOOKUP($W26,EAI!$B$13:$AA$24,13,FALSE)","v":3509.6671212823749},{"$f":"VLOOKUP($W26,EAI!$B$13:$AA$24,14,FALSE)","v":961},{"$f":"VLOOKUP($W26,'[2]Transporte CM-30'!$B$13:$AA$25,15,FALSE)","v":{"$error":"#N/A"}},{"$f":"VLOOKUP($W26,EAI!$B$13:$AA$24,18,FALSE)","v":270.07},{"$f":"VLOOKUP($W26,EAI!$B$13:$AA$24,19,FALSE)","v":59.28},{"$f":"VLOOKUP($W26,EAI!$B$13:$AA$24,20,FALSE)","v":381.58},{"$f":"VLOOKUP($W26,EAI!$B$13:$AA$24,21,FALSE)","v":710.93000000000006},{"$f":"VLOOKUP($W26,EAI!$B$13:$AA$24,22,FALSE)","v":280.2},{"$f":"VLOOKUP($W26,EAI!$B$13:$AA$24,23,FALSE)","v":35.024999999999991},{"$f":"VLOOKUP($W26,EAI!$B$13:$AA$24,24,FALSE)","v":745.95500000000004},{"$f":"VLOOKUP($W26,EAI!$B:$AA,25,FALSE)","v":3509.6671212823749},{"$f":"SMALL(EAI!$AA$13:$AA$24,6)","v":4255.6221212823748}]
[]
[null,1,"RR1-C","Refinaria Abreu e Lima","Rodovia PE 60, Km 10 - Ipojuca - PE CEP:55590-000",{"$f":"VLOOKUP($W28,'RR-1C'!$B:$AA,7,FALSE)","v":"SARZEDO - MG"},{"$f":"VLOOKUP($W28,'RR-1C'!$B:$AA,8,FALSE)","v":"Pirapora - MG"},{"$f":"VLOOKUP($W28,'RR-1C'!$B:$AA,9,FALSE)","v":2.7250163919228432},{"$f":"VLOOKUP($W28,'RR-1C'!$B:$AA,10,FALSE)","v":2.7734975034562561},{"$f":"VLOOKUP($W28,'RR-1C'!$B:$AA,11,FALSE)","v":2725.016391922843},{"$f":"VLOOKUP($W28,'RR-1C'!$B:$AA,12,FALSE)","v":752.99},{"$f":"VLOOKUP($W28,'RR-1C'!$B:$AA,13,FALSE)","v":3478.0063919228432},{"$f":"VLOOKUP($W28,'RR-1C'!$B:$AA,14,FALSE)","v":358},{"$f":"VLOOKUP($W28,'[2]Transporte RR-1C'!$B:$AA,15,FALSE)","v":{"$error":"#N/A"}},{"$f":"VLOOKUP($W28,'RR-1C'!$B:$AA,18,FALSE)","v":117.51},{"$f":"VLOOKUP($W28,'RR-1C'!$B:$AA,19,FALSE)","v":25.79},{"$f":"VLOOKUP($W28,'RR-1C'!$B:$AA,20,FALSE)","v":166.02},{"$f":"VLOOKUP($W28,'RR-1C'!$B:$AA,21,FALSE)","v":309.32000000000005},{"$f":"VLOOKUP($W28,'RR-1C'!$B:$AA,22,FALSE)","v":148.19999999999999},{"$f":"VLOOKUP($W28,'RR-1C'!$B:$AA,23,FALSE)","v":29.639999999999997},{"$f":"VLOOKUP($W28,'RR-1C'!$B:$AA,24,FALSE)","v":338.96000000000004},{"$f":"VLOOKUP($W28,'RR-1C'!$B:$AA,25,FALSE)","v":3478.0063919228432},{"$f":"SMALL('RR-1C'!$AA$13:$AA$27,1)","v":3816.9663919228433}]
[null,2,null,"Refinaria Potiguar Clara Camarão","Rodovia RN 221, KM 25 - Guamaré - RN CEP:59598-000",{"$f":"VLOOKUP($W29,'RR-1C'!$B:$AA,7,FALSE)","v":"UBERLANDIA - MG"},{"$f":"VLOOKUP($W29,'RR-1C'!$B:$AA,8,FALSE)","v":"Pirapora - MG"},{"$f":"VLOOKUP($W29,'RR-1C'!$B:$AA,9,FALSE)","v":2.7250163919228432},{"$f":"VLOOKUP($W29,'RR-1C'!$B:$AA,10,FALSE)","v":2.7734975034562561},{"$f":"VLOOKUP($W29,'RR-1C'!$B:$AA,11,FALSE)","v":2725.016391922843},{"$f":"VLOOKUP($W29,'RR-1C'!$B:$AA,12,FALSE)","v":752.99},{"$f":"VLOOKUP($W29,'RR-1C'!$B:$AA,13,FALSE)","v":3478.0063919228432},{"$f":"VLOOKUP($W29,'RR-1C'!$B:$AA,14,FALSE)","v":472},{"$f":"VLOOKUP($W29,'[2]Transporte RR-1C'!$B:$AA,15,FALSE)","v":{"$error":"#N/A"}},{"$f":"VLOOKUP($W29,'RR-1C'!$B:$AA,18,FALSE)","v":146.36000000000001},{"$f":"VLOOKUP($W29,'RR-1C'!$B:$AA,19,FALSE)","v":32.119999999999997},{"$f":"VLOOKUP($W29,'RR-1C'!$B:$AA,20,FALSE)","v":206.78},{"$f":"VLOOKUP($W29,'RR-1C'!$B:$AA,21,FALSE)","v":385.26},{"$f":"VLOOKUP($W29,'RR-1C'!$B:$AA,22,FALSE)","v":152.4},{"$f":"VLOOKUP($W29,'RR-1C'!$B:$AA,23,FALSE)","v":30.48},{"$f":"VLOOKUP($W29,'RR-1C'!$B:$AA,24,FALSE)","v":415.74},{"$f":"VLOOKUP($W29,'RR-1C'!$B:$AA,25,FALSE)","v":3478.0063919228432},{"$f":"SMALL('RR-1C'!$AA$13:$AA$27,2)","v":3893.746391922843}]
[null,3,null,"Complexo Petroquímico do Rio de Janeiro (Comperj)","Rodovia Estadual RJ-116 - Km 5,2 - Acesso A-1, s/n, Complemento Sambaetiba - Zona Urbana do 4º Distrito de Itaboraí - RJ CEP:24841-203",{"$f":"VLOOKUP($W30,'RR-1C'!$B:$AA,7,FALSE)","v":"DUQUE DE CAXIAS - RJ"},{"$f":"VLOOKUP($W30,'RR-1C'!$B:$AA,8,FALSE)","v":"Pirapora - MG"},{"$f":"VLOOKUP($W30,'RR-1C'!$B:$AA,9,FALSE)","v":"-"},{"$f":"VLOOKUP($W30,'RR-1C'!$B:$AA,10,FALSE)","v":2.7734975034562561},{"$f":"VLOOKUP($W30,'RR-1C'!$B:$AA,11,FALSE)","v":2773.4975034562563},{"$f":"VLOOKUP($W30,'RR-1C'!$B:$AA,12,FALSE)","v":766.38},{"$f":"VLOOKUP($W30,'RR-1C'!$B:$AA,13,FALSE)","v":3539.8775034562564},{"$f":"VLOOKUP($W30,'RR-1C'!$B:$AA,14,FALSE)","v":749},{"$f":"VLOOKUP($W30,'[2]Transporte RR-1C'!$B:$AA,15,FALSE)","v":{"$error":"#N/A"}},{"$f":"VLOOKUP($W30,'RR-1C'!$B:$AA,18,FALSE)","v":216.44},{"$f":"VLOOKUP($W30,'RR-1C'!$B:$AA,19,FALSE)","v":47.51},{"$f":"VLOOKUP($W30,'RR-1C'!$B:$AA,20,FALSE)","v":305.81},{"$f":"VLOOKUP($W30,'RR-1C'!$B:$AA,21,FALSE)","v":569.76},{"$f":"VLOOKUP($W30,'RR-1C'!$B:$AA,22,FALSE)","v":515.4},{"$f":"VLOOKUP($W30,'RR-1C'!$B:$AA,23,FALSE)","v":103.08},{"$f":"VLOOKUP($W30,'RR-1C'!$B:$AA,24,FALSE)","v":672.84},{"$f":"VLOOKUP($W30,'RR-1C'!$B:$AA,25,FALSE)","v":3539.8775034562564},{"$f":"SMALL('RR-1C'!$AA$13:$AA$27,3)","v":4212.7175034562561}]
[null,4,null,"Refinaria Abreu e Lima","Rodovia PE 60, Km 10 - Ipojuca - PE CEP:55590-000",{"$f":"VLOOKUP($W31,'RR-1C'!$B:$AA,7,FALSE)","v":"CACAPAVA - SP"},{"$f":"VLOOKUP($W31,'RR-1C'!$B:$AA,8,FALSE)","v":"Pirapora - MG"},{"$f":"VLOOKUP($W31,'RR-1C'!$B:$AA,9,FALSE)","v":2.9298620737986507},{"$f":"VLOOKUP($W31,'RR-1C'!$B:$AA,10,FALSE)","v":2.7734975034562561},{"$f":"VLOOKUP($W31,'RR-1C'!$B:$AA,11,FALSE)","v":2929.8620737986507},{"$f":"VLOOKUP($W31,'RR-1C'!$B:$AA,12,FALSE)","v":809.59},{"$f":"VLOOKUP($W31,'RR-1C'!$B:$AA,13,FALSE)","v":3739.4520737986509},{"$f":"VLOOKUP($W31,'RR-1C'!$B:$AA,14,FALSE)","v":854},{"$f":"VLOOKUP($W31,'[2]Transporte RR-1C'!$B:$AA,15,FALSE)","v":{"$error":"#N/A"}},{"$f":"VLOOKUP($W31,'RR-1C'!$B:$AA,18,FALSE)","v":243},{"$f":"VLOOKUP($W31,'RR-1C'!$B:$AA,19,FALSE)","v":53.34},{"$f":"VLOOKUP($W31,'RR-1C'!$B:$AA,20,FALSE)","v":343.33},{"$f":"VLOOKUP($W31,'RR-1C'!$B:$AA,21,FALSE)","v":639.67000000000007},{"$f":"VLOOKUP($W31,'RR-1C'!$B:$AA,22,FALSE)","v":345.6},{"$f":"VLOOKUP($W31,'RR-1C'!$B:$AA,23,FALSE)","v":69.12},{"$f":"VLOOKUP($W31,'RR-1C'!$B:$AA,24,FALSE)","v":708.79000000000008},{"$f":"VLOOKUP($W31,'RR-1C'!$B:$AA,25,FALSE)","v":3739.4520737986509},{"$f":"SMALL('RR-1C'!$AA$13:$AA$27,4)","v":4448.2420737986513}]
[null,5,null,"Refinaria Potiguar Clara Camarão","Rodovia RN 221, KM 25 - Guamaré - RN CEP:59598-000",{"$f":"VLOOKUP($W32,'RR-1C'!$B:$AA,7,FALSE)","v":"CAIEIRAS - SP"},{"$f":"VLOOKUP($W32,'RR-1C'!$B:$AA,8,FALSE)","v":"Pirapora - MG"},{"$f":"VLOOKUP($W32,'RR-1C'!$B:$AA,9,FALSE)","v":2.9298620737986507},{"$f":"VLOOKUP($W32,'RR-1C'!$B:$AA,10,FALSE)","v":2.7734975034562561},{"$f":"VLOOKUP($W32,'RR-1C'!$B:$AA,11,FALSE)","v":2929.8620737986507},{"$f":"VLOOKUP($W32,'RR-1C'!$B:$AA,12,FALSE)","v":809.59},{"$f":"VLOOKUP($W32,'RR-1C'!$B:$AA,13,FALSE)","v":3739.4520737986509},{"$f":"VLOOKUP($W32,'RR-1C'!$B:$AA,14,FALSE)","v":898},{"$f":"VLOOKUP($W32,'[2]Transporte RR-1C'!$B:$AA,15,FALSE)","v":{"$error":"#N/A"}},{"$f":"VLOOKUP($W32,'RR-1C'!$B:$AA,18,FALSE)","v":254.13},{"$f":"VLOOKUP($W32,'RR-1C'!$B:$AA,19,FALSE)","v":55.78},{"$f":"VLOOKUP($W32,'RR-1C'!$B:$AA,20,FALSE)","v":359.06},{"$f":"VLOOKUP($W32,'RR-1C'!$B:$AA,21,FALSE)","v":668.97},{"$f":"VLOOKUP($W32,'RR-1C'!$B:$AA,22,FALSE)","v":270},{"$f":"VLOOKUP($W32,'RR-1C'!$B:$AA,23,FALSE)","v":54},{"$f":"VLOOKUP($W32,'RR-1C'!$B:$AA,24,FALSE)","v":722.97},{"$f":"VLOOKUP($W32,'RR-1C'!$B:$AA,25,FALSE)","v":3739.4520737986509},{"$f":"SMALL('RR-1C'!$AA$13:$AA$27,5)","v":4462.4220737986507}]
[null,6,null,"Complexo Petroquímico do Rio de Janeiro (Comperj)","Rodovia Estadual RJ-116 - Km 5,2 - Acesso A-1, s/n, Complemento Sambaetiba - Zona Urbana do 4º Distrito de Itaboraí - RJ CEP:24841-203",{"$f":"VLOOKUP($W33,'RR-1C'!$B:$AA,7,FALSE)","v":"MARIALVA - PR"},{"$f":"VLOOKUP($W33,'RR-1C'!$B:$AA,8,FALSE)","v":"Pirapora - MG"},{"$f":"VLOOKUP($W33,'RR-1C'!$B:$AA,9,FALSE)","v":2.6974877614442714},{"$f":"VLOOKUP($W33,'RR-1C'!$B:$AA,10,FALSE)","v":2.7074316133253515},{"$f":"VLOOKUP($W33,'RR-1C'!$B:$AA,11,FALSE)","v":2697.4877614442712},{"$f":"VLOOKUP($W33,'RR-1C'!$B:$AA,12,FALSE)","v":745.38},{"$f":"VLOOKUP($W33,'RR-1C'!$B:$AA,13,FALSE)","v":3442.8677614442713},{"$f":"VLOOKUP($W33,'RR-1C'!$B:$AA,14,FALSE)","v":1196},{"$f":"VLOOKUP($W33,'[2]Transporte RR-1C'!$B:$AA,15,FALSE)","v":{"$error":"#N/A"}},{"$f":"VLOOKUP($W33,'RR-1C'!$B:$AA,18,FALSE)","v":329.53},{"$f":"VLOOKUP($W33,'RR-1C'!$B:$AA,19,FALSE)","v":72.33},{"$f":"VLOOKUP($W33,'RR-1C'!$B:$AA,20,FALSE)","v":465.59},{"$f":"VLOOKUP($W33,'RR-1C'!$B:$AA,21,FALSE)","v":867.44999999999993},{"$f":"VLOOKUP($W33,'RR-1C'!$B:$AA,22,FALSE)","v":798.9},{"$f":"VLOOKUP($W33,'RR-1C'!$B:$AA,23,FALSE)","v":159.78},{"$f":"VLOOKUP($W33,'RR-1C'!$B:$AA,24,FALSE)","v":1027.23},{"$f":"VLOOKUP($W33,'RR-1C'!$B:$AA,25,FALSE)","v":3442.8677614442713},{"$f":"SMALL('RR-1C'!$AA$13:$AA$27,6)","v":4470.0977614442709}]