{"text_format":"2","workbook":"xlsx","n_sheets":5,"sheets":["ORÇAMENTO","CPU","BDI SERV","BDI FORN","CRONOGRAMA"],"not_rendered":{"charts":0,"images":1,"macros":0,"external_links":0,"defined_names":5,"comments":1,"pivot_tables":0},"unopened":[],"bounds":{"document_bytes":16777216,"sheet_cells":100000,"run_cost":"one","rows_first":2000,"rows_last":500,"rows_between":2000,"halvings":0,"cell_chars":16384,"cell_head_chars":4096},"cells_cut":0,"cells_raw":0,"read":"whole","date_system":"1900"}

{"sheet":"ORÇAMENTO","index":0,"n_rows":37,"n_cols":12,"rows_kept":37,"cut":false,"hidden":false,"merged":[[7,1,7,11],[0,0,8,0],[0,4,0,11],[1,4,1,11],[2,4,2,11],[6,1,6,4],[5,2,5,4],[5,8,5,10],[6,8,6,10],[4,2,4,7],[4,8,4,10]]}
["<---- NUMERAR SERVIÇOS PARA CPU",null,null,null,"Ministério da Integração e do Desenvolvimento Regional - MIDR"]
[{"$nulls":4},"Companhia de Desenvolvimento dos Vales do São Francisco e do Parnaíba"]
[{"$nulls":4},"1ª Superintendência Regional"]
[]
[null,"OBRA: "," PAVIMENTAÇÃO ASFÁLTICA EM PMF (PRE-MIST. A FRIO) - RECAPEAMENTO - VIAS DIVERSAS - RUBIM-MG",{"$nulls":5},"BDI Serviços (%):",null,null,{"$f":"'BDI SERV'!D31","v":21.22}]
[null,"DATA:"," NOVEMBRO DE 2024",{"$nulls":5},"BDI Diferenciado Serviços (%):",null,null,{"$f":"'BDI FORN'!D31","v":15}]
[null,"PRAZO DE EXECUÇÃO:    180 DIAS",{"$nulls":6},"BDI Fornecimentos (%):",null,null,{"$f":"'BDI FORN'!D31","v":15}]
[null,"PLANILHA DE ORÇAMENTAÇÃO"]
[null,"ITEM","CÓDIGO","FONTE","DISCRIMINAÇÃO","TIPO","UNID.","QUANT.","VR.UNIT.S/BDI","PR. UNIT.C/BDI","C. TOT.S/BDI","P. TOT.C/BDI"]
["A",1,null,null,"SERVIÇOS PRELIMINARES ",{"$nulls":5},{"$f":"SUM(K11:K14)","v":102765.23000000001},{"$f":"SUM(L11:L14)","v":124571.97}]
[1,"1.1","CPU.1","CODEVASF","MOBILIZAÇÃO E DESMOBILIZAÇÃO","SERV","GL",1,{"$f":"VLOOKUP(A11,CPU!$A$1:$N$4640,9)","v":7227.84},{"$f":"TRUNC(_xlfn.IFS(F11=\"SERV\",I11*(1+$L$5/100),F11=\"SERV DIF\",I11*(1+$L$6/100),F11=\"FORN\",I11*(1+$L$7/100)),2)","v":8761.58},{"$f":"TRUNC(H11*I11,2)","v":7227.84},{"$f":"TRUNC(H11*J11,2)","v":8761.58}]
[2,"1.2","CPU.2","CODEVASF","ADMINISTRAÇÃO LOCAL","SERV","GL",1,{"$f":"VLOOKUP(A12,CPU!$A$1:$N$4640,9)","v":76426.800000000017},{"$f":"TRUNC(_xlfn.IFS(F12=\"SERV\",I12*(1+$L$5/100),F12=\"SERV DIF\",I12*(1+$L$6/100),F12=\"FORN\",I12*(1+$L$7/100)),2)","v":92644.56},{"$f":"TRUNC(H12*I12,2)","v":76426.8},{"$f":"TRUNC(H12*J12,2)","v":92644.56}]
[3,"1.3","CPU.3","CODEVASF","CANTEIRO DE OBRAS","SERV","GL",1,{"$f":"VLOOKUP(A13,CPU!$A$1:$N$4640,9)","v":14567.66},{"$f":"TRUNC(_xlfn.IFS(F13=\"SERV\",I13*(1+$L$5/100),F13=\"SERV DIF\",I13*(1+$L$6/100),F13=\"FORN\",I13*(1+$L$7/100)),2)","v":17658.91},14567.66,17658.91]
[4,"1.4","74209/001","SINAPI","PLACA DE OBRA EM CHAPA DE AÇO GALVANIZADO","SERV","M2",9,{"$f":"VLOOKUP(A14,CPU!$A$1:$N$4640,9)","v":504.77},{"$f":"TRUNC(_xlfn.IFS(F14=\"SERV\",I14*(1+$L$5/100),F14=\"SERV DIF\",I14*(1+$L$6/100),F14=\"FORN\",I14*(1+$L$7/100)),2)","v":611.88},4542.93,{"$f":"TRUNC(H14*J14,2)","v":5506.92}]
["B",2,null,null,"PAVIMENTAÇÃO",{"$nulls":5},{"$f":"SUM(K16:K19)","v":423497.2},{"$f":"SUM(L16:L19)","v":513271.1}]
[10,"2.1",101835,"SINAPI","RECOMPOSIÇÃO DE BASE E OU SUB-BASE PARA REMENDO PROFUNDO DE BICA CORRIDA - INCLUSO RETIRADA E COLOCAÇÃO DO MATERIAL","SERV","M3",30,{"$f":"VLOOKUP(A16,CPU!$A$1:$N$4640,9)","v":349.76000000000005},{"$f":"TRUNC(_xlfn.IFS(F16=\"SERV\",I16*(1+$L$5/100),F16=\"SERV DIF\",I16*(1+$L$6/100),F16=\"FORN\",I16*(1+$L$7/100)),2)","v":423.97},{"$f":"TRUNC(H16*I16,2)","v":10492.8},{"$f":"TRUNC(H16*J16,2)","v":12719.1}]
[11,"2.2",96402,"SINAPI","PINTURA DE LIGAÇÃO COM EMULSÃO ASFÁLTICA RR-1C","SERV","M2",17000,{"$f":"VLOOKUP(A17,CPU!$A$1:$N$4640,9)","v":1.01},{"$f":"TRUNC(_xlfn.IFS(F17=\"SERV\",I17*(1+$L$5/100),F17=\"SERV DIF\",I17*(1+$L$6/100),F17=\"FORN\",I17*(1+$L$7/100)),2)","v":1.22},17170,20740]
[11.5,"2.3",101001,"SINAPI","CARGA DE MISTURA ASFÁLTICA EM CAMINHÃO BASCULANTE","SERV","T",2099.9999999999995,{"$f":"VLOOKUP(A18,CPU!$A$1:$N$4640,9)","v":5.03},{"$f":"TRUNC(_xlfn.IFS(F18=\"SERV\",I18*(1+$L$5/100),F18=\"SERV DIF\",I18*(1+$L$6/100),F18=\"FORN\",I18*(1+$L$7/100)),2)","v":6.09},10563,12789]
[12,"2.4",104371,"SINAPI","EXECUÇÃO DE PAVIMENTO COM APLICAÇÃO DE PRÉ-MISTURADO A FRIO, CAMADA DE ROLAMENTO - EXCLUSIVE TRANSPORTE","SERV","M3",860,{"$f":"VLOOKUP(A19,CPU!$A$1:$N$4640,9)","v":447.99},{"$f":"TRUNC(_xlfn.IFS(F19=\"SERV\",I19*(1+$L$5/100),F19=\"SERV DIF\",I19*(1+$L$6/100),F19=\"FORN\",I19*(1+$L$7/100)),2)","v":543.04999999999995},385271.4,467023]
["C",3,null,null,"TRANSPORTE DE MATERIAIS",{"$nulls":5},{"$f":"SUM(K21:K22)","v":55020},{"$f":"SUM(L21:L22)","v":66610}]
[14,"3.1",95427,"SINAPI","TRANSPORTE COM CAMINHÃO BASCULANTE, EM VIA URBANA PAVIMENTADA","SERV","M3XKM",44000.004255999993,{"$f":"VLOOKUP(A21,CPU!$A$1:$N$4640,9,0)","v":0.76},{"$f":"TRUNC(_xlfn.IFS(F21=\"SERV\",I21*(1+$L$5/100),F21=\"SERV DIF\",I21*(1+$L$6/100),F21=\"FORN\",I21*(1+$L$7/100)),2)","v":0.92},{"$f":"TRUNC(H21*I21,2)","v":33440},{"$f":"TRUNC(H21*J21,2)","v":40480}]
[14.5,"3.2",95426,"SINAPI","TRANSPORTE COM CAMINHÃO BASCULANTE, EM VIA DE REVESTIMENTO PRIMÁRIO","SERV","M3XKM",13000.000852799996,{"$f":"VLOOKUP(A22,CPU!$A$1:$N$4640,9,0)","v":1.66},{"$f":"TRUNC(_xlfn.IFS(F22=\"SERV\",I22*(1+$L$5/100),F22=\"SERV DIF\",I22*(1+$L$6/100),F22=\"FORN\",I22*(1+$L$7/100)),2)","v":2.0099999999999998},21580,26130]
["E",4,null,null,"OBRAS COMPLEMENTARES",{"$nulls":5},{"$f":"SUM(K24:K29)","v":257086.91999999998},{"$f":"SUM(L24:L29)","v":311524.67}]
[15,"4.1","94287a","SINAPI","EXECUÇÃO DE SARJETA DE CONCRETO USINADO, MOLDADA  IN LOCO  EM TRECHO RETO, 30 CM BASE X 5 CM ALTURA","SERV","M",4000,{"$f":"VLOOKUP(A24,CPU!$A$1:$N$4640,9,0)","v":22.450000000000003},{"$f":"TRUNC(_xlfn.IFS(F24=\"SERV\",I24*(1+$L$5/100),F24=\"SERV DIF\",I24*(1+$L$6/100),F24=\"FORN\",I24*(1+$L$7/100)),2)","v":27.21},{"$f":"TRUNC(H24*I24,2)","v":89800},{"$f":"TRUNC(H24*J24,2)","v":108840}]
[16,"4.2","CPU.4","CODEVASF","FORNECIMENTO E INSTALAÇÃO DE PLACA DE SINALIZAÇÃO VIÁRIA - REGULAMENTAÇÃO (FAIXA DE PEDESTRE E OUTROS) - CONFORME PROJETO","SERV","UNID",45,{"$f":"VLOOKUP(A25,CPU!$A$1:$N$4640,9,0)","v":484.70000000000005},{"$f":"TRUNC(_xlfn.IFS(F25=\"SERV\",I25*(1+$L$5/100),F25=\"SERV DIF\",I25*(1+$L$6/100),F25=\"FORN\",I25*(1+$L$7/100)),2)","v":587.54999999999995},21811.5,26439.75]
[17,"4.3","CPU.5","CODEVASF","FORNECIMENTO E INSTALAÇÃO DE PLACA DE SINALIZAÇÃO VIÁRIA - REGULAMENTAÇÃO (PARE)","SERV","UNID",35,{"$f":"VLOOKUP(A26,CPU!$A$1:$N$4640,9,0)","v":478.54},{"$f":"TRUNC(_xlfn.IFS(F26=\"SERV\",I26*(1+$L$5/100),F26=\"SERV DIF\",I26*(1+$L$6/100),F26=\"FORN\",I26*(1+$L$7/100)),2)","v":580.08000000000004},16748.900000000001,20302.8]
[18,"4.4",102512,"SINAPI","PINTURA DE EIXO VIÁRIO SOBRE ASFALTO COM TINTA RETRORREFLETIVA A BASE DE RESINA ACRÍLICA COM MICROESFERAS DE VIDRO, APLICAÇÃO MECÂNICA COM DEMARCADORA AUTOPROPELIDA - ESPESSURA DE 0,10 MM","SERV","M",12300,{"$f":"VLOOKUP(A27,CPU!$A$1:$N$4640,9,0)","v":6.4},{"$f":"TRUNC(_xlfn.IFS(F27=\"SERV\",I27*(1+$L$5/100),F27=\"SERV DIF\",I27*(1+$L$6/100),F27=\"FORN\",I27*(1+$L$7/100)),2)","v":7.75},78720,95325]
[19,"4.5",102509,"SINAPI","PINTURA DE FAIXA DE PEDESTRE OU ZEBRADA TINTA RETRORREFLETIVA A BASE DE RESINA ACRÍLICA COM MICROESFERAS DE VIDRO, E = 30 CM, APLICAÇÃO MANUAL","SERV","M2",1200,{"$f":"VLOOKUP(A28,CPU!$A$1:$N$4640,9,0)","v":32.99},{"$f":"TRUNC(_xlfn.IFS(F28=\"SERV\",I28*(1+$L$5/100),F28=\"SERV DIF\",I28*(1+$L$6/100),F28=\"FORN\",I28*(1+$L$7/100)),2)","v":39.99},39588,47988]
[20,"4.6","CPU.6","CODEVASF","FORNECIMENTO E INSTALAÇÃO DE PLACA DE AÇO PARA IDENTIFICACAO DE RUA, *45 CM X 20* CM, INCLUSIVE SUPORTE EM TUBO DE AÇO GALVANIZADO (02 PLACAS POR SUPORTE)                      ","SERV","UN.",28,{"$f":"VLOOKUP(A29,CPU!$A$1:$N$4640,9,0)","v":372.09000000000003},{"$f":"TRUNC(_xlfn.IFS(F29=\"SERV\",I29*(1+$L$5/100),F29=\"SERV DIF\",I29*(1+$L$6/100),F29=\"FORN\",I29*(1+$L$7/100)),2)","v":451.04},10418.52,12629.12]
["F",5,null,null,"TRANSPORTE DE MATERIAL ASFÁLTICO (BDI DIFERENCIADO)",{"$nulls":5},{"$f":"SUM(K31:K33)","v":106069.99},{"$f":"SUM(L31:L33)","v":121709.99}]
[21,"5.1",102331,"SINAPI","TRANSPORTE COM CAMINHÃO TANQUE DE TRANSPORTE DE MATERIAL ASFÁLTICO DE 30000 L, EM VIA URBANA PREDOMINANTEMENTE PAVIMENTADA","SERV DIF","TXKM",138999.99599999998,{"$f":"VLOOKUP(A31,CPU!$A$1:$N$4640,9,0)","v":0.54},{"$f":"TRUNC(_xlfn.IFS(F31=\"SERV\",I31*(1+$L$5/100),F31=\"SERV DIF\",I31*(1+$L$6/100),F31=\"FORN\",I31*(1+$L$7/100)),2)","v":0.62},{"$f":"TRUNC(H31*I31,2)","v":75059.990000000005},{"$f":"TRUNC(H31*J31,2)","v":86179.99}]
[22,"5.2",95880,"SINAPI","TRANSPORTE COM CAMINHÃO BASCULANTE EM VIA URBANA PAVIMENTADA - MASSA ASFÁLTICA (PMF)","SERV DIF","TXKM",6000,{"$f":"VLOOKUP(A32,CPU!$A$1:$N$4640,9,0)","v":0.99},{"$f":"TRUNC(_xlfn.IFS(F32=\"SERV\",I32*(1+$L$5/100),F32=\"SERV DIF\",I32*(1+$L$6/100),F32=\"FORN\",I32*(1+$L$7/100)),2)","v":1.1299999999999999},5940,6780]
[23,"5.3",95429,"SINAPI","TRANSPORTE COM CAMINHÃO BASCULANTE, EM VIA DE REVESTIMENTO PRIMÁRIO - MASSA ASFÁLTICA (PMF)","SERV DIF","TXKM",22999.999999999996,{"$f":"VLOOKUP(A33,CPU!$A$1:$N$4640,9,0)","v":1.0900000000000001},{"$f":"TRUNC(_xlfn.IFS(F33=\"SERV\",I33*(1+$L$5/100),F33=\"SERV DIF\",I33*(1+$L$6/100),F33=\"FORN\",I33*(1+$L$7/100)),2)","v":1.25},25070,28750]
["G",6,null,null,"FORNECIMENTOS - MATERIAL ASFÁLTICO (BDI DIFERENCIADO)",{"$nulls":5},{"$f":"SUM(K35:K36)","v":581077},{"$f":"SUM(L35:L36)","v":668237.27}]
[24,"6.1","CPU.7","ANP","AQUISIÇÃO DE EMULSAO ASFALTICA CATIONICA RR-1C - EXCLUSIVE TRANSPORTE","FORN","T",8,{"$f":"VLOOKUP(A35,CPU!$A$1:$N$4640,9,0)","v":3253.92},{"$f":"TRUNC(_xlfn.IFS(F35=\"SERV\",I35*(1+$L$5/100),F35=\"SERV DIF\",I35*(1+$L$6/100),F35=\"FORN\",I35*(1+$L$7/100)),2)","v":3742},{"$f":"TRUNC(H35*I35,2)","v":26031.360000000001},{"$f":"TRUNC(H35*J35,2)","v":29936}]
[25,"6.2","CPU.8","ANP","AQUISIÇÃO DE EMULSAO ASFALTICA CATIONICA RL-1C  - EXCLUSIVE TRANSPORTE","FORN","T",161.99799999999999,{"$f":"VLOOKUP(A36,CPU!$A$1:$N$4640,9,0)","v":3426.25},{"$f":"TRUNC(_xlfn.IFS(F36=\"SERV\",I36*(1+$L$5/100),F36=\"SERV DIF\",I36*(1+$L$6/100),F36=\"FORN\",I36*(1+$L$7/100)),2)","v":3940.18},{"$f":"TRUNC(H36*I36,2)","v":555045.64},638301.27]
[{"$nulls":4},"TOTAL GERAL",{"$nulls":5},{"$f":"SUM(K10,K15,K20,K23,K30,K34)","v":1525516.34},{"$f":"SUM(L10,L15,L20,L23,L30,L34)","v":1805925}]

{"sheet":"CPU","index":1,"n_rows":337,"n_cols":13,"rows_kept":337,"cut":false,"hidden":false,"merged":[[302,1,302,6],[96,0,108,0],[96,1,96,3],[96,4,96,7],[96,10,96,11],[97,2,97,5],[98,2,98,3],[99,1,99,7],[104,1,104,3],[104,5,104,6],[105,1,105,6],[106,1,106,6],[107,1,107,6],[243,1,243,6],[276,1,276,6],[277,1,277,6],[278,1,278,6],[263,0,279,0],[246,0,262,0],[260,1,260,6],[261,1,261,6],[263,1,263,3],[263,4,263,7],[264,2,264,5],[265,2,265,3],[266,1,266,7],[275,1,275,3],[275,5,275,6],[246,1,246,3],[246,4,246,7],[247,2,247,5],[248,2,248,3],[249,1,249,7],[258,1,258,3],[258,5,258,6],[259,1,259,6],[49,1,49,7],[178,10,178,11],[178,1,178,3],[178,4,178,7],[192,1,192,6],[128,1,128,6],[129,1,129,6],[151,1,151,3],[131,1,131,3],[131,4,131,7],[132,2,132,5],[133,2,133,3],[134,1,134,7],[109,10,109,11],[151,5,151,6],[152,1,152,6],[126,1,126,3],[126,5,126,6],[109,4,109,7],[114,8,114,9],[78,10,78,11],[78,1,78,3],[78,4,78,7],[58,1,58,3],[14,10,14,11],[15,2,15,5],[16,2,16,3],[17,1,17,7],[27,1,27,3],[27,5,27,6],[15,8,16,9],[46,10,46,11],[47,2,47,5],[28,1,28,6],[29,1,29,6],[30,1,30,6],[32,1,32,3],[32,4,32,7],[44,1,44,6],[46,1,46,3],[46,4,46,7],[32,10,32,11],[33,2,33,5],[34,2,34,3],[35,1,35,7],[33,8,34,9],[41,1,41,3],[41,5,41,6],[0,10,0,11],[1,2,1,5],[2,2,2,3],[3,1,3,7],[9,1,9,3],[9,5,9,6],[10,1,10,6],[1,10,1,11],[11,1,11,6],[60,1,60,6],[61,1,61,6],[63,10,63,11],[64,2,64,5],[63,1,63,3],[63,4,63,7],[109,0,129,0],[110,2,110,5],[111,2,111,3],[112,1,112,7],[91,1,91,3],[91,5,91,6],[92,1,92,6],[93,1,93,6],[94,1,94,6],[127,1,127,6],[109,1,109,3],[80,2,80,3],[79,2,79,5],[0,0,13,0],[14,0,31,0],[32,0,45,0],[46,0,62,0],[63,0,77,0],[78,0,95,0],[48,2,48,3],[81,1,81,7],[65,2,65,3],[66,1,66,7],[73,1,73,3],[73,5,73,6],[74,1,74,6],[75,1,75,6],[76,1,76,6],[0,1,0,3],[0,4,0,7],[12,1,12,6],[14,1,14,3],[14,4,14,7],[42,1,42,6],[43,1,43,6],[58,5,58,6],[59,1,59,6],[154,0,164,0],[154,1,154,3],[154,4,154,7],[155,2,155,5],[156,2,156,3],[157,1,157,7],[164,1,164,6],[161,1,161,3],[161,5,161,6],[162,1,162,6],[163,1,163,6],[280,4,280,7],[289,1,289,6],[290,1,290,6],[288,1,288,6],[280,0,290,0],[304,0,314,0],[304,1,304,3],[304,4,304,7],[178,0,192,0],[180,2,180,3],[181,1,181,7],[189,1,189,3],[189,5,189,6],[190,1,190,6],[191,1,191,6],[179,2,179,5],[228,1,228,3],[244,1,244,6],[229,2,229,5],[230,2,230,3],[231,1,231,7],[241,1,241,3],[241,5,241,6],[242,1,242,6],[282,2,282,3],[283,1,283,7],[327,0,336,0],[327,1,327,3],[327,4,327,7],[328,2,328,5],[329,2,329,3],[330,1,330,7],[333,1,333,3],[333,5,333,6],[334,1,334,6],[335,1,335,6],[336,1,336,6],[287,5,287,6],[292,0,302,0],[292,1,292,3],[292,4,292,7],[293,2,293,5],[294,2,294,3],[295,1,295,7],[299,1,299,3],[299,5,299,6],[300,1,300,6],[301,1,301,6],[211,0,227,0],[228,0,244,0],[305,2,305,5],[306,2,306,3],[307,1,307,7],[311,1,311,3],[325,1,325,6],[287,1,287,3],[323,1,323,6],[324,1,324,6],[316,0,325,0],[316,1,316,3],[316,4,316,7],[317,2,317,5],[318,2,318,3],[319,1,319,7],[322,1,322,3],[322,5,322,6],[311,5,311,6],[312,1,312,6],[313,1,313,6],[314,1,314,6],[280,1,280,3],[281,2,281,5],[228,4,228,7],[196,2,196,3],[197,1,197,7],[206,1,206,3],[206,5,206,6],[207,1,207,6],[208,1,208,6],[211,1,211,3],[211,4,211,7],[212,2,212,5],[213,2,213,3],[214,1,214,7],[223,1,223,3],[223,5,223,6],[224,1,224,6],[225,1,225,6],[226,1,226,6],[173,5,173,6],[174,1,174,6],[175,1,175,6],[176,1,176,6],[166,1,166,3],[166,4,166,7],[194,0,210,0],[209,1,209,6],[194,1,194,3],[194,4,194,7],[195,2,195,5],[166,0,177,0],[167,2,167,5],[168,2,168,3],[169,1,169,7],[173,1,173,3]]}
[1,"CODEVASF",null,null," COMPOSIÇÃO DE PREÇO UNITÁRIO",null,null,null,{"$f":"H11","v":7227.84},{"$f":"H13","v":8761.58},"BDI CALCULADO:",null,{"$f":"ORÇAMENTO!L5/100","v":0.2122}]
[null,"OBRA:  ",{"$f":"ORÇAMENTO!C5","v":" PAVIMENTAÇÃO ASFÁLTICA EM PMF (PRE-MIST. A FRIO) - RECAPEAMENTO - VIAS DIVERSAS - RUBIM-MG"},null,null,null,"DATA: ",{"$f":"ORÇAMENTO!C6","v":" NOVEMBRO DE 2024"},null,null,"BDI DIFERENCIADO:",null,{"$f":"'BDI FORN'!D31/100","v":0.15}]
[null,"SERVIÇO:  ",{"$f":"VLOOKUP(A1,ORÇAMENTO!A11:L24,5)","v":"MOBILIZAÇÃO E DESMOBILIZAÇÃO"},null,"REFERÊNCIA",{"$f":"VLOOKUP(A1,ORÇAMENTO!A$11:L$37,3,0)","v":"CPU.1"},"UNIDADE: ",{"$f":"VLOOKUP(A1,ORÇAMENTO!A11:L24,7,0)","v":"GL"}]
[]
[null,"TIPO ITEM","CODIGO ITEM","DESCRIÇÃO ITEM","UNIDADE ITEM","COEFICIENTE","PRECO UNITARIO","CUSTO TOTAL"]
[null,"COMPOSICAO",5824,"CAMINHÃO TOCO, PBT 16.000 KG, CARGA ÚTIL MÁX. 10.685 KG, DIST. ENTRE EIXOS 4,8 M, POTÊNCIA 189 CV, INCLUSIVE CARROCERIA FIXA ABERTA DE MADEIRA P/ TRANSPORTE GERAL DE CARGA SECA, DIMEN. APROX. 2,5 X 7,00 X 0,50 M","CHP DIURNO.",6,213.06,{"$f":"ROUNDDOWN(F6*G6,2)","v":1278.3599999999999}]
[null,"COMPOSICAO",5826,"CAMINHÃO TOCO, PBT 16.000 KG, CARGA ÚTIL MÁX. 10.685 KG, DIST. ENTRE EIXOS 4,8 M, POTÊNCIA 189 CV, INCLUSIVE CARROCERIA FIXA ABERTA DE MADEIRA P/ TRANSPORTE GERAL DE CARGA SECA, DIMEN. APROX. 2,5 X 7,00 X 0,50 M","CHI DIURNO.",4,62.14,{"$f":"ROUNDDOWN(F7*G7,2)","v":248.56}]
[null,"COMPOSICAO",5914640,"TRANSPORTE COM CAVALO MECÂNICO COM SEMIRREBOQUE COM CAPACIDADE DE 30 T - RODOVIA PAVIMENTADA","T.KM",3176,0.57999999999999996,{"$f":"ROUNDDOWN(F8*G8,2)","v":1842.08}]
[null,"COMPOSIÇÃO",88316,"SERVENTE COM ENCARGOS COMPLEMENTARES","H",12,20.41,{"$f":"ROUNDDOWN(F9*G9,2)","v":244.92}]
[null,"PRODUÇÃO DA EQUIPE",null,null,0.5,"CUSTO ",null,{"$f":"SUM(H6:H9)","v":3613.92}]
[null,"TOTAL",{"$nulls":5},{"$f":"H10/E10","v":7227.84},"Ok"]
[null,"BDI                %",{"$nulls":5},{"$f":"1+$M$1","v":1.2121999999999999}]
[null,"TOTAL DO SERVIÇO - R$",{"$nulls":5},{"$f":"TRUNC(H11*H12,2)","v":8761.58}]
[]
[{"$f":"A1+1","v":2},"CODEVASF",null,null," COMPOSIÇÃO DE PREÇO UNITÁRIO",null,null,null,{"$f":"H29","v":76426.800000000017},{"$f":"H31","v":92644.56}]
[null,"OBRA:  ",{"$f":"$C$2","v":" PAVIMENTAÇÃO ASFÁLTICA EM PMF (PRE-MIST. A FRIO) - RECAPEAMENTO - VIAS DIVERSAS - RUBIM-MG"},null,null,null,"DATA: ",{"$f":"$H$2","v":" NOVEMBRO DE 2024"}]
[null,"SERVIÇO:  ",{"$f":"VLOOKUP(A15,ORÇAMENTO!$A$11:$L$24,5)","v":"ADMINISTRAÇÃO LOCAL"},null,"REFERÊNCIA",{"$f":"VLOOKUP(A15,ORÇAMENTO!A$11:L$37,3,0)","v":"CPU.2"},"UNIDADE: ",{"$f":"VLOOKUP(A15,ORÇAMENTO!$A$11:$L$24,7,0)","v":"GL"}]
[]
[null,"TIPO ITEM","CODIGO ITEM","DESCRIÇÃO ITEM","UNIDADE ITEM","COEFICIENTE","PRECO UNITARIO","CUSTO TOTAL"]
[null,"INSUMO",14250,"ENERGIA ELÉTRICA","kwh",60,1.06,{"$f":"ROUNDDOWN(F20*G20,2)","v":63.6}]
[null,"INSUMO",44480,"TARIFA \"A\" - ÁGUA/ESGOTO ","m³",6,20.05,120.3]
[null,"COTAÇÃO","MERC.","TELEFONE (PLANO CONTROLE)","UNID",2,59.9,119.8]
[null,"INSUMO","ED-50155 SEINFRA","BANHEIRO QUÍMICO 110 X 120 X 230 CM COM MANUTENÇÃO","MÊS",1,820,820]
[null,"COMPOSICAO",90777,"Engenheiro Civil Júnior com encargos complementares","H",25,118.01,2950.25]
[null,"COMPOSICAO",90776,"Encarregado Geral com encargos complementares","H",110,55.15,6066.5]
[null,"COMPOSICAO",88321,"Tecnico de Laboratório com encargos complementares","H",55,38.07,2093.85]
[null,"COMPOSICAO",90772,"Auxiliar de escritório com encargos complementares","H",25,20.14,503.5]
[null,"PRODUÇÃO DA EQUIPE",null,null,{"$f":"1/6","v":0.16666666666666666},"CUSTO ",null,{"$f":"SUM(H20:H27)","v":12737.800000000001}]
[null,"TOTAL",{"$nulls":5},{"$f":"H28/E28","v":76426.800000000017},"Ok"]
[null,"BDI                %",{"$nulls":5},{"$f":"1+$M$1","v":1.2121999999999999}]
[null,"TOTAL DO SERVIÇO - R$",{"$nulls":5},{"$f":"TRUNC(H29*H30,2)","v":92644.56}]
[]
[{"$f":"A15+1","v":3},"CODEVASF",null,null," COMPOSIÇÃO DE PREÇO UNITÁRIO",null,null,null,{"$f":"H43","v":14567.66},{"$f":"H45","v":17658.91}]
[null,"OBRA:  ",{"$f":"$C$2","v":" PAVIMENTAÇÃO ASFÁLTICA EM PMF (PRE-MIST. A FRIO) - RECAPEAMENTO - VIAS DIVERSAS - RUBIM-MG"},null,null,null,"DATA: ",{"$f":"$H$2","v":" NOVEMBRO DE 2024"}]
[null,"SERVIÇO:  ",{"$f":"VLOOKUP(A33,ORÇAMENTO!$A$11:$L$24,5)","v":"CANTEIRO DE OBRAS"},null,"REFERÊNCIA",{"$f":"VLOOKUP(A33,ORÇAMENTO!A$11:L$37,3,0)","v":"CPU.3"},"UNIDADE: ",{"$f":"VLOOKUP(A33,ORÇAMENTO!$A$11:$L$24,7,0)","v":"GL"}]
[]
[null,"TIPO ITEM","CODIGO ITEM","DESCRIÇÃO ITEM","UNIDADE ITEM","COEFICIENTE","PRECO UNITARIO","CUSTO TOTAL"]
[null,"INSUMO",10775,"ALUGUEL DE IMÓVEL OU CONTEINER QUE ATENDA AOS REQUISITOS MÍNIMOS PARA INSTALAÇÃO DO CANTEIRO DE OBRAS","MÊS",6,920,{"$f":"ROUNDDOWN(F38*G38,2)","v":5520}]
[null,"INSUMO",10779,"LOCACAO DE CONTAINER 2,30 X 4,30 M, ALT. 2,50 M, P/ SANITARIO, C/ 5 BACIAS, 1 LAVATORIO E 4 MICTORIOS","MÊS",6,1062.5,{"$f":"ROUNDDOWN(F39*G39,2)","v":6375}]
[null,"INSUMO","37525","TELA PLASTICA TECIDA LISTRADA BRANCA E LARANJA, TIPO GUARDA CORPO, EM POLIETILENO MONOFILADO, ROLO 1,20 X 50 M (L X C)","M",100,2.7266262401356061,{"$f":"ROUNDDOWN(F40*G40,2)","v":272.66000000000003}]
{"$rows_left_out":298}
{"sheet":"BDI SERV","index":2,"n_rows":37,"n_cols":5,"rows_kept":37,"cut":false,"hidden":false,"merged":[[36,0,36,5],[3,1,4,1],[3,2,4,2],[0,1,2,4],[32,0,34,5],[28,0,28,5],[30,1,30,2],[31,1,31,2]]}
[null,"DETALHAMENTO DO BDI - SERVIÇOS"]
[]
[]
[null,"Item","Descrição dos Serviços","%","%"]
[null,null,null,"PV","CD"]
[]
[null,1,"ADMINISTRAÇÃO CENTRAL"," ",4.01]
[null,"1.1","ESCRITÓRIO CENTRAL"," "," "]
[null,"1.2","VIAGENS"," "," "]
[null,"1.3","OUTROS"," "," "]
[null," "," "," "," "]
[null,2,"IMPOSTOS E TAXAS",{"$f":"SUM(D13:D16)","v":5.65},{"$f":"SUM(E13:E16)","v":7.0600000000000005}]
[null,"2.1","ISS (*)",2,{"$f":"ROUND(D13*1.2515,2)","v":2.5}]
[null,"2.2","PIS",0.65,0.81]
[null,"2.3","Cofins",3,3.75]
[null,"2.4","CONTRIBUIÇÃO PREVIDENCIÁRIA SOBRE A RENDA BRUTA",0,0]
[]
[null,3,"TAXA DE RISCO"," ",{"$f":"SUM(E19:E22)","v":0.82000000000000006}]
[null,"3.1","SEGURO",null,0.16]
[null,"3.2","RISCO",null,0.5]
[null,"3.3","GARANTIA",null,0.16]
[]
[null,4,"DESPESAS FINANCEIRAS"," ",1.02]
[]
[null,5,"LUCRO",null,8]
[]
[null," ","BDI - CALCULADO"," ",{"$f":"ROUND((((1+(E7+E18)/100)*(1+E23/100)*(1+E25/100)/(1-D12/100)-1)*100),2)","v":21.22}]
[]
["BDI = ((1+((AC+S+R+G)/100))x(1+DF/100)x(1+L/100)/(1-I/100)-1)*100"]
[]
[null,"BDI (CALCULADO):",null,{"$f":"ROUND((((1+((E7+E18)/100))*(1+E23/100)*(1+E25/100))/(1-D12/100)-1)*100,2)","v":21.22},"%"]
[null," "]
["(*) ISS CONFORME DECLARAÇÃO ENVIADA PELA PREFEITURA MUNICIPAL DE RUBIM"]
[]
[]
[]
["BDI EM CONFORMIDADE COM OS ACÓRDÃOS Nº 2369/2011 e ACÓRDÃO Nº 2.622/2013 - TCU - PLENÁRIO"]

{"sheet":"BDI FORN","index":3,"n_rows":37,"n_cols":5,"rows_kept":37,"cut":false,"hidden":false,"merged":[[32,0,34,5],[36,0,36,5],[0,1,2,4],[3,1,4,1],[3,2,4,2],[28,0,28,5],[30,1,30,2],[31,1,31,2]]}
[null,"DETALHAMENTO DO BDI - FORNECIMENTO \n(MATERIAL ASFÁLTICO)"]
[]
[]
[null,"Item","Descrição dos Serviços","%","%"]
[null,null,null,"PV","CD"]
[]
[null,1,"ADMINISTRAÇÃO CENTRAL"," ",3.72]
[null,"1.1","ESCRITÓRIO CENTRAL"," "," "]
[null,"1.2","VIAGENS"," "," "]
[null,"1.3","OUTROS"," "," "]
[null," "," "," "," "]
[null,2,"IMPOSTOS E TAXAS",{"$f":"SUM(D13:D16)","v":3.65},{"$f":"SUM(E13:E16)","v":4.5600000000000005}]
[null,"2.1","ISS (*)",null,{"$f":"ROUND(D13*1.2515,2)","v":0}]
[null,"2.2","PIS",0.65,0.81]
[null,"2.3","Cofins",3,3.75]
[null,"2.4","CONTRIBUIÇÃO PREVIDENCIÁRIA SOBRE A RENDA BRUTA",0,0]
[]
[null,3,"TAXA DE RISCO"," ",{"$f":"SUM(E19:E22)","v":0.92}]
[null,"3.1","SEGURO",null,0.16]
[null,"3.2","RISCO",null,0.6]
[null,"3.3","GARANTIA",null,0.16]
[]
[null,4,"DESPESAS FINANCEIRAS"," ",0.85]
[]
[null,5,"LUCRO",null,5]
[]
[null," ","BDI - CALCULADO"," ",{"$f":"ROUND((((1+(E7+E18)/100)*(1+E23/100)*(1+E25/100)/(1-D12/100)-1)*100),2)","v":15}]
[]
["BDI = ((1+((AC+S+R+G)/100))x(1+DF/100)x(1+L/100)/(1-I/100)-1)*100"]
[]
[null,"BDI (CALCULADO):",null,{"$f":"ROUND((((1+((E7+E18)/100))*(1+E23/100)*(1+E25/100))/(1-D12/100)-1)*100,2)","v":15},"%"]
[null," "]
[]
[]
[]
[]
["BDI EM CONFORMIDADE COM OS ACÓRDÃOS Nº 2369/2011 e ACÓRDÃO Nº 2.622/2013 - TCU - PLENÁRIO"]

{"sheet":"CRONOGRAMA","index":4,"n_rows":21,"n_cols":12,"rows_kept":21,"cut":false,"hidden":false,"merged":[[7,0,8,0],[9,0,10,0],[11,0,12,0],[0,1,0,11],[1,6,1,11],[2,6,2,11],[3,1,3,6],[5,0,6,0],[5,2,6,2],[1,1,2,1],[5,1,6,1],[1,2,2,4],[7,2,8,2],[9,2,10,2],[11,2,12,2],[7,1,8,1],[20,1,24,11],[9,1,10,1],[11,1,12,1],[15,1,16,1],[15,2,16,2],[15,0,16,0],[13,1,14,1],[13,0,14,0],[13,2,14,2],[17,1,18,2]]}
[null,"CRONOGRAMA FÍSICO-FINANCEIRO"]
[null,"OBRA: ",{"$f":"ORÇAMENTO!C5","v":" PAVIMENTAÇÃO ASFÁLTICA EM PMF (PRE-MIST. A FRIO) - RECAPEAMENTO - VIAS DIVERSAS - RUBIM-MG"},null,null,"VALOR:",{"$f":"ORÇAMENTO!L37","v":1805925}]
[{"$nulls":5},"PRAZO: ","180 DIAS "]
[]
[null,"ITEM","ETAPAS/DESCRIÇAO","FISICO/  FINANCEIRO","TOTAL    ETAPAS","MÊS 1","MÊS 2","MÊS 3","MÊS 4","MÊS 5","MÊS 6","TOTAL"]
["A",{"$f":"VLOOKUP(A6,ORÇAMENTO!$A$10:$L$37,2)","v":1},{"$f":"VLOOKUP(A6,ORÇAMENTO!$A$10:$L$37,5)","v":"SERVIÇOS PRELIMINARES "},"FISICO ",{"$f":"ROUND(E7/$G$2,4)","v":6.9000000000000006E-2},0.25,0.15,0.15,0.15,0.15,0.15,{"$f":"SUM(F6:K6)","v":1}]
[null,null,null,"FINANCEIRO",{"$f":"ORÇAMENTO!L10","v":124571.97},{"$f":"ROUND($E$7*F6,2)","v":31142.99},{"$f":"ROUND($E$7*G6,2)","v":18685.8},18685.8,18685.8,18685.8,18685.8,{"$f":"SUM(F7:K7)","v":124571.99}]
["B",{"$f":"VLOOKUP(A8,ORÇAMENTO!$A$10:$L$37,2)","v":2},{"$f":"VLOOKUP(A8,ORÇAMENTO!$A$10:$L$37,5)","v":"PAVIMENTAÇÃO"},"FISICO ",{"$f":"ROUND(E9/$G$2,4)","v":0.28420000000000001},0.2,0.2,0.2,0.2,0.2,0,{"$f":"SUM(F8:K8)","v":1}]
[null,null,null,"FINANCEIRO",{"$f":"ORÇAMENTO!L15","v":513271.1},{"$f":"ROUND($E$9*F8,2)","v":102654.22},{"$f":"ROUND($E$9*G8,2)","v":102654.22},102654.22,102654.22,102654.22,0,513271.1]
["C",{"$f":"VLOOKUP(A10,ORÇAMENTO!$A$10:$L$37,2)","v":3},{"$f":"VLOOKUP(A10,ORÇAMENTO!$A$10:$L$37,5)","v":"TRANSPORTE DE MATERIAIS"},"FISICO ",{"$f":"ROUND(E11/$G$2,4)","v":3.6900000000000002E-2},0.2,0.2,0.2,0.2,0.2,0,1]
[null,null,null,"FINANCEIRO",{"$f":"ORÇAMENTO!L20","v":66610},{"$f":"ROUND($E$11*F10,2)","v":13322},{"$f":"ROUND($E$11*G10,2)","v":13322},13322,13322,13322,0,66610]
["E",{"$f":"VLOOKUP(A12,ORÇAMENTO!$A$10:$L$37,2)","v":4},{"$f":"VLOOKUP(A12,ORÇAMENTO!$A$10:$L$37,5)","v":"OBRAS COMPLEMENTARES"},"FISICO ",{"$f":"ROUND(E13/$G$2,4)","v":0.17249999999999999},0,0.2,0.2,0.2,0.2,0.2,1]
[null,null,null,"FINANCEIRO",{"$f":"ORÇAMENTO!L23","v":311524.67},{"$f":"ROUND($E$13*F12,2)","v":0},{"$f":"ROUND($E$13*G12,2)","v":62304.93},62304.93,62304.93,62304.93,62304.93,311524.65000000002]
["F",{"$f":"VLOOKUP(A14,ORÇAMENTO!$A$10:$L$37,2)","v":5},{"$f":"VLOOKUP(A14,ORÇAMENTO!$A$10:$L$37,5)","v":"TRANSPORTE DE MATERIAL ASFÁLTICO (BDI DIFERENCIADO)"},"FISICO ",{"$f":"ROUND(E15/$G$2,4)","v":6.7400000000000002E-2},0.25,0.25,0.25,0.25,0,0,1]
[null,null,null,"FINANCEIRO",{"$f":"ORÇAMENTO!L30","v":121709.99},{"$f":"ROUND($E$15*F14,2)","v":30427.5},{"$f":"ROUND($E$15*G14,2)","v":30427.5},{"$f":"ROUND($E$15*H14,2)","v":30427.5},30427.5,0,0,121710]
["G",{"$f":"VLOOKUP(A16,ORÇAMENTO!$A$10:$L$37,2)","v":6},{"$f":"VLOOKUP(A16,ORÇAMENTO!$A$10:$L$37,5)","v":"FORNECIMENTOS - MATERIAL ASFÁLTICO (BDI DIFERENCIADO)"},"FISICO ",{"$f":"ROUND(E17/$G$2,4)","v":0.37},0.25,0.25,0.25,0.25,0,0,1]
[null,null,null,"FINANCEIRO",{"$f":"ORÇAMENTO!L34","v":668237.27},{"$f":"ROUND($E$17*F16,2)","v":167059.32},{"$f":"ROUND($E$17*G16,2)","v":167059.32},{"$f":"ROUND($E$17*H16,2)","v":167059.32},167059.32,0,0,668237.28]
[null,"TOTAL",null,"FISICO ",{"$f":"SUM(F18:K18)","v":1.0000000110746572},{"$f":"F19/E19","v":0.19081967966554536},{"$f":"G19/E19","v":0.21842201088085053},{"$f":"H19/E19","v":0.21842201088085053},{"$f":"I19/E19","v":0.21842201088085053},{"$f":"J19/E19","v":0.10906707089164831},{"$f":"K19/E19","v":4.4847227874911744E-2},1.0000000110746572]
[null,null,null,"FINANCEIRO",{"$f":"E11+E9+E7+E13+E17+E15","v":1805925},{"$f":"F11+F9+F7+F13+F17+F15","v":344606.03},{"$f":"G11+G9+G7+G13+G17+G15","v":394453.77},{"$f":"H11+H9+H7+H13+H17+H15","v":394453.77},394453.77,196966.94999999998,80990.73,{"$f":"SUM(F19:K19)-0.02","v":1805925}]
[]
[null,"OBSERVAÇÕES:"]